[clang] [clang][OSTargets] Only predefine `__gnu_linux__` on *-linux-gnu (PR #227243)
via cfe-commits
cfe-commits at lists.llvm.org
Tue Sep 29 03:49:42 PDT 2026
github-actions[bot] wrote:
<!--PREMERGE ADVISOR COMMENT: Windows-->
# :window: Windows x64 Test Results
* 56658 tests passed
* 1673 tests skipped
* 4 tests failed
## Failed Tests
(click on a test name to see its output)
### Clang
<details>
<summary>Clang.Preprocessor/hexagon-predefines.c</summary>
```
Exit Code: 1
Command Output (stdout):
--
# RUN: at line 1
c:\_work\llvm-project\llvm-project\build\bin\clang.exe -cc1 -internal-isystem C:\_work\llvm-project\llvm-project\build\lib\clang\24\include -nostdsysteminc -E -dM -triple hexagon-unknown-elf -target-cpu hexagonv5 C:\_work\llvm-project\llvm-project\clang\test\Preprocessor\hexagon-predefines.c | c:\_work\llvm-project\llvm-project\build\bin\filecheck.exe C:\_work\llvm-project\llvm-project\clang\test\Preprocessor\hexagon-predefines.c -check-prefix CHECK-V5
# executed command: 'c:\_work\llvm-project\llvm-project\build\bin\clang.exe' -cc1 -internal-isystem 'C:\_work\llvm-project\llvm-project\build\lib\clang\24\include' -nostdsysteminc -E -dM -triple hexagon-unknown-elf -target-cpu hexagonv5 'C:\_work\llvm-project\llvm-project\clang\test\Preprocessor\hexagon-predefines.c'
# note: command had no output on stdout or stderr
# executed command: 'c:\_work\llvm-project\llvm-project\build\bin\filecheck.exe' 'C:\_work\llvm-project\llvm-project\clang\test\Preprocessor\hexagon-predefines.c' -check-prefix CHECK-V5
# note: command had no output on stdout or stderr
# RUN: at line 8
c:\_work\llvm-project\llvm-project\build\bin\clang.exe -cc1 -internal-isystem C:\_work\llvm-project\llvm-project\build\lib\clang\24\include -nostdsysteminc -E -dM -triple hexagon-unknown-elf -target-cpu hexagonv55 C:\_work\llvm-project\llvm-project\clang\test\Preprocessor\hexagon-predefines.c | c:\_work\llvm-project\llvm-project\build\bin\filecheck.exe C:\_work\llvm-project\llvm-project\clang\test\Preprocessor\hexagon-predefines.c -check-prefix CHECK-V55
# executed command: 'c:\_work\llvm-project\llvm-project\build\bin\clang.exe' -cc1 -internal-isystem 'C:\_work\llvm-project\llvm-project\build\lib\clang\24\include' -nostdsysteminc -E -dM -triple hexagon-unknown-elf -target-cpu hexagonv55 'C:\_work\llvm-project\llvm-project\clang\test\Preprocessor\hexagon-predefines.c'
# note: command had no output on stdout or stderr
# executed command: 'c:\_work\llvm-project\llvm-project\build\bin\filecheck.exe' 'C:\_work\llvm-project\llvm-project\clang\test\Preprocessor\hexagon-predefines.c' -check-prefix CHECK-V55
# note: command had no output on stdout or stderr
# RUN: at line 15
c:\_work\llvm-project\llvm-project\build\bin\clang.exe -cc1 -internal-isystem C:\_work\llvm-project\llvm-project\build\lib\clang\24\include -nostdsysteminc -E -dM -triple hexagon-unknown-elf -target-cpu hexagonv60 C:\_work\llvm-project\llvm-project\clang\test\Preprocessor\hexagon-predefines.c | c:\_work\llvm-project\llvm-project\build\bin\filecheck.exe C:\_work\llvm-project\llvm-project\clang\test\Preprocessor\hexagon-predefines.c -check-prefix CHECK-V60
# executed command: 'c:\_work\llvm-project\llvm-project\build\bin\clang.exe' -cc1 -internal-isystem 'C:\_work\llvm-project\llvm-project\build\lib\clang\24\include' -nostdsysteminc -E -dM -triple hexagon-unknown-elf -target-cpu hexagonv60 'C:\_work\llvm-project\llvm-project\clang\test\Preprocessor\hexagon-predefines.c'
# note: command had no output on stdout or stderr
# executed command: 'c:\_work\llvm-project\llvm-project\build\bin\filecheck.exe' 'C:\_work\llvm-project\llvm-project\clang\test\Preprocessor\hexagon-predefines.c' -check-prefix CHECK-V60
# note: command had no output on stdout or stderr
# RUN: at line 22
c:\_work\llvm-project\llvm-project\build\bin\clang.exe -cc1 -internal-isystem C:\_work\llvm-project\llvm-project\build\lib\clang\24\include -nostdsysteminc -E -dM -triple hexagon-unknown-elf -target-cpu hexagonv62 C:\_work\llvm-project\llvm-project\clang\test\Preprocessor\hexagon-predefines.c | c:\_work\llvm-project\llvm-project\build\bin\filecheck.exe C:\_work\llvm-project\llvm-project\clang\test\Preprocessor\hexagon-predefines.c -check-prefix CHECK-V62
# executed command: 'c:\_work\llvm-project\llvm-project\build\bin\clang.exe' -cc1 -internal-isystem 'C:\_work\llvm-project\llvm-project\build\lib\clang\24\include' -nostdsysteminc -E -dM -triple hexagon-unknown-elf -target-cpu hexagonv62 'C:\_work\llvm-project\llvm-project\clang\test\Preprocessor\hexagon-predefines.c'
# note: command had no output on stdout or stderr
# executed command: 'c:\_work\llvm-project\llvm-project\build\bin\filecheck.exe' 'C:\_work\llvm-project\llvm-project\clang\test\Preprocessor\hexagon-predefines.c' -check-prefix CHECK-V62
# note: command had no output on stdout or stderr
# RUN: at line 29
c:\_work\llvm-project\llvm-project\build\bin\clang.exe -cc1 -internal-isystem C:\_work\llvm-project\llvm-project\build\lib\clang\24\include -nostdsysteminc -E -dM -triple hexagon-unknown-elf -target-cpu hexagonv65 C:\_work\llvm-project\llvm-project\clang\test\Preprocessor\hexagon-predefines.c | c:\_work\llvm-project\llvm-project\build\bin\filecheck.exe C:\_work\llvm-project\llvm-project\clang\test\Preprocessor\hexagon-predefines.c -check-prefix CHECK-V65
# executed command: 'c:\_work\llvm-project\llvm-project\build\bin\clang.exe' -cc1 -internal-isystem 'C:\_work\llvm-project\llvm-project\build\lib\clang\24\include' -nostdsysteminc -E -dM -triple hexagon-unknown-elf -target-cpu hexagonv65 'C:\_work\llvm-project\llvm-project\clang\test\Preprocessor\hexagon-predefines.c'
# note: command had no output on stdout or stderr
# executed command: 'c:\_work\llvm-project\llvm-project\build\bin\filecheck.exe' 'C:\_work\llvm-project\llvm-project\clang\test\Preprocessor\hexagon-predefines.c' -check-prefix CHECK-V65
# note: command had no output on stdout or stderr
# RUN: at line 36
c:\_work\llvm-project\llvm-project\build\bin\clang.exe -cc1 -internal-isystem C:\_work\llvm-project\llvm-project\build\lib\clang\24\include -nostdsysteminc -E -dM -triple hexagon-unknown-elf -target-cpu hexagonv66 C:\_work\llvm-project\llvm-project\clang\test\Preprocessor\hexagon-predefines.c | c:\_work\llvm-project\llvm-project\build\bin\filecheck.exe C:\_work\llvm-project\llvm-project\clang\test\Preprocessor\hexagon-predefines.c -check-prefix CHECK-V66
# executed command: 'c:\_work\llvm-project\llvm-project\build\bin\clang.exe' -cc1 -internal-isystem 'C:\_work\llvm-project\llvm-project\build\lib\clang\24\include' -nostdsysteminc -E -dM -triple hexagon-unknown-elf -target-cpu hexagonv66 'C:\_work\llvm-project\llvm-project\clang\test\Preprocessor\hexagon-predefines.c'
# note: command had no output on stdout or stderr
# executed command: 'c:\_work\llvm-project\llvm-project\build\bin\filecheck.exe' 'C:\_work\llvm-project\llvm-project\clang\test\Preprocessor\hexagon-predefines.c' -check-prefix CHECK-V66
# note: command had no output on stdout or stderr
# RUN: at line 46
c:\_work\llvm-project\llvm-project\build\bin\clang.exe -cc1 -internal-isystem C:\_work\llvm-project\llvm-project\build\lib\clang\24\include -nostdsysteminc -E -dM -triple hexagon-unknown-elf -target-cpu hexagonv60 -target-feature +hvxv60 -target-feature +hvx-length64b C:\_work\llvm-project\llvm-project\clang\test\Preprocessor\hexagon-predefines.c | c:\_work\llvm-project\llvm-project\build\bin\filecheck.exe C:\_work\llvm-project\llvm-project\clang\test\Preprocessor\hexagon-predefines.c -check-prefix CHECK-V60HVX-64B
# executed command: 'c:\_work\llvm-project\llvm-project\build\bin\clang.exe' -cc1 -internal-isystem 'C:\_work\llvm-project\llvm-project\build\lib\clang\24\include' -nostdsysteminc -E -dM -triple hexagon-unknown-elf -target-cpu hexagonv60 -target-feature +hvxv60 -target-feature +hvx-length64b 'C:\_work\llvm-project\llvm-project\clang\test\Preprocessor\hexagon-predefines.c'
# note: command had no output on stdout or stderr
# executed command: 'c:\_work\llvm-project\llvm-project\build\bin\filecheck.exe' 'C:\_work\llvm-project\llvm-project\clang\test\Preprocessor\hexagon-predefines.c' -check-prefix CHECK-V60HVX-64B
# note: command had no output on stdout or stderr
# RUN: at line 57
c:\_work\llvm-project\llvm-project\build\bin\clang.exe -cc1 -internal-isystem C:\_work\llvm-project\llvm-project\build\lib\clang\24\include -nostdsysteminc -E -dM -triple hexagon-unknown-elf -target-cpu hexagonv60 -target-feature +hvxv60 -target-feature +hvx-length128b C:\_work\llvm-project\llvm-project\clang\test\Preprocessor\hexagon-predefines.c | c:\_work\llvm-project\llvm-project\build\bin\filecheck.exe C:\_work\llvm-project\llvm-project\clang\test\Preprocessor\hexagon-predefines.c -check-prefix CHECK-V60HVX-128B
# executed command: 'c:\_work\llvm-project\llvm-project\build\bin\clang.exe' -cc1 -internal-isystem 'C:\_work\llvm-project\llvm-project\build\lib\clang\24\include' -nostdsysteminc -E -dM -triple hexagon-unknown-elf -target-cpu hexagonv60 -target-feature +hvxv60 -target-feature +hvx-length128b 'C:\_work\llvm-project\llvm-project\clang\test\Preprocessor\hexagon-predefines.c'
# note: command had no output on stdout or stderr
# executed command: 'c:\_work\llvm-project\llvm-project\build\bin\filecheck.exe' 'C:\_work\llvm-project\llvm-project\clang\test\Preprocessor\hexagon-predefines.c' -check-prefix CHECK-V60HVX-128B
# note: command had no output on stdout or stderr
# RUN: at line 68
c:\_work\llvm-project\llvm-project\build\bin\clang.exe -cc1 -internal-isystem C:\_work\llvm-project\llvm-project\build\lib\clang\24\include -nostdsysteminc -E -dM -triple hexagon-unknown-elf -target-cpu hexagonv66 -target-feature +hvxv66 -target-feature +hvx-length64b C:\_work\llvm-project\llvm-project\clang\test\Preprocessor\hexagon-predefines.c | c:\_work\llvm-project\llvm-project\build\bin\filecheck.exe C:\_work\llvm-project\llvm-project\clang\test\Preprocessor\hexagon-predefines.c -check-prefix CHECK-V66HVX-64B
# executed command: 'c:\_work\llvm-project\llvm-project\build\bin\clang.exe' -cc1 -internal-isystem 'C:\_work\llvm-project\llvm-project\build\lib\clang\24\include' -nostdsysteminc -E -dM -triple hexagon-unknown-elf -target-cpu hexagonv66 -target-feature +hvxv66 -target-feature +hvx-length64b 'C:\_work\llvm-project\llvm-project\clang\test\Preprocessor\hexagon-predefines.c'
# note: command had no output on stdout or stderr
# executed command: 'c:\_work\llvm-project\llvm-project\build\bin\filecheck.exe' 'C:\_work\llvm-project\llvm-project\clang\test\Preprocessor\hexagon-predefines.c' -check-prefix CHECK-V66HVX-64B
# note: command had no output on stdout or stderr
# RUN: at line 79
c:\_work\llvm-project\llvm-project\build\bin\clang.exe -cc1 -internal-isystem C:\_work\llvm-project\llvm-project\build\lib\clang\24\include -nostdsysteminc -E -dM -triple hexagon-unknown-elf -target-cpu hexagonv66 -target-feature +hvxv66 -target-feature +hvx-length128b C:\_work\llvm-project\llvm-project\clang\test\Preprocessor\hexagon-predefines.c | c:\_work\llvm-project\llvm-project\build\bin\filecheck.exe C:\_work\llvm-project\llvm-project\clang\test\Preprocessor\hexagon-predefines.c -check-prefix CHECK-V66HVX-128B
# executed command: 'c:\_work\llvm-project\llvm-project\build\bin\clang.exe' -cc1 -internal-isystem 'C:\_work\llvm-project\llvm-project\build\lib\clang\24\include' -nostdsysteminc -E -dM -triple hexagon-unknown-elf -target-cpu hexagonv66 -target-feature +hvxv66 -target-feature +hvx-length128b 'C:\_work\llvm-project\llvm-project\clang\test\Preprocessor\hexagon-predefines.c'
# note: command had no output on stdout or stderr
# executed command: 'c:\_work\llvm-project\llvm-project\build\bin\filecheck.exe' 'C:\_work\llvm-project\llvm-project\clang\test\Preprocessor\hexagon-predefines.c' -check-prefix CHECK-V66HVX-128B
# note: command had no output on stdout or stderr
# RUN: at line 90
c:\_work\llvm-project\llvm-project\build\bin\clang.exe -cc1 -internal-isystem C:\_work\llvm-project\llvm-project\build\lib\clang\24\include -nostdsysteminc -E -dM -triple hexagon-unknown-elf -target-cpu hexagonv67 -target-feature +hvxv67 -target-feature +hvx-length128b C:\_work\llvm-project\llvm-project\clang\test\Preprocessor\hexagon-predefines.c | c:\_work\llvm-project\llvm-project\build\bin\filecheck.exe C:\_work\llvm-project\llvm-project\clang\test\Preprocessor\hexagon-predefines.c -check-prefix CHECK-V67HVX-128B
# executed command: 'c:\_work\llvm-project\llvm-project\build\bin\clang.exe' -cc1 -internal-isystem 'C:\_work\llvm-project\llvm-project\build\lib\clang\24\include' -nostdsysteminc -E -dM -triple hexagon-unknown-elf -target-cpu hexagonv67 -target-feature +hvxv67 -target-feature +hvx-length128b 'C:\_work\llvm-project\llvm-project\clang\test\Preprocessor\hexagon-predefines.c'
# note: command had no output on stdout or stderr
# executed command: 'c:\_work\llvm-project\llvm-project\build\bin\filecheck.exe' 'C:\_work\llvm-project\llvm-project\clang\test\Preprocessor\hexagon-predefines.c' -check-prefix CHECK-V67HVX-128B
# note: command had no output on stdout or stderr
# RUN: at line 100
c:\_work\llvm-project\llvm-project\build\bin\clang.exe -cc1 -internal-isystem C:\_work\llvm-project\llvm-project\build\lib\clang\24\include -nostdsysteminc -E -dM -triple hexagon-unknown-elf -target-cpu hexagonv68 -target-feature +hvxv68 -target-feature +hvx-length128b C:\_work\llvm-project\llvm-project\clang\test\Preprocessor\hexagon-predefines.c | c:\_work\llvm-project\llvm-project\build\bin\filecheck.exe C:\_work\llvm-project\llvm-project\clang\test\Preprocessor\hexagon-predefines.c -check-prefix CHECK-V68HVX-128B
# executed command: 'c:\_work\llvm-project\llvm-project\build\bin\clang.exe' -cc1 -internal-isystem 'C:\_work\llvm-project\llvm-project\build\lib\clang\24\include' -nostdsysteminc -E -dM -triple hexagon-unknown-elf -target-cpu hexagonv68 -target-feature +hvxv68 -target-feature +hvx-length128b 'C:\_work\llvm-project\llvm-project\clang\test\Preprocessor\hexagon-predefines.c'
# note: command had no output on stdout or stderr
# executed command: 'c:\_work\llvm-project\llvm-project\build\bin\filecheck.exe' 'C:\_work\llvm-project\llvm-project\clang\test\Preprocessor\hexagon-predefines.c' -check-prefix CHECK-V68HVX-128B
# note: command had no output on stdout or stderr
# RUN: at line 111
c:\_work\llvm-project\llvm-project\build\bin\clang.exe -cc1 -internal-isystem C:\_work\llvm-project\llvm-project\build\lib\clang\24\include -nostdsysteminc -E -dM -triple hexagon-unknown-elf -target-cpu hexagonv68 -target-feature +hvxv68 -target-feature +hvx-length128b -target-feature +hvx-ieee-fp C:\_work\llvm-project\llvm-project\clang\test\Preprocessor\hexagon-predefines.c | c:\_work\llvm-project\llvm-project\build\bin\filecheck.exe C:\_work\llvm-project\llvm-project\clang\test\Preprocessor\hexagon-predefines.c -check-prefix CHECK-V68HVX-IEEE-FP
# executed command: 'c:\_work\llvm-project\llvm-project\build\bin\clang.exe' -cc1 -internal-isystem 'C:\_work\llvm-project\llvm-project\build\lib\clang\24\include' -nostdsysteminc -E -dM -triple hexagon-unknown-elf -target-cpu hexagonv68 -target-feature +hvxv68 -target-feature +hvx-length128b -target-feature +hvx-ieee-fp 'C:\_work\llvm-project\llvm-project\clang\test\Preprocessor\hexagon-predefines.c'
# note: command had no output on stdout or stderr
# executed command: 'c:\_work\llvm-project\llvm-project\build\bin\filecheck.exe' 'C:\_work\llvm-project\llvm-project\clang\test\Preprocessor\hexagon-predefines.c' -check-prefix CHECK-V68HVX-IEEE-FP
# note: command had no output on stdout or stderr
# RUN: at line 123
c:\_work\llvm-project\llvm-project\build\bin\clang.exe -cc1 -internal-isystem C:\_work\llvm-project\llvm-project\build\lib\clang\24\include -nostdsysteminc -E -dM -triple hexagon-unknown-elf -target-cpu hexagonv69 -target-feature +hvxv69 -target-feature +hvx-length128b C:\_work\llvm-project\llvm-project\clang\test\Preprocessor\hexagon-predefines.c | c:\_work\llvm-project\llvm-project\build\bin\filecheck.exe C:\_work\llvm-project\llvm-project\clang\test\Preprocessor\hexagon-predefines.c -check-prefix CHECK-V69HVX-128B
# executed command: 'c:\_work\llvm-project\llvm-project\build\bin\clang.exe' -cc1 -internal-isystem 'C:\_work\llvm-project\llvm-project\build\lib\clang\24\include' -nostdsysteminc -E -dM -triple hexagon-unknown-elf -target-cpu hexagonv69 -target-feature +hvxv69 -target-feature +hvx-length128b 'C:\_work\llvm-project\llvm-project\clang\test\Preprocessor\hexagon-predefines.c'
# note: command had no output on stdout or stderr
# executed command: 'c:\_work\llvm-project\llvm-project\build\bin\filecheck.exe' 'C:\_work\llvm-project\llvm-project\clang\test\Preprocessor\hexagon-predefines.c' -check-prefix CHECK-V69HVX-128B
# note: command had no output on stdout or stderr
# RUN: at line 133
c:\_work\llvm-project\llvm-project\build\bin\clang.exe -cc1 -internal-isystem C:\_work\llvm-project\llvm-project\build\lib\clang\24\include -nostdsysteminc -E -dM -triple hexagon-unknown-elf -target-cpu hexagonv71 -target-feature +hvxv71 -target-feature +hvx-length128b C:\_work\llvm-project\llvm-project\clang\test\Preprocessor\hexagon-predefines.c | c:\_work\llvm-project\llvm-project\build\bin\filecheck.exe C:\_work\llvm-project\llvm-project\clang\test\Preprocessor\hexagon-predefines.c -check-prefix CHECK-V71HVX-128B
# executed command: 'c:\_work\llvm-project\llvm-project\build\bin\clang.exe' -cc1 -internal-isystem 'C:\_work\llvm-project\llvm-project\build\lib\clang\24\include' -nostdsysteminc -E -dM -triple hexagon-unknown-elf -target-cpu hexagonv71 -target-feature +hvxv71 -target-feature +hvx-length128b 'C:\_work\llvm-project\llvm-project\clang\test\Preprocessor\hexagon-predefines.c'
# note: command had no output on stdout or stderr
# executed command: 'c:\_work\llvm-project\llvm-project\build\bin\filecheck.exe' 'C:\_work\llvm-project\llvm-project\clang\test\Preprocessor\hexagon-predefines.c' -check-prefix CHECK-V71HVX-128B
# note: command had no output on stdout or stderr
# RUN: at line 143
c:\_work\llvm-project\llvm-project\build\bin\clang.exe -cc1 -internal-isystem C:\_work\llvm-project\llvm-project\build\lib\clang\24\include -nostdsysteminc -E -dM -triple hexagon-unknown-elf -target-cpu hexagonv73 -target-feature +hvxv73 -target-feature +hvx-length128b C:\_work\llvm-project\llvm-project\clang\test\Preprocessor\hexagon-predefines.c | c:\_work\llvm-project\llvm-project\build\bin\filecheck.exe C:\_work\llvm-project\llvm-project\clang\test\Preprocessor\hexagon-predefines.c -check-prefix CHECK-V73HVX-128B
# executed command: 'c:\_work\llvm-project\llvm-project\build\bin\clang.exe' -cc1 -internal-isystem 'C:\_work\llvm-project\llvm-project\build\lib\clang\24\include' -nostdsysteminc -E -dM -triple hexagon-unknown-elf -target-cpu hexagonv73 -target-feature +hvxv73 -target-feature +hvx-length128b 'C:\_work\llvm-project\llvm-project\clang\test\Preprocessor\hexagon-predefines.c'
# note: command had no output on stdout or stderr
# executed command: 'c:\_work\llvm-project\llvm-project\build\bin\filecheck.exe' 'C:\_work\llvm-project\llvm-project\clang\test\Preprocessor\hexagon-predefines.c' -check-prefix CHECK-V73HVX-128B
# note: command had no output on stdout or stderr
# RUN: at line 153
c:\_work\llvm-project\llvm-project\build\bin\clang.exe -cc1 -internal-isystem C:\_work\llvm-project\llvm-project\build\lib\clang\24\include -nostdsysteminc -E -dM -triple hexagon-unknown-elf -target-cpu hexagonv75 C:\_work\llvm-project\llvm-project\clang\test\Preprocessor\hexagon-predefines.c | c:\_work\llvm-project\llvm-project\build\bin\filecheck.exe C:\_work\llvm-project\llvm-project\clang\test\Preprocessor\hexagon-predefines.c -check-prefix CHECK-V75
# executed command: 'c:\_work\llvm-project\llvm-project\build\bin\clang.exe' -cc1 -internal-isystem 'C:\_work\llvm-project\llvm-project\build\lib\clang\24\include' -nostdsysteminc -E -dM -triple hexagon-unknown-elf -target-cpu hexagonv75 'C:\_work\llvm-project\llvm-project\clang\test\Preprocessor\hexagon-predefines.c'
# note: command had no output on stdout or stderr
# executed command: 'c:\_work\llvm-project\llvm-project\build\bin\filecheck.exe' 'C:\_work\llvm-project\llvm-project\clang\test\Preprocessor\hexagon-predefines.c' -check-prefix CHECK-V75
# note: command had no output on stdout or stderr
# RUN: at line 160
c:\_work\llvm-project\llvm-project\build\bin\clang.exe -cc1 -internal-isystem C:\_work\llvm-project\llvm-project\build\lib\clang\24\include -nostdsysteminc -E -dM -triple hexagon-unknown-elf -target-cpu hexagonv75 -target-feature +hvxv75 -target-feature +hvx-length128b C:\_work\llvm-project\llvm-project\clang\test\Preprocessor\hexagon-predefines.c | c:\_work\llvm-project\llvm-project\build\bin\filecheck.exe C:\_work\llvm-project\llvm-project\clang\test\Preprocessor\hexagon-predefines.c -check-prefix CHECK-V75HVX-128B
# executed command: 'c:\_work\llvm-project\llvm-project\build\bin\clang.exe' -cc1 -internal-isystem 'C:\_work\llvm-project\llvm-project\build\lib\clang\24\include' -nostdsysteminc -E -dM -triple hexagon-unknown-elf -target-cpu hexagonv75 -target-feature +hvxv75 -target-feature +hvx-length128b 'C:\_work\llvm-project\llvm-project\clang\test\Preprocessor\hexagon-predefines.c'
# note: command had no output on stdout or stderr
# executed command: 'c:\_work\llvm-project\llvm-project\build\bin\filecheck.exe' 'C:\_work\llvm-project\llvm-project\clang\test\Preprocessor\hexagon-predefines.c' -check-prefix CHECK-V75HVX-128B
# note: command had no output on stdout or stderr
# RUN: at line 170
c:\_work\llvm-project\llvm-project\build\bin\clang.exe -cc1 -internal-isystem C:\_work\llvm-project\llvm-project\build\lib\clang\24\include -nostdsysteminc -E -dM -triple hexagon-unknown-elf -target-cpu hexagonv79 C:\_work\llvm-project\llvm-project\clang\test\Preprocessor\hexagon-predefines.c | c:\_work\llvm-project\llvm-project\build\bin\filecheck.exe C:\_work\llvm-project\llvm-project\clang\test\Preprocessor\hexagon-predefines.c -check-prefix CHECK-V79
# executed command: 'c:\_work\llvm-project\llvm-project\build\bin\clang.exe' -cc1 -internal-isystem 'C:\_work\llvm-project\llvm-project\build\lib\clang\24\include' -nostdsysteminc -E -dM -triple hexagon-unknown-elf -target-cpu hexagonv79 'C:\_work\llvm-project\llvm-project\clang\test\Preprocessor\hexagon-predefines.c'
# note: command had no output on stdout or stderr
# executed command: 'c:\_work\llvm-project\llvm-project\build\bin\filecheck.exe' 'C:\_work\llvm-project\llvm-project\clang\test\Preprocessor\hexagon-predefines.c' -check-prefix CHECK-V79
# note: command had no output on stdout or stderr
# RUN: at line 177
c:\_work\llvm-project\llvm-project\build\bin\clang.exe -cc1 -internal-isystem C:\_work\llvm-project\llvm-project\build\lib\clang\24\include -nostdsysteminc -E -dM -triple hexagon-unknown-elf -target-cpu hexagonv79 -target-feature +hvxv79 -target-feature +hvx-length128b C:\_work\llvm-project\llvm-project\clang\test\Preprocessor\hexagon-predefines.c | c:\_work\llvm-project\llvm-project\build\bin\filecheck.exe C:\_work\llvm-project\llvm-project\clang\test\Preprocessor\hexagon-predefines.c -check-prefix CHECK-V79HVX-128B
# executed command: 'c:\_work\llvm-project\llvm-project\build\bin\clang.exe' -cc1 -internal-isystem 'C:\_work\llvm-project\llvm-project\build\lib\clang\24\include' -nostdsysteminc -E -dM -triple hexagon-unknown-elf -target-cpu hexagonv79 -target-feature +hvxv79 -target-feature +hvx-length128b 'C:\_work\llvm-project\llvm-project\clang\test\Preprocessor\hexagon-predefines.c'
# note: command had no output on stdout or stderr
# executed command: 'c:\_work\llvm-project\llvm-project\build\bin\filecheck.exe' 'C:\_work\llvm-project\llvm-project\clang\test\Preprocessor\hexagon-predefines.c' -check-prefix CHECK-V79HVX-128B
# note: command had no output on stdout or stderr
# RUN: at line 187
c:\_work\llvm-project\llvm-project\build\bin\clang.exe -cc1 -internal-isystem C:\_work\llvm-project\llvm-project\build\lib\clang\24\include -nostdsysteminc -E -dM -triple hexagon-unknown-elf -target-cpu hexagonv81 C:\_work\llvm-project\llvm-project\clang\test\Preprocessor\hexagon-predefines.c | c:\_work\llvm-project\llvm-project\build\bin\filecheck.exe C:\_work\llvm-project\llvm-project\clang\test\Preprocessor\hexagon-predefines.c -check-prefix CHECK-V81
# executed command: 'c:\_work\llvm-project\llvm-project\build\bin\clang.exe' -cc1 -internal-isystem 'C:\_work\llvm-project\llvm-project\build\lib\clang\24\include' -nostdsysteminc -E -dM -triple hexagon-unknown-elf -target-cpu hexagonv81 'C:\_work\llvm-project\llvm-project\clang\test\Preprocessor\hexagon-predefines.c'
# note: command had no output on stdout or stderr
# executed command: 'c:\_work\llvm-project\llvm-project\build\bin\filecheck.exe' 'C:\_work\llvm-project\llvm-project\clang\test\Preprocessor\hexagon-predefines.c' -check-prefix CHECK-V81
# note: command had no output on stdout or stderr
# RUN: at line 194
c:\_work\llvm-project\llvm-project\build\bin\clang.exe -cc1 -internal-isystem C:\_work\llvm-project\llvm-project\build\lib\clang\24\include -nostdsysteminc -E -dM -triple hexagon-unknown-elf -target-cpu hexagonv81 -target-feature +hvxv81 -target-feature +hvx-length128b C:\_work\llvm-project\llvm-project\clang\test\Preprocessor\hexagon-predefines.c | c:\_work\llvm-project\llvm-project\build\bin\filecheck.exe C:\_work\llvm-project\llvm-project\clang\test\Preprocessor\hexagon-predefines.c -check-prefix CHECK-V81HVX-128B
# executed command: 'c:\_work\llvm-project\llvm-project\build\bin\clang.exe' -cc1 -internal-isystem 'C:\_work\llvm-project\llvm-project\build\lib\clang\24\include' -nostdsysteminc -E -dM -triple hexagon-unknown-elf -target-cpu hexagonv81 -target-feature +hvxv81 -target-feature +hvx-length128b 'C:\_work\llvm-project\llvm-project\clang\test\Preprocessor\hexagon-predefines.c'
# note: command had no output on stdout or stderr
# executed command: 'c:\_work\llvm-project\llvm-project\build\bin\filecheck.exe' 'C:\_work\llvm-project\llvm-project\clang\test\Preprocessor\hexagon-predefines.c' -check-prefix CHECK-V81HVX-128B
# note: command had no output on stdout or stderr
# RUN: at line 204
c:\_work\llvm-project\llvm-project\build\bin\clang.exe -cc1 -internal-isystem C:\_work\llvm-project\llvm-project\build\lib\clang\24\include -nostdsysteminc -E -dM -triple hexagon-unknown-elf -target-cpu hexagonv67 -target-feature +hvxv67 -target-feature +hvx-length128b C:\_work\llvm-project\llvm-project\clang\test\Preprocessor\hexagon-predefines.c | c:\_work\llvm-project\llvm-project\build\bin\filecheck.exe C:\_work\llvm-project\llvm-project\clang\test\Preprocessor\hexagon-predefines.c -check-prefix CHECK-ELF
# executed command: 'c:\_work\llvm-project\llvm-project\build\bin\clang.exe' -cc1 -internal-isystem 'C:\_work\llvm-project\llvm-project\build\lib\clang\24\include' -nostdsysteminc -E -dM -triple hexagon-unknown-elf -target-cpu hexagonv67 -target-feature +hvxv67 -target-feature +hvx-length128b 'C:\_work\llvm-project\llvm-project\clang\test\Preprocessor\hexagon-predefines.c'
# note: command had no output on stdout or stderr
# executed command: 'c:\_work\llvm-project\llvm-project\build\bin\filecheck.exe' 'C:\_work\llvm-project\llvm-project\clang\test\Preprocessor\hexagon-predefines.c' -check-prefix CHECK-ELF
# note: command had no output on stdout or stderr
# RUN: at line 209
c:\_work\llvm-project\llvm-project\build\bin\clang.exe -cc1 -internal-isystem C:\_work\llvm-project\llvm-project\build\lib\clang\24\include -nostdsysteminc -E -dM -triple hexagon-unknown-linux-musl -target-cpu hexagonv67 -target-feature +hvxv67 -target-feature +hvx-length128b C:\_work\llvm-project\llvm-project\clang\test\Preprocessor\hexagon-predefines.c | c:\_work\llvm-project\llvm-project\build\bin\filecheck.exe C:\_work\llvm-project\llvm-project\clang\test\Preprocessor\hexagon-predefines.c -check-prefix CHECK-LINUX
# executed command: 'c:\_work\llvm-project\llvm-project\build\bin\clang.exe' -cc1 -internal-isystem 'C:\_work\llvm-project\llvm-project\build\lib\clang\24\include' -nostdsysteminc -E -dM -triple hexagon-unknown-linux-musl -target-cpu hexagonv67 -target-feature +hvxv67 -target-feature +hvx-length128b 'C:\_work\llvm-project\llvm-project\clang\test\Preprocessor\hexagon-predefines.c'
# note: command had no output on stdout or stderr
# executed command: 'c:\_work\llvm-project\llvm-project\build\bin\filecheck.exe' 'C:\_work\llvm-project\llvm-project\clang\test\Preprocessor\hexagon-predefines.c' -check-prefix CHECK-LINUX
# .---command stderr------------
# | C:\_work\llvm-project\llvm-project\clang\test\Preprocessor\hexagon-predefines.c:213:17: error: CHECK-LINUX: expected string not found in input
# | // CHECK-LINUX: #define __gnu_linux__ 1
# | ^
# | <stdin>:1:1: note: scanning from here
# | #define _ILP32 1
# | ^
# | <stdin>:28:1: note: possible intended match here
# | #define __DBL_DIG__ 15
# | ^
# |
# | Input file: <stdin>
# | Check file: C:\_work\llvm-project\llvm-project\clang\test\Preprocessor\hexagon-predefines.c
# |
# | -dump-input=help explains the following input dump.
# |
# | Input was:
# | <<<<<<
# | 1: #define _ILP32 1
# | check:213'0 { search range start (exclusive)
# | check:213'1 error: no match found in search range
# | 2: #define __ATOMIC_ACQUIRE 2
# | 3: #define __ATOMIC_ACQ_REL 4
# | 4: #define __ATOMIC_CONSUME 1
# | 5: #define __ATOMIC_RELAXED 0
# | 6: #define __ATOMIC_RELEASE 3
# | .
# | .
# | .
# | 23: #define __CLANG_ATOMIC_SHORT_LOCK_FREE 2
# | 24: #define __CLANG_ATOMIC_WCHAR_T_LOCK_FREE 2
# | 25: #define __CONSTANT_CFSTRINGS__ 1
# | 26: #define __DBL_DECIMAL_DIG__ 17
# | 27: #define __DBL_DENORM_MIN__ 4.9406564584124654e-324
# | 28: #define __DBL_DIG__ 15
# | check:213'2 ? possible intended match
# | 29: #define __DBL_EPSILON__ 2.2204460492503131e-16
# | 30: #define __DBL_HAS_DENORM__ 1
# | 31: #define __DBL_HAS_INFINITY__ 1
# | 32: #define __DBL_HAS_QUIET_NAN__ 1
# | 33: #define __DBL_MANT_DIG__ 53
# | .
# | .
# | .
# | 356: #define __llvm__ 1
# | 357: #define __qdsp6__ 1
# | 358: #define __unix 1
# | 359: #define __unix__ 1
# | 360: #define linux 1
# | 361: #define unix 1
# | check:213'3 } search range end (exclusive)
# | >>>>>>
# `-----------------------------
# error: command failed with exit status: 1
--
```
</details>
<details>
<summary>Clang.Preprocessor/init-csky.c</summary>
```
Exit Code: 1
Command Output (stdout):
--
# RUN: at line 1
c:\_work\llvm-project\llvm-project\build\bin\clang.exe -cc1 -internal-isystem C:\_work\llvm-project\llvm-project\build\lib\clang\24\include -nostdsysteminc -E -dM -ffreestanding -fgnuc-version=4.2.1 -triple=csky < /dev/null | c:\_work\llvm-project\llvm-project\build\bin\filecheck.exe -match-full-lines -check-prefix=CSKY C:\_work\llvm-project\llvm-project\clang\test\Preprocessor\init-csky.c
# executed command: 'c:\_work\llvm-project\llvm-project\build\bin\clang.exe' -cc1 -internal-isystem 'C:\_work\llvm-project\llvm-project\build\lib\clang\24\include' -nostdsysteminc -E -dM -ffreestanding -fgnuc-version=4.2.1 -triple=csky
# note: command had no output on stdout or stderr
# executed command: 'c:\_work\llvm-project\llvm-project\build\bin\filecheck.exe' -match-full-lines -check-prefix=CSKY 'C:\_work\llvm-project\llvm-project\clang\test\Preprocessor\init-csky.c'
# note: command had no output on stdout or stderr
# RUN: at line 3
c:\_work\llvm-project\llvm-project\build\bin\clang.exe -cc1 -internal-isystem C:\_work\llvm-project\llvm-project\build\lib\clang\24\include -nostdsysteminc -E -dM -ffreestanding -fgnuc-version=4.2.1 -triple=csky-unknown-linux < /dev/null | c:\_work\llvm-project\llvm-project\build\bin\filecheck.exe -match-full-lines -check-prefixes=CSKY,CSKY-LINUX C:\_work\llvm-project\llvm-project\clang\test\Preprocessor\init-csky.c
# executed command: 'c:\_work\llvm-project\llvm-project\build\bin\clang.exe' -cc1 -internal-isystem 'C:\_work\llvm-project\llvm-project\build\lib\clang\24\include' -nostdsysteminc -E -dM -ffreestanding -fgnuc-version=4.2.1 -triple=csky-unknown-linux
# note: command had no output on stdout or stderr
# executed command: 'c:\_work\llvm-project\llvm-project\build\bin\filecheck.exe' -match-full-lines -check-prefixes=CSKY,CSKY-LINUX 'C:\_work\llvm-project\llvm-project\clang\test\Preprocessor\init-csky.c'
# .---command stderr------------
# | C:\_work\llvm-project\llvm-project\clang\test\Preprocessor\init-csky.c:215:16: error: CSKY-LINUX: expected string not found in input
# | // CSKY-LINUX: #define __gnu_linux__ 1
# | ^
# | <stdin>:369:21: note: scanning from here
# | #define __cskyle__ 1
# | ^
# | <stdin>:371:1: note: possible intended match here
# | #define __linux__ 1
# | ^
# |
# | Input file: <stdin>
# | Check file: C:\_work\llvm-project\llvm-project\clang\test\Preprocessor\init-csky.c
# |
# | -dump-input=help explains the following input dump.
# |
# | Input was:
# | <<<<<<
# | .
# | .
# | .
# | 364: #define __clang_version__ "24.0.0git (https://github.com/llvm/llvm-project 1e36267418e9d99c458d16594aae9b2ea77f98b7)"
# | 365: #define __clang_wide_literal_encoding__ "UTF-32"
# | 366: #define __cskyLE__ 1
# | 367: #define __csky__ 2
# | 368: #define __cskyabi__ 2
# | 369: #define __cskyle__ 1
# | check:215'0 { search range start (exclusive)
# | check:215'1 error: no match found in search range
# | 370: #define __linux 1
# | 371: #define __linux__ 1
# | check:215'2 ? possible intended match
# | 372: #define __llvm__ 1
# | 373: #define __unix 1
# | 374: #define __unix__ 1
# | 375: #define linux 1
# | 376: #define unix 1
# | check:215'3 } search range end (exclusive)
# | >>>>>>
# `-----------------------------
# error: command failed with exit status: 1
--
```
</details>
<details>
<summary>Clang.Preprocessor/init-loongarch.c</summary>
```
Exit Code: 1
Command Output (stdout):
--
# RUN: at line 1
c:\_work\llvm-project\llvm-project\build\bin\clang.exe -cc1 -internal-isystem C:\_work\llvm-project\llvm-project\build\lib\clang\24\include -nostdsysteminc -E -dM -ffreestanding -fgnuc-version=4.2.1 -triple loongarch32 /dev/null | c:\_work\llvm-project\llvm-project\build\bin\filecheck.exe --match-full-lines --check-prefix=LA32 C:\_work\llvm-project\llvm-project\clang\test\Preprocessor\init-loongarch.c
# executed command: 'c:\_work\llvm-project\llvm-project\build\bin\clang.exe' -cc1 -internal-isystem 'C:\_work\llvm-project\llvm-project\build\lib\clang\24\include' -nostdsysteminc -E -dM -ffreestanding -fgnuc-version=4.2.1 -triple loongarch32 /dev/null
# note: command had no output on stdout or stderr
# executed command: 'c:\_work\llvm-project\llvm-project\build\bin\filecheck.exe' --match-full-lines --check-prefix=LA32 'C:\_work\llvm-project\llvm-project\clang\test\Preprocessor\init-loongarch.c'
# note: command had no output on stdout or stderr
# RUN: at line 3
c:\_work\llvm-project\llvm-project\build\bin\clang.exe -cc1 -internal-isystem C:\_work\llvm-project\llvm-project\build\lib\clang\24\include -nostdsysteminc -E -dM -ffreestanding -fgnuc-version=4.2.1 -triple loongarch32-unknown-linux /dev/null | c:\_work\llvm-project\llvm-project\build\bin\filecheck.exe --match-full-lines --check-prefixes=LA32,LA32-LINUX C:\_work\llvm-project\llvm-project\clang\test\Preprocessor\init-loongarch.c
# executed command: 'c:\_work\llvm-project\llvm-project\build\bin\clang.exe' -cc1 -internal-isystem 'C:\_work\llvm-project\llvm-project\build\lib\clang\24\include' -nostdsysteminc -E -dM -ffreestanding -fgnuc-version=4.2.1 -triple loongarch32-unknown-linux /dev/null
# note: command had no output on stdout or stderr
# executed command: 'c:\_work\llvm-project\llvm-project\build\bin\filecheck.exe' --match-full-lines --check-prefixes=LA32,LA32-LINUX 'C:\_work\llvm-project\llvm-project\clang\test\Preprocessor\init-loongarch.c'
# .---command stderr------------
# | C:\_work\llvm-project\llvm-project\clang\test\Preprocessor\init-loongarch.c:341:16: error: LA32-LINUX: expected string not found in input
# | // LA32-LINUX: #define __gnu_linux__ 1
# | ^
# | <stdin>:369:26: note: scanning from here
# | #define __WINT_WIDTH__ 32
# | ^
# | <stdin>:378:1: note: possible intended match here
# | #define __linux__ 1
# | ^
# |
# | Input file: <stdin>
# | Check file: C:\_work\llvm-project\llvm-project\clang\test\Preprocessor\init-loongarch.c
# |
# | -dump-input=help explains the following input dump.
# |
# | Input was:
# | <<<<<<
# | .
# | .
# | .
# | 364: #define __WCHAR_WIDTH__ 32
# | 365: #define __WINT_MAX__ 4294967295U
# | 366: #define __WINT_MIN__ 0U
# | 367: #define __WINT_TYPE__ unsigned int
# | 368: #define __WINT_UNSIGNED__ 1
# | 369: #define __WINT_WIDTH__ 32
# | check:341'0 { search range start (exclusive)
# | check:341'1 error: no match found in search range
# | 370: #define __clang__ 1
# | 371: #define __clang_literal_encoding__ "UTF-8"
# | 372: #define __clang_major__ 24
# | 373: #define __clang_minor__ 0
# | 374: #define __clang_patchlevel__ 0
# | 375: #define __clang_version__ "24.0.0git (https://github.com/llvm/llvm-project 1e36267418e9d99c458d16594aae9b2ea77f98b7)"
# | 376: #define __clang_wide_literal_encoding__ "UTF-32"
# | 377: #define __linux 1
# | 378: #define __linux__ 1
# | check:341'2 ? possible intended match
# | 379: #define __llvm__ 1
# | 380: #define __loongarch__ 1
# | 381: #define __loongarch_arch ""
# | 382: #define __loongarch_double_float 1
# | 383: #define __loongarch_frlen 0
# | 384: #define __loongarch_grlen 32
# | 385: #define __loongarch_hard_float 1
# | 386: #define __loongarch_ilp32 1
# | 387: #define __loongarch_tune ""
# | 388: #define __unix 1
# | 389: #define __unix__ 1
# | 390: #define linux 1
# | 391: #define unix 1
# | check:341'3 } search range end (exclusive)
# | >>>>>>
# `-----------------------------
# error: command failed with exit status: 1
--
```
</details>
<details>
<summary>Clang.Preprocessor/init.c</summary>
```
Exit Code: 1
Command Output (stdout):
--
# RUN: at line 1
c:\_work\llvm-project\llvm-project\build\bin\clang.exe -cc1 -internal-isystem C:\_work\llvm-project\llvm-project\build\lib\clang\24\include -nostdsysteminc -E -dM < /dev/null | c:\_work\llvm-project\llvm-project\build\bin\filecheck.exe -match-full-lines -check-prefix INTERFERENCE C:\_work\llvm-project\llvm-project\clang\test\Preprocessor\init.c
# executed command: 'c:\_work\llvm-project\llvm-project\build\bin\clang.exe' -cc1 -internal-isystem 'C:\_work\llvm-project\llvm-project\build\lib\clang\24\include' -nostdsysteminc -E -dM
# note: command had no output on stdout or stderr
# executed command: 'c:\_work\llvm-project\llvm-project\build\bin\filecheck.exe' -match-full-lines -check-prefix INTERFERENCE 'C:\_work\llvm-project\llvm-project\clang\test\Preprocessor\init.c'
# note: command had no output on stdout or stderr
# RUN: at line 8
c:\_work\llvm-project\llvm-project\build\bin\clang.exe -cc1 -internal-isystem C:\_work\llvm-project\llvm-project\build\lib\clang\24\include -nostdsysteminc -E -dM -x assembler-with-cpp < /dev/null | c:\_work\llvm-project\llvm-project\build\bin\filecheck.exe -match-full-lines -check-prefix ASM C:\_work\llvm-project\llvm-project\clang\test\Preprocessor\init.c
# executed command: 'c:\_work\llvm-project\llvm-project\build\bin\clang.exe' -cc1 -internal-isystem 'C:\_work\llvm-project\llvm-project\build\lib\clang\24\include' -nostdsysteminc -E -dM -x assembler-with-cpp
# note: command had no output on stdout or stderr
# executed command: 'c:\_work\llvm-project\llvm-project\build\bin\filecheck.exe' -match-full-lines -check-prefix ASM 'C:\_work\llvm-project\llvm-project\clang\test\Preprocessor\init.c'
# note: command had no output on stdout or stderr
# RUN: at line 13
c:\_work\llvm-project\llvm-project\build\bin\clang.exe -cc1 -internal-isystem C:\_work\llvm-project\llvm-project\build\lib\clang\24\include -nostdsysteminc -fblocks -E -dM < /dev/null | c:\_work\llvm-project\llvm-project\build\bin\filecheck.exe -match-full-lines -check-prefix BLOCKS C:\_work\llvm-project\llvm-project\clang\test\Preprocessor\init.c
# executed command: 'c:\_work\llvm-project\llvm-project\build\bin\clang.exe' -cc1 -internal-isystem 'C:\_work\llvm-project\llvm-project\build\lib\clang\24\include' -nostdsysteminc -fblocks -E -dM
# note: command had no output on stdout or stderr
# executed command: 'c:\_work\llvm-project\llvm-project\build\bin\filecheck.exe' -match-full-lines -check-prefix BLOCKS 'C:\_work\llvm-project\llvm-project\clang\test\Preprocessor\init.c'
# note: command had no output on stdout or stderr
# RUN: at line 18
c:\_work\llvm-project\llvm-project\build\bin\clang.exe -cc1 -internal-isystem C:\_work\llvm-project\llvm-project\build\lib\clang\24\include -nostdsysteminc -x c++ -fgnuc-version=4.2.1 -std=c++2d -E -dM < /dev/null | c:\_work\llvm-project\llvm-project\build\bin\filecheck.exe -match-full-lines -check-prefix CXX29 C:\_work\llvm-project\llvm-project\clang\test\Preprocessor\init.c
# executed command: 'c:\_work\llvm-project\llvm-project\build\bin\clang.exe' -cc1 -internal-isystem 'C:\_work\llvm-project\llvm-project\build\lib\clang\24\include' -nostdsysteminc -x c++ -fgnuc-version=4.2.1 -std=c++2d -E -dM
# note: command had no output on stdout or stderr
# executed command: 'c:\_work\llvm-project\llvm-project\build\bin\filecheck.exe' -match-full-lines -check-prefix CXX29 'C:\_work\llvm-project\llvm-project\clang\test\Preprocessor\init.c'
# note: command had no output on stdout or stderr
# RUN: at line 27
c:\_work\llvm-project\llvm-project\build\bin\clang.exe -cc1 -internal-isystem C:\_work\llvm-project\llvm-project\build\lib\clang\24\include -nostdsysteminc -x c++ -fgnuc-version=4.2.1 -std=c++26 -E -dM < /dev/null | c:\_work\llvm-project\llvm-project\build\bin\filecheck.exe -match-full-lines -check-prefix CXX26 C:\_work\llvm-project\llvm-project\clang\test\Preprocessor\init.c
# executed command: 'c:\_work\llvm-project\llvm-project\build\bin\clang.exe' -cc1 -internal-isystem 'C:\_work\llvm-project\llvm-project\build\lib\clang\24\include' -nostdsysteminc -x c++ -fgnuc-version=4.2.1 -std=c++26 -E -dM
# note: command had no output on stdout or stderr
# executed command: 'c:\_work\llvm-project\llvm-project\build\bin\filecheck.exe' -match-full-lines -check-prefix CXX26 'C:\_work\llvm-project\llvm-project\clang\test\Preprocessor\init.c'
# note: command had no output on stdout or stderr
# RUN: at line 28
c:\_work\llvm-project\llvm-project\build\bin\clang.exe -cc1 -internal-isystem C:\_work\llvm-project\llvm-project\build\lib\clang\24\include -nostdsysteminc -x c++ -fgnuc-version=4.2.1 -std=c++2c -E -dM < /dev/null | c:\_work\llvm-project\llvm-project\build\bin\filecheck.exe -match-full-lines -check-prefix CXX26 C:\_work\llvm-project\llvm-project\clang\test\Preprocessor\init.c
# executed command: 'c:\_work\llvm-project\llvm-project\build\bin\clang.exe' -cc1 -internal-isystem 'C:\_work\llvm-project\llvm-project\build\lib\clang\24\include' -nostdsysteminc -x c++ -fgnuc-version=4.2.1 -std=c++2c -E -dM
# note: command had no output on stdout or stderr
# executed command: 'c:\_work\llvm-project\llvm-project\build\bin\filecheck.exe' -match-full-lines -check-prefix CXX26 'C:\_work\llvm-project\llvm-project\clang\test\Preprocessor\init.c'
# note: command had no output on stdout or stderr
# RUN: at line 37
c:\_work\llvm-project\llvm-project\build\bin\clang.exe -cc1 -internal-isystem C:\_work\llvm-project\llvm-project\build\lib\clang\24\include -nostdsysteminc -x c++ -fgnuc-version=4.2.1 -std=c++23 -E -dM < /dev/null | c:\_work\llvm-project\llvm-project\build\bin\filecheck.exe -match-full-lines -check-prefix CXX2B C:\_work\llvm-project\llvm-project\clang\test\Preprocessor\init.c
# executed command: 'c:\_work\llvm-project\llvm-project\build\bin\clang.exe' -cc1 -internal-isystem 'C:\_work\llvm-project\llvm-project\build\lib\clang\24\include' -nostdsysteminc -x c++ -fgnuc-version=4.2.1 -std=c++23 -E -dM
# note: command had no output on stdout or stderr
# executed command: 'c:\_work\llvm-project\llvm-project\build\bin\filecheck.exe' -match-full-lines -check-prefix CXX2B 'C:\_work\llvm-project\llvm-project\clang\test\Preprocessor\init.c'
# note: command had no output on stdout or stderr
# RUN: at line 38
c:\_work\llvm-project\llvm-project\build\bin\clang.exe -cc1 -internal-isystem C:\_work\llvm-project\llvm-project\build\lib\clang\24\include -nostdsysteminc -x c++ -fgnuc-version=4.2.1 -std=c++2b -E -dM < /dev/null | c:\_work\llvm-project\llvm-project\build\bin\filecheck.exe -match-full-lines -check-prefix CXX2B C:\_work\llvm-project\llvm-project\clang\test\Preprocessor\init.c
# executed command: 'c:\_work\llvm-project\llvm-project\build\bin\clang.exe' -cc1 -internal-isystem 'C:\_work\llvm-project\llvm-project\build\lib\clang\24\include' -nostdsysteminc -x c++ -fgnuc-version=4.2.1 -std=c++2b -E -dM
# note: command had no output on stdout or stderr
# executed command: 'c:\_work\llvm-project\llvm-project\build\bin\filecheck.exe' -match-full-lines -check-prefix CXX2B 'C:\_work\llvm-project\llvm-project\clang\test\Preprocessor\init.c'
# note: command had no output on stdout or stderr
# RUN: at line 47
c:\_work\llvm-project\llvm-project\build\bin\clang.exe -cc1 -internal-isystem C:\_work\llvm-project\llvm-project\build\lib\clang\24\include -nostdsysteminc -x c++ -fgnuc-version=4.2.1 -std=c++20 -E -dM < /dev/null | c:\_work\llvm-project\llvm-project\build\bin\filecheck.exe -match-full-lines -check-prefix CXX2A C:\_work\llvm-project\llvm-project\clang\test\Preprocessor\init.c
# executed command: 'c:\_work\llvm-project\llvm-project\build\bin\clang.exe' -cc1 -internal-isystem 'C:\_work\llvm-project\llvm-project\build\lib\clang\24\include' -nostdsysteminc -x c++ -fgnuc-version=4.2.1 -std=c++20 -E -dM
# note: command had no output on stdout or stderr
# executed command: 'c:\_work\llvm-project\llvm-project\build\bin\filecheck.exe' -match-full-lines -check-prefix CXX2A 'C:\_work\llvm-project\llvm-project\clang\test\Preprocessor\init.c'
# note: command had no output on stdout or stderr
# RUN: at line 48
c:\_work\llvm-project\llvm-project\build\bin\clang.exe -cc1 -internal-isystem C:\_work\llvm-project\llvm-project\build\lib\clang\24\include -nostdsysteminc -x c++ -fgnuc-version=4.2.1 -std=c++2a -E -dM < /dev/null | c:\_work\llvm-project\llvm-project\build\bin\filecheck.exe -match-full-lines -check-prefix CXX2A C:\_work\llvm-project\llvm-project\clang\test\Preprocessor\init.c
# executed command: 'c:\_work\llvm-project\llvm-project\build\bin\clang.exe' -cc1 -internal-isystem 'C:\_work\llvm-project\llvm-project\build\lib\clang\24\include' -nostdsysteminc -x c++ -fgnuc-version=4.2.1 -std=c++2a -E -dM
# note: command had no output on stdout or stderr
# executed command: 'c:\_work\llvm-project\llvm-project\build\bin\filecheck.exe' -match-full-lines -check-prefix CXX2A 'C:\_work\llvm-project\llvm-project\clang\test\Preprocessor\init.c'
# note: command had no output on stdout or stderr
# RUN: at line 57
c:\_work\llvm-project\llvm-project\build\bin\clang.exe -cc1 -internal-isystem C:\_work\llvm-project\llvm-project\build\lib\clang\24\include -nostdsysteminc -x c++ -fgnuc-version=4.2.1 -std=c++17 -E -dM < /dev/null | c:\_work\llvm-project\llvm-project\build\bin\filecheck.exe -match-full-lines -check-prefix CXX1Z C:\_work\llvm-project\llvm-project\clang\test\Preprocessor\init.c
# executed command: 'c:\_work\llvm-project\llvm-project\build\bin\clang.exe' -cc1 -internal-isystem 'C:\_work\llvm-project\llvm-project\build\lib\clang\24\include' -nostdsysteminc -x c++ -fgnuc-version=4.2.1 -std=c++17 -E -dM
# note: command had no output on stdout or stderr
# executed command: 'c:\_work\llvm-project\llvm-project\build\bin\filecheck.exe' -match-full-lines -check-prefix CXX1Z 'C:\_work\llvm-project\llvm-project\clang\test\Preprocessor\init.c'
# note: command had no output on stdout or stderr
# RUN: at line 58
c:\_work\llvm-project\llvm-project\build\bin\clang.exe -cc1 -internal-isystem C:\_work\llvm-project\llvm-project\build\lib\clang\24\include -nostdsysteminc -x c++ -fgnuc-version=4.2.1 -std=c++1z -E -dM < /dev/null | c:\_work\llvm-project\llvm-project\build\bin\filecheck.exe -match-full-lines -check-prefix CXX1Z C:\_work\llvm-project\llvm-project\clang\test\Preprocessor\init.c
# executed command: 'c:\_work\llvm-project\llvm-project\build\bin\clang.exe' -cc1 -internal-isystem 'C:\_work\llvm-project\llvm-project\build\lib\clang\24\include' -nostdsysteminc -x c++ -fgnuc-version=4.2.1 -std=c++1z -E -dM
# note: command had no output on stdout or stderr
# executed command: 'c:\_work\llvm-project\llvm-project\build\bin\filecheck.exe' -match-full-lines -check-prefix CXX1Z 'C:\_work\llvm-project\llvm-project\clang\test\Preprocessor\init.c'
# note: command had no output on stdout or stderr
# RUN: at line 68
c:\_work\llvm-project\llvm-project\build\bin\clang.exe -cc1 -internal-isystem C:\_work\llvm-project\llvm-project\build\lib\clang\24\include -nostdsysteminc -x c++ -fgnuc-version=4.2.1 -std=c++14 -E -dM < /dev/null | c:\_work\llvm-project\llvm-project\build\bin\filecheck.exe -match-full-lines -check-prefix CXX1Y C:\_work\llvm-project\llvm-project\clang\test\Preprocessor\init.c
# executed command: 'c:\_work\llvm-project\llvm-project\build\bin\clang.exe' -cc1 -internal-isystem 'C:\_work\llvm-project\llvm-project\build\lib\clang\24\include' -nostdsysteminc -x c++ -fgnuc-version=4.2.1 -std=c++14 -E -dM
# note: command had no output on stdout or stderr
# executed command: 'c:\_work\llvm-project\llvm-project\build\bin\filecheck.exe' -match-full-lines -check-prefix CXX1Y 'C:\_work\llvm-project\llvm-project\clang\test\Preprocessor\init.c'
# note: command had no output on stdout or stderr
# RUN: at line 69
c:\_work\llvm-project\llvm-project\build\bin\clang.exe -cc1 -internal-isystem C:\_work\llvm-project\llvm-project\build\lib\clang\24\include -nostdsysteminc -x c++ -fgnuc-version=4.2.1 -std=c++1y -E -dM < /dev/null | c:\_work\llvm-project\llvm-project\build\bin\filecheck.exe -match-full-lines -check-prefix CXX1Y C:\_work\llvm-project\llvm-project\clang\test\Preprocessor\init.c
# executed command: 'c:\_work\llvm-project\llvm-project\build\bin\clang.exe' -cc1 -internal-isystem 'C:\_work\llvm-project\llvm-project\build\lib\clang\24\include' -nostdsysteminc -x c++ -fgnuc-version=4.2.1 -std=c++1y -E -dM
# note: command had no output on stdout or stderr
# executed command: 'c:\_work\llvm-project\llvm-project\build\bin\filecheck.exe' -match-full-lines -check-prefix CXX1Y 'C:\_work\llvm-project\llvm-project\clang\test\Preprocessor\init.c'
# note: command had no output on stdout or stderr
# RUN: at line 79
c:\_work\llvm-project\llvm-project\build\bin\clang.exe -cc1 -internal-isystem C:\_work\llvm-project\llvm-project\build\lib\clang\24\include -nostdsysteminc -x c++ -fgnuc-version=4.2.1 -std=c++11 -E -dM < /dev/null | c:\_work\llvm-project\llvm-project\build\bin\filecheck.exe -match-full-lines -check-prefix CXX11 C:\_work\llvm-project\llvm-project\clang\test\Preprocessor\init.c
# executed command: 'c:\_work\llvm-project\llvm-project\build\bin\clang.exe' -cc1 -internal-isystem 'C:\_work\llvm-project\llvm-project\build\lib\clang\24\include' -nostdsysteminc -x c++ -fgnuc-version=4.2.1 -std=c++11 -E -dM
# note: command had no output on stdout or stderr
# executed command: 'c:\_work\llvm-project\llvm-project\build\bin\filecheck.exe' -match-full-lines -check-prefix CXX11 'C:\_work\llvm-project\llvm-project\clang\test\Preprocessor\init.c'
# note: command had no output on stdout or stderr
# RUN: at line 89
c:\_work\llvm-project\llvm-project\build\bin\clang.exe -cc1 -internal-isystem C:\_work\llvm-project\llvm-project\build\lib\clang\24\include -nostdsysteminc -x c++ -fgnuc-version=4.2.1 -std=c++98 -E -dM < /dev/null | c:\_work\llvm-project\llvm-project\build\bin\filecheck.exe -match-full-lines -check-prefix CXX98 C:\_work\llvm-project\llvm-project\clang\test\Preprocessor\init.c
# executed command: 'c:\_work\llvm-project\llvm-project\build\bin\clang.exe' -cc1 -internal-isystem 'C:\_work\llvm-project\llvm-project\build\lib\clang\24\include' -nostdsysteminc -x c++ -fgnuc-version=4.2.1 -std=c++98 -E -dM
# note: command had no output on stdout or stderr
# executed command: 'c:\_work\llvm-project\llvm-project\build\bin\filecheck.exe' -match-full-lines -check-prefix CXX98 'C:\_work\llvm-project\llvm-project\clang\test\Preprocessor\init.c'
# note: command had no output on stdout or stderr
# RUN: at line 98
c:\_work\llvm-project\llvm-project\build\bin\clang.exe -cc1 -internal-isystem C:\_work\llvm-project\llvm-project\build\lib\clang\24\include -nostdsysteminc -fdeprecated-macro -E -dM < /dev/null | c:\_work\llvm-project\llvm-project\build\bin\filecheck.exe -match-full-lines -check-prefix DEPRECATED C:\_work\llvm-project\llvm-project\clang\test\Preprocessor\init.c
# executed command: 'c:\_work\llvm-project\llvm-project\build\bin\clang.exe' -cc1 -internal-isystem 'C:\_work\llvm-project\llvm-project\build\lib\clang\24\include' -nostdsysteminc -fdeprecated-macro -E -dM
# note: command had no output on stdout or stderr
# executed command: 'c:\_work\llvm-project\llvm-project\build\bin\filecheck.exe' -match-full-lines -check-prefix DEPRECATED 'C:\_work\llvm-project\llvm-project\clang\test\Preprocessor\init.c'
# note: command had no output on stdout or stderr
# RUN: at line 103
c:\_work\llvm-project\llvm-project\build\bin\clang.exe -cc1 -internal-isystem C:\_work\llvm-project\llvm-project\build\lib\clang\24\include -nostdsysteminc -std=c99 -E -dM < /dev/null | c:\_work\llvm-project\llvm-project\build\bin\filecheck.exe -match-full-lines -check-prefix C99 C:\_work\llvm-project\llvm-project\clang\test\Preprocessor\init.c
# executed command: 'c:\_work\llvm-project\llvm-project\build\bin\clang.exe' -cc1 -internal-isystem 'C:\_work\llvm-project\llvm-project\build\lib\clang\24\include' -nostdsysteminc -std=c99 -E -dM
# note: command had no output on stdout or stderr
# executed command: 'c:\_work\llvm-project\llvm-project\build\bin\filecheck.exe' -match-full-lines -check-prefix C99 'C:\_work\llvm-project\llvm-project\clang\test\Preprocessor\init.c'
# note: command had no output on stdout or stderr
# RUN: at line 112
c:\_work\llvm-project\llvm-project\build\bin\clang.exe -cc1 -internal-isystem C:\_work\llvm-project\llvm-project\build\lib\clang\24\include -nostdsysteminc -std=c17 -triple=x86_64-pc-win32 -E -dM < /dev/null | c:\_work\llvm-project\llvm-project\build\bin\filecheck.exe -match-full-lines -check-prefix C17-FMT C:\_work\llvm-project\llvm-project\clang\test\Preprocessor\init.c
# executed command: 'c:\_work\llvm-project\llvm-project\build\bin\clang.exe' -cc1 -internal-isystem 'C:\_work\llvm-project\llvm-project\build\lib\clang\24\include' -nostdsysteminc -std=c17 -triple=x86_64-pc-win32 -E -dM
# note: command had no output on stdout or stderr
# executed command: 'c:\_work\llvm-project\llvm-project\build\bin\filecheck.exe' -match-full-lines -check-prefix C17-FMT 'C:\_work\llvm-project\llvm-project\clang\test\Preprocessor\init.c'
# note: command had no output on stdout or stderr
# RUN: at line 113
c:\_work\llvm-project\llvm-project\build\bin\clang.exe -cc1 -internal-isystem C:\_work\llvm-project\llvm-project\build\lib\clang\24\include -nostdsysteminc -std=c23 -triple=x86_64-pc-win32 -E -dM < /dev/null | c:\_work\llvm-project\llvm-project\build\bin\filecheck.exe -match-full-lines -check-prefix C23-FMT C:\_work\llvm-project\llvm-project\clang\test\Preprocessor\init.c
# executed command: 'c:\_work\llvm-project\llvm-project\build\bin\clang.exe' -cc1 -internal-isystem 'C:\_work\llvm-project\llvm-project\build\lib\clang\24\include' -nostdsysteminc -std=c23 -triple=x86_64-pc-win32 -E -dM
# note: command had no output on stdout or stderr
# executed command: 'c:\_work\llvm-project\llvm-project\build\bin\filecheck.exe' -match-full-lines -check-prefix C23-FMT 'C:\_work\llvm-project\llvm-project\clang\test\Preprocessor\init.c'
# note: command had no output on stdout or stderr
# RUN: at line 177
c:\_work\llvm-project\llvm-project\build\bin\clang.exe -cc1 -internal-isystem C:\_work\llvm-project\llvm-project\build\lib\clang\24\include -nostdsysteminc -std=c11 -E -dM < /dev/null | c:\_work\llvm-project\llvm-project\build\bin\filecheck.exe -match-full-lines -check-prefix C11 C:\_work\llvm-project\llvm-project\clang\test\Preprocessor\init.c
# executed command: 'c:\_work\llvm-project\llvm-project\build\bin\clang.exe' -cc1 -internal-isystem 'C:\_work\llvm-project\llvm-project\build\lib\clang\24\include' -nostdsysteminc -std=c11 -E -dM
# note: command had no output on stdout or stderr
# executed command: 'c:\_work\llvm-project\llvm-project\build\bin\filecheck.exe' -match-full-lines -check-prefix C11 'C:\_work\llvm-project\llvm-project\clang\test\Preprocessor\init.c'
# note: command had no output on stdout or stderr
# RUN: at line 178
c:\_work\llvm-project\llvm-project\build\bin\clang.exe -cc1 -internal-isystem C:\_work\llvm-project\llvm-project\build\lib\clang\24\include -nostdsysteminc -std=c1x -E -dM < /dev/null | c:\_work\llvm-project\llvm-project\build\bin\filecheck.exe -match-full-lines -check-prefix C11 C:\_work\llvm-project\llvm-project\clang\test\Preprocessor\init.c
# executed command: 'c:\_work\llvm-project\llvm-project\build\bin\clang.exe' -cc1 -internal-isystem 'C:\_work\llvm-project\llvm-project\build\lib\clang\24\include' -nostdsysteminc -std=c1x -E -dM
# note: command had no output on stdout or stderr
# executed command: 'c:\_work\llvm-project\llvm-project\build\bin\filecheck.exe' -match-full-lines -check-prefix C11 'C:\_work\llvm-project\llvm-project\clang\test\Preprocessor\init.c'
# note: command had no output on stdout or stderr
# RUN: at line 179
c:\_work\llvm-project\llvm-project\build\bin\clang.exe -cc1 -internal-isystem C:\_work\llvm-project\llvm-project\build\lib\clang\24\include -nostdsysteminc -std=iso9899:2011 -E -dM < /dev/null | c:\_work\llvm-project\llvm-project\build\bin\filecheck.exe -match-full-lines -check-prefix C11 C:\_work\llvm-project\llvm-project\clang\test\Preprocessor\init.c
# executed command: 'c:\_work\llvm-project\llvm-project\build\bin\clang.exe' -cc1 -internal-isystem 'C:\_work\llvm-project\llvm-project\build\lib\clang\24\include' -nostdsysteminc -std=iso9899:2011 -E -dM
# note: command had no output on stdout or stderr
# executed command: 'c:\_work\llvm-project\llvm-project\build\bin\filecheck.exe' -match-full-lines -check-prefix C11 'C:\_work\llvm-project\llvm-project\clang\test\Preprocessor\init.c'
# note: command had no output on stdout or stderr
# RUN: at line 180
c:\_work\llvm-project\llvm-project\build\bin\clang.exe -cc1 -internal-isystem C:\_work\llvm-project\llvm-project\build\lib\clang\24\include -nostdsysteminc -std=iso9899:201x -E -dM < /dev/null | c:\_work\llvm-project\llvm-project\build\bin\filecheck.exe -match-full-lines -check-prefix C11 C:\_work\llvm-project\llvm-project\clang\test\Preprocessor\init.c
# executed command: 'c:\_work\llvm-project\llvm-project\build\bin\clang.exe' -cc1 -internal-isystem 'C:\_work\llvm-project\llvm-project\build\lib\clang\24\include' -nostdsysteminc -std=iso9899:201x -E -dM
# note: command had no output on stdout or stderr
# executed command: 'c:\_work\llvm-project\llvm-project\build\bin\filecheck.exe' -match-full-lines -check-prefix C11 'C:\_work\llvm-project\llvm-project\clang\test\Preprocessor\init.c'
# note: command had no output on stdout or stderr
# RUN: at line 192
c:\_work\llvm-project\llvm-project\build\bin\clang.exe -cc1 -internal-isystem C:\_work\llvm-project\llvm-project\build\lib\clang\24\include -nostdsysteminc -fgnuc-version=4.2.1 -E -dM < /dev/null | c:\_work\llvm-project\llvm-project\build\bin\filecheck.exe -match-full-lines -check-prefix COMMON C:\_work\llvm-project\llvm-project\clang\test\Preprocessor\init.c
# executed command: 'c:\_work\llvm-project\llvm-project\build\bin\clang.exe' -cc1 -internal-isystem 'C:\_work\llvm-project\llvm-project\build\lib\clang\24\include' -nostdsysteminc -fgnuc-version=4.2.1 -E -dM
# note: command had no output on stdout or stderr
# executed command: 'c:\_work\llvm-project\llvm-project\build\bin\filecheck.exe' -match-full-lines -check-prefix COMMON 'C:\_work\llvm-project\llvm-project\clang\test\Preprocessor\init.c'
# note: command had no output on stdout or stderr
# RUN: at line 216
c:\_work\llvm-project\llvm-project\build\bin\clang.exe -cc1 -internal-isystem C:\_work\llvm-project\llvm-project\build\lib\clang\24\include -nostdsysteminc -E -dM -triple=x86_64-pc-win32 < /dev/null | c:\_work\llvm-project\llvm-project\build\bin\filecheck.exe -match-full-lines -check-prefix C-DEFAULT C:\_work\llvm-project\llvm-project\clang\test\Preprocessor\init.c
# executed command: 'c:\_work\llvm-project\llvm-project\build\bin\clang.exe' -cc1 -internal-isystem 'C:\_work\llvm-project\llvm-project\build\lib\clang\24\include' -nostdsysteminc -E -dM -triple=x86_64-pc-win32
# note: command had no output on stdout or stderr
# executed command: 'c:\_work\llvm-project\llvm-project\build\bin\filecheck.exe' -match-full-lines -check-prefix C-DEFAULT 'C:\_work\llvm-project\llvm-project\clang\test\Preprocessor\init.c'
# note: command had no output on stdout or stderr
# RUN: at line 217
c:\_work\llvm-project\llvm-project\build\bin\clang.exe -cc1 -internal-isystem C:\_work\llvm-project\llvm-project\build\lib\clang\24\include -nostdsysteminc -E -dM -triple=x86_64-pc-linux-gnu < /dev/null | c:\_work\llvm-project\llvm-project\build\bin\filecheck.exe -match-full-lines -check-prefix C-DEFAULT C:\_work\llvm-project\llvm-project\clang\test\Preprocessor\init.c
# executed command: 'c:\_work\llvm-project\llvm-project\build\bin\clang.exe' -cc1 -internal-isystem 'C:\_work\llvm-project\llvm-project\build\lib\clang\24\include' -nostdsysteminc -E -dM -triple=x86_64-pc-linux-gnu
# note: command had no output on stdout or stderr
# executed command: 'c:\_work\llvm-project\llvm-project\build\bin\filecheck.exe' -match-full-lines -check-prefix C-DEFAULT 'C:\_work\llvm-project\llvm-project\clang\test\Preprocessor\init.c'
# note: command had no output on stdout or stderr
# RUN: at line 218
c:\_work\llvm-project\llvm-project\build\bin\clang.exe -cc1 -internal-isystem C:\_work\llvm-project\llvm-project\build\lib\clang\24\include -nostdsysteminc -E -dM -triple=x86_64-apple-darwin < /dev/null | c:\_work\llvm-project\llvm-project\build\bin\filecheck.exe -match-full-lines -check-prefix C-DEFAULT C:\_work\llvm-project\llvm-project\clang\test\Preprocessor\init.c
# executed command: 'c:\_work\llvm-project\llvm-project\build\bin\clang.exe' -cc1 -internal-isystem 'C:\_work\llvm-project\llvm-project\build\lib\clang\24\include' -nostdsysteminc -E -dM -triple=x86_64-apple-darwin
# note: command had no output on stdout or stderr
# executed command: 'c:\_work\llvm-project\llvm-project\build\bin\filecheck.exe' -match-full-lines -check-prefix C-DEFAULT 'C:\_work\llvm-project\llvm-project\clang\test\Preprocessor\init.c'
# note: command had no output on stdout or stderr
# RUN: at line 219
c:\_work\llvm-project\llvm-project\build\bin\clang.exe -cc1 -internal-isystem C:\_work\llvm-project\llvm-project\build\lib\clang\24\include -nostdsysteminc -E -dM -triple=armv7a-apple-darwin < /dev/null | c:\_work\llvm-project\llvm-project\build\bin\filecheck.exe -match-full-lines -check-prefix C-DEFAULT C:\_work\llvm-project\llvm-project\clang\test\Preprocessor\init.c
# executed command: 'c:\_work\llvm-project\llvm-project\build\bin\clang.exe' -cc1 -internal-isystem 'C:\_work\llvm-project\llvm-project\build\lib\clang\24\include' -nostdsysteminc -E -dM -triple=armv7a-apple-darwin
# note: command had no output on stdout or stderr
# executed command: 'c:\_work\llvm-project\llvm-project\build\bin\filecheck.exe' -match-full-lines -check-prefix C-DEFAULT 'C:\_work\llvm-project\llvm-project\clang\test\Preprocessor\init.c'
# note: command had no output on stdout or stderr
# RUN: at line 223
c:\_work\llvm-project\llvm-project\build\bin\clang.exe -cc1 -internal-isystem C:\_work\llvm-project\llvm-project\build\lib\clang\24\include -nostdsysteminc -ffreestanding -E -dM < /dev/null | c:\_work\llvm-project\llvm-project\build\bin\filecheck.exe -match-full-lines -check-prefix FREESTANDING C:\_work\llvm-project\llvm-project\clang\test\Preprocessor\init.c
# executed command: 'c:\_work\llvm-project\llvm-project\build\bin\clang.exe' -cc1 -internal-isystem 'C:\_work\llvm-project\llvm-project\build\lib\clang\24\include' -nostdsysteminc -ffreestanding -E -dM
# note: command had no output on stdout or stderr
# executed command: 'c:\_work\llvm-project\llvm-project\build\bin\filecheck.exe' -match-full-lines -check-prefix FREESTANDING 'C:\_work\llvm-project\llvm-project\clang\test\Preprocessor\init.c'
# note: command had no output on stdout or stderr
# RUN: at line 226
c:\_work\llvm-project\llvm-project\build\bin\clang.exe -cc1 -internal-isystem C:\_work\llvm-project\llvm-project\build\lib\clang\24\include -nostdsysteminc -x c++ -fgnuc-version=4.2.1 -std=gnu++2d -E -dM < /dev/null | c:\_work\llvm-project\llvm-project\build\bin\filecheck.exe -match-full-lines -check-prefix GXX29 C:\_work\llvm-project\llvm-project\clang\test\Preprocessor\init.c
# executed command: 'c:\_work\llvm-project\llvm-project\build\bin\clang.exe' -cc1 -internal-isystem 'C:\_work\llvm-project\llvm-project\build\lib\clang\24\include' -nostdsysteminc -x c++ -fgnuc-version=4.2.1 -std=gnu++2d -E -dM
# note: command had no output on stdout or stderr
# executed command: 'c:\_work\llvm-project\llvm-project\build\bin\filecheck.exe' -match-full-lines -check-prefix GXX29 'C:\_work\llvm-project\llvm-project\clang\test\Preprocessor\init.c'
# note: command had no output on stdout or stderr
# RUN: at line 233
c:\_work\llvm-project\llvm-project\build\bin\clang.exe -cc1 -internal-isystem C:\_work\llvm-project\llvm-project\build\lib\clang\24\include -nostdsysteminc -x c++ -fgnuc-version=4.2.1 -std=gnu++26 -E -dM < /dev/null | c:\_work\llvm-project\llvm-project\build\bin\filecheck.exe -match-full-lines -check-prefix GXX26 C:\_work\llvm-project\llvm-project\clang\test\Preprocessor\init.c
# executed command: 'c:\_work\llvm-project\llvm-project\build\bin\clang.exe' -cc1 -internal-isystem 'C:\_work\llvm-project\llvm-project\build\lib\clang\24\include' -nostdsysteminc -x c++ -fgnuc-version=4.2.1 -std=gnu++26 -E -dM
# note: command had no output on stdout or stderr
# executed command: 'c:\_work\llvm-project\llvm-project\build\bin\filecheck.exe' -match-full-lines -check-prefix GXX26 'C:\_work\llvm-project\llvm-project\clang\test\Preprocessor\init.c'
# note: command had no output on stdout or stderr
# RUN: at line 234
c:\_work\llvm-project\llvm-project\build\bin\clang.exe -cc1 -internal-isystem C:\_work\llvm-project\llvm-project\build\lib\clang\24\include -nostdsysteminc -x c++ -fgnuc-version=4.2.1 -std=gnu++2c -E -dM < /dev/null | c:\_work\llvm-project\llvm-project\build\bin\filecheck.exe -match-full-lines -check-prefix GXX26 C:\_work\llvm-project\llvm-project\clang\test\Preprocessor\init.c
# executed command: 'c:\_work\llvm-project\llvm-project\build\bin\clang.exe' -cc1 -internal-isystem 'C:\_work\llvm-project\llvm-project\build\lib\clang\24\include' -nostdsysteminc -x c++ -fgnuc-version=4.2.1 -std=gnu++2c -E -dM
# note: command had no output on stdout or stderr
# executed command: 'c:\_work\llvm-project\llvm-project\build\bin\filecheck.exe' -match-full-lines -check-prefix GXX26 'C:\_work\llvm-project\llvm-project\clang\test\Preprocessor\init.c'
# note: command had no output on stdout or stderr
# RUN: at line 241
c:\_work\llvm-project\llvm-project\build\bin\clang.exe -cc1 -internal-isystem C:\_work\llvm-project\llvm-project\build\lib\clang\24\include -nostdsysteminc -x c++ -fgnuc-version=4.2.1 -std=gnu++23 -E -dM < /dev/null | c:\_work\llvm-project\llvm-project\build\bin\filecheck.exe -match-full-lines -check-prefix GXX2B C:\_work\llvm-project\llvm-project\clang\test\Preprocessor\init.c
# executed command: 'c:\_work\llvm-project\llvm-project\build\bin\clang.exe' -cc1 -internal-isystem 'C:\_work\llvm-project\llvm-project\build\lib\clang\24\include' -nostdsysteminc -x c++ -fgnuc-version=4.2.1 -std=gnu++23 -E -dM
# note: command had no output on stdout or stderr
# executed command: 'c:\_work\llvm-project\llvm-project\build\bin\filecheck.exe' -match-full-lines -check-prefix GXX2B 'C:\_work\llvm-project\llvm-project\clang\test\Preprocessor\init.c'
# note: command had no output on stdout or stderr
# RUN: at line 242
c:\_work\llvm-project\llvm-project\build\bin\clang.exe -cc1 -internal-isystem C:\_work\llvm-project\llvm-project\build\lib\clang\24\include -nostdsysteminc -x c++ -fgnuc-version=4.2.1 -std=gnu++2b -E -dM < /dev/null | c:\_work\llvm-project\llvm-project\build\bin\filecheck.exe -match-full-lines -check-prefix GXX2B C:\_work\llvm-project\llvm-project\clang\test\Preprocessor\init.c
# executed command: 'c:\_work\llvm-project\llvm-project\build\bin\clang.exe' -cc1 -internal-isystem 'C:\_work\llvm-project\llvm-project\build\lib\clang\24\include' -nostdsysteminc -x c++ -fgnuc-version=4.2.1 -std=gnu++2b -E -dM
# note: command had no output on stdout or stderr
# executed command: 'c:\_work\llvm-project\llvm-project\build\bin\filecheck.exe' -match-full-lines -check-prefix GXX2B 'C:\_work\llvm-project\llvm-project\clang\test\Preprocessor\init.c'
# note: command had no output on stdout or stderr
# RUN: at line 249
c:\_work\llvm-project\llvm-project\build\bin\clang.exe -cc1 -internal-isystem C:\_work\llvm-project\llvm-project\build\lib\clang\24\include -nostdsysteminc -x c++ -fgnuc-version=4.2.1 -std=gnu++20 -E -dM < /dev/null | c:\_work\llvm-project\llvm-project\build\bin\filecheck.exe -match-full-lines -check-prefix GXX2A C:\_work\llvm-project\llvm-project\clang\test\Preprocessor\init.c
# executed command: 'c:\_work\llvm-project\llvm-project\build\bin\clang.exe' -cc1 -internal-isystem 'C:\_work\llvm-project\llvm-project\build\lib\clang\24\include' -nostdsysteminc -x c++ -fgnuc-version=4.2.1 -std=gnu++20 -E -dM
# note: command had no output on stdout or stderr
# executed command: 'c:\_work\llvm-project\llvm-project\build\bin\filecheck.exe' -match-full-lines -check-prefix GXX2A 'C:\_work\llvm-project\llvm-project\clang\test\Preprocessor\init.c'
# note: command had no output on stdout or stderr
# RUN: at line 250
c:\_work\llvm-project\llvm-project\build\bin\clang.exe -cc1 -internal-isystem C:\_work\llvm-project\llvm-project\build\lib\clang\24\include -nostdsysteminc -x c++ -fgnuc-version=4.2.1 -std=gnu++2a -E -dM < /dev/null | c:\_work\llvm-project\llvm-project\build\bin\filecheck.exe -match-full-lines -check-prefix GXX2A C:\_work\llvm-project\llvm-project\clang\test\Preprocessor\init.c
# executed command: 'c:\_work\llvm-project\llvm-project\build\bin\clang.exe' -cc1 -internal-isystem 'C:\_work\llvm-project\llvm-project\build\lib\clang\24\include' -nostdsysteminc -x c++ -fgnuc-version=4.2.1 -std=gnu++2a -E -dM
# note: command had no output on stdout or stderr
# executed command: 'c:\_work\llvm-project\llvm-project\build\bin\filecheck.exe' -match-full-lines -check-prefix GXX2A 'C:\_work\llvm-project\llvm-project\clang\test\Preprocessor\init.c'
# note: command had no output on stdout or stderr
# RUN: at line 258
c:\_work\llvm-project\llvm-project\build\bin\clang.exe -cc1 -internal-isystem C:\_work\llvm-project\llvm-project\build\lib\clang\24\include -nostdsysteminc -x c++ -fgnuc-version=4.2.1 -std=gnu++17 -E -dM < /dev/null | c:\_work\llvm-project\llvm-project\build\bin\filecheck.exe -match-full-lines -check-prefix GXX1Z C:\_work\llvm-project\llvm-project\clang\test\Preprocessor\init.c
# executed command: 'c:\_work\llvm-project\llvm-project\build\bin\clang.exe' -cc1 -internal-isystem 'C:\_work\llvm-project\llvm-project\build\lib\clang\24\include' -nostdsysteminc -x c++ -fgnuc-version=4.2.1 -std=gnu++17 -E -dM
# note: command had no output on stdout or stderr
# executed command: 'c:\_work\llvm-project\llvm-project\build\bin\filecheck.exe' -match-full-lines -check-prefix GXX1Z 'C:\_work\llvm-project\llvm-project\clang\test\Preprocessor\init.c'
# note: command had no output on stdout or stderr
# RUN: at line 259
c:\_work\llvm-project\llvm-project\build\bin\clang.exe -cc1 -internal-isystem C:\_work\llvm-project\llvm-project\build\lib\clang\24\include -nostdsysteminc -x c++ -fgnuc-version=4.2.1 -std=gnu++1z -E -dM < /dev/null | c:\_work\llvm-project\llvm-project\build\bin\filecheck.exe -match-full-lines -check-prefix GXX1Z C:\_work\llvm-project\llvm-project\clang\test\Preprocessor\init.c
# executed command: 'c:\_work\llvm-project\llvm-project\build\bin\clang.exe' -cc1 -internal-isystem 'C:\_work\llvm-project\llvm-project\build\lib\clang\24\include' -nostdsysteminc -x c++ -fgnuc-version=4.2.1 -std=gnu++1z -E -dM
# note: command had no output on stdout or stderr
# executed command: 'c:\_work\llvm-project\llvm-project\build\bin\filecheck.exe' -match-full-lines -check-prefix GXX1Z 'C:\_work\llvm-project\llvm-project\clang\test\Preprocessor\init.c'
# note: command had no output on stdout or stderr
# RUN: at line 267
c:\_work\llvm-project\llvm-project\build\bin\clang.exe -cc1 -internal-isystem C:\_work\llvm-project\llvm-project\build\lib\clang\24\include -nostdsysteminc -x c++ -fgnuc-version=4.2.1 -std=gnu++14 -E -dM < /dev/null | c:\_work\llvm-project\llvm-project\build\bin\filecheck.exe -match-full-lines -check-prefix GXX1Y C:\_work\llvm-project\llvm-project\clang\test\Preprocessor\init.c
# executed command: 'c:\_work\llvm-project\llvm-project\build\bin\clang.exe' -cc1 -internal-isystem 'C:\_work\llvm-project\llvm-project\build\lib\clang\24\include' -nostdsysteminc -x c++ -fgnuc-version=4.2.1 -std=gnu++14 -E -dM
# note: command had no output on stdout or stderr
# executed command: 'c:\_work\llvm-project\llvm-project\build\bin\filecheck.exe' -match-full-lines -check-prefix GXX1Y 'C:\_work\llvm-project\llvm-project\clang\test\Preprocessor\init.c'
# note: command had no output on stdout or stderr
# RUN: at line 268
c:\_work\llvm-project\llvm-project\build\bin\clang.exe -cc1 -internal-isystem C:\_work\llvm-project\llvm-project\build\lib\clang\24\include -nostdsysteminc -x c++ -fgnuc-version=4.2.1 -std=gnu++1y -E -dM < /dev/null | c:\_work\llvm-project\llvm-project\build\bin\filecheck.exe -match-full-lines -check-prefix GXX1Y C:\_work\llvm-project\llvm-project\clang\test\Preprocessor\init.c
# executed command: 'c:\_work\llvm-project\llvm-project\build\bin\clang.exe' -cc1 -internal-isystem 'C:\_work\llvm-project\llvm-project\build\lib\clang\24\include' -nostdsysteminc -x c++ -fgnuc-version=4.2.1 -std=gnu++1y -E -dM
# note: command had no output on stdout or stderr
# executed command: 'c:\_work\llvm-project\llvm-project\build\bin\filecheck.exe' -match-full-lines -check-prefix GXX1Y 'C:\_work\llvm-project\llvm-project\clang\test\Preprocessor\init.c'
# note: command had no output on stdout or stderr
# RUN: at line 276
c:\_work\llvm-project\llvm-project\build\bin\clang.exe -cc1 -internal-isystem C:\_work\llvm-project\llvm-project\build\lib\clang\24\include -nostdsysteminc -x c++ -fgnuc-version=4.2.1 -std=gnu++11 -E -dM < /dev/null | c:\_work\llvm-project\llvm-project\build\bin\filecheck.exe -match-full-lines -check-prefix GXX11 C:\_work\llvm-project\llvm-project\clang\test\Preprocessor\init.c
# executed command: 'c:\_work\llvm-project\llvm-project\build\bin\clang.exe' -cc1 -internal-isystem 'C:\_work\llvm-project\llvm-project\build\lib\clang\24\include' -nostdsysteminc -x c++ -fgnuc-version=4.2.1 -std=gnu++11 -E -dM
# note: command had no output on stdout or stderr
# executed command: 'c:\_work\llvm-project\llvm-project\build\bin\filecheck.exe' -match-full-lines -check-prefix GXX11 'C:\_work\llvm-project\llvm-project\clang\test\Preprocessor\init.c'
# note: command had no output on stdout or stderr
# RUN: at line 284
c:\_work\llvm-project\llvm-project\build\bin\clang.exe -cc1 -internal-isystem C:\_work\llvm-project\llvm-project\build\lib\clang\24\include -nostdsysteminc -x c++ -fgnuc-version=4.2.1 -std=gnu++98 -E -dM < /dev/null | c:\_work\llvm-project\llvm-project\build\bin\filecheck.exe -match-full-lines -check-prefix GXX98 C:\_work\llvm-project\llvm-project\clang\test\Preprocessor\init.c
# executed command: 'c:\_work\llvm-project\llvm-project\build\bin\clang.exe' -cc1 -internal-isystem 'C:\_work\llvm-project\llvm-project\build\lib\clang\24\include' -nostdsysteminc -x c++ -fgnuc-version=4.2.1 -std=gnu++98 -E -dM
# note: command had no output on stdout or stderr
# executed command: 'c:\_work\llvm-project\llvm-project\build\bin\filecheck.exe' -match-full-lines -check-prefix GXX98 'C:\_work\llvm-project\llvm-project\clang\test\Preprocessor\init.c'
# note: command had no output on stdout or stderr
# RUN: at line 292
c:\_work\llvm-project\llvm-project\build\bin\clang.exe -cc1 -internal-isystem C:\_work\llvm-project\llvm-project\build\lib\clang\24\include -nostdsysteminc -std=iso9899:199409 -E -dM < /dev/null | c:\_work\llvm-project\llvm-project\build\bin\filecheck.exe -match-full-lines -check-prefix C94 C:\_work\llvm-project\llvm-project\clang\test\Preprocessor\init.c
# executed command: 'c:\_work\llvm-project\llvm-project\build\bin\clang.exe' -cc1 -internal-isystem 'C:\_work\llvm-project\llvm-project\build\lib\clang\24\include' -nostdsysteminc -std=iso9899:199409 -E -dM
# note: command had no output on stdout or stderr
# executed command: 'c:\_work\llvm-project\llvm-project\build\bin\filecheck.exe' -match-full-lines -check-prefix C94 'C:\_work\llvm-project\llvm-project\clang\test\Preprocessor\init.c'
# note: command had no output on stdout or stderr
# RUN: at line 297
c:\_work\llvm-project\llvm-project\build\bin\clang.exe -cc1 -internal-isystem C:\_work\llvm-project\llvm-project\build\lib\clang\24\include -nostdsysteminc -fms-extensions -triple i686-pc-win32 -E -dM < /dev/null | c:\_work\llvm-project\llvm-project\build\bin\filecheck.exe -match-full-lines -check-prefix MSEXT C:\_work\llvm-project\llvm-project\clang\test\Preprocessor\init.c
# executed command: 'c:\_work\llvm-project\llvm-project\build\bin\clang.exe' -cc1 -internal-isystem 'C:\_work\llvm-project\llvm-project\build\lib\clang\24\include' -nostdsysteminc -fms-extensions -triple i686-pc-win32 -E -dM
# note: command had no output on stdout or stderr
# executed command: 'c:\_work\llvm-project\llvm-project\build\bin\filecheck.exe' -match-full-lines -check-prefix MSEXT 'C:\_work\llvm-project\llvm-project\clang\test\Preprocessor\init.c'
# note: command had no output on stdout or stderr
# RUN: at line 307
c:\_work\llvm-project\llvm-project\build\bin\clang.exe -cc1 -internal-isystem C:\_work\llvm-project\llvm-project\build\lib\clang\24\include -nostdsysteminc -x c++ -fms-extensions -triple i686-pc-win32 -E -dM < /dev/null | c:\_work\llvm-project\llvm-project\build\bin\filecheck.exe -match-full-lines -check-prefix MSEXT-CXX C:\_work\llvm-project\llvm-project\clang\test\Preprocessor\init.c
# executed command: 'c:\_work\llvm-project\llvm-project\build\bin\clang.exe' -cc1 -internal-isystem 'C:\_work\llvm-project\llvm-project\build\lib\clang\24\include' -nostdsysteminc -x c++ -fms-extensions -triple i686-pc-win32 -E -dM
# note: command had no output on stdout or stderr
# executed command: 'c:\_work\llvm-project\llvm-project\build\bin\filecheck.exe' -match-full-lines -check-prefix MSEXT-CXX 'C:\_work\llvm-project\llvm-project\clang\test\Preprocessor\init.c'
# note: command had no output on stdout or stderr
# RUN: at line 314
c:\_work\llvm-project\llvm-project\build\bin\clang.exe -cc1 -internal-isystem C:\_work\llvm-project\llvm-project\build\lib\clang\24\include -nostdsysteminc -x c++ -fno-wchar -fms-extensions -triple i686-pc-win32 -E -dM < /dev/null | c:\_work\llvm-project\llvm-project\build\bin\filecheck.exe -match-full-lines -check-prefix MSEXT-CXX-NOWCHAR C:\_work\llvm-project\llvm-project\clang\test\Preprocessor\init.c
# executed command: 'c:\_work\llvm-project\llvm-project\build\bin\clang.exe' -cc1 -internal-isystem 'C:\_work\llvm-project\llvm-project\build\lib\clang\24\include' -nostdsysteminc -x c++ -fno-wchar -fms-extensions -triple i686-pc-win32 -E -dM
# note: command had no output on stdout or stderr
# executed command: 'c:\_work\llvm-project\llvm-project\build\bin\filecheck.exe' -match-full-lines -check-prefix MSEXT-CXX-NOWCHAR 'C:\_work\llvm-project\llvm-project\clang\test\Preprocessor\init.c'
# note: command had no output on stdout or stderr
# RUN: at line 321
c:\_work\llvm-project\llvm-project\build\bin\clang.exe -cc1 -internal-isystem C:\_work\llvm-project\llvm-project\build\lib\clang\24\include -nostdsysteminc -x objective-c -E -dM < /dev/null | c:\_work\llvm-project\llvm-project\build\bin\filecheck.exe -match-full-lines -check-prefix OBJC C:\_work\llvm-project\llvm-project\clang\test\Preprocessor\init.c
# executed command: 'c:\_work\llvm-project\llvm-project\build\bin\clang.exe' -cc1 -internal-isystem 'C:\_work\llvm-project\llvm-project\build\lib\clang\24\include' -nostdsysteminc -x objective-c -E -dM
# note: command had no output on stdout or stderr
# executed command: 'c:\_work\llvm-project\llvm-project\build\bin\filecheck.exe' -match-full-lines -check-prefix OBJC 'C:\_work\llvm-project\llvm-project\clang\test\Preprocessor\init.c'
# note: command had no output on stdout or stderr
# RUN: at line 322
c:\_work\llvm-project\llvm-project\build\bin\clang.exe -cc1 -internal-isystem C:\_work\llvm-project\llvm-project\build\lib\clang\24\include -nostdsysteminc -x objective-c++ -E -dM < /dev/null | c:\_work\llvm-project\llvm-project\build\bin\filecheck.exe -match-full-lines -check-prefix OBJC C:\_work\llvm-project\llvm-project\clang\test\Preprocessor\init.c
# executed command: 'c:\_work\llvm-project\llvm-project\build\bin\clang.exe' -cc1 -internal-isystem 'C:\_work\llvm-project\llvm-project\build\lib\clang\24\include' -nostdsysteminc -x objective-c++ -E -dM
# note: command had no output on stdout or stderr
# executed command: 'c:\_work\llvm-project\llvm-project\build\bin\filecheck.exe' -match-full-lines -check-prefix OBJC 'C:\_work\llvm-project\llvm-project\clang\test\Preprocessor\init.c'
# note: command had no output on stdout or stderr
# RUN: at line 329
c:\_work\llvm-project\llvm-project\build\bin\clang.exe -cc1 -internal-isystem C:\_work\llvm-project\llvm-project\build\lib\clang\24\include -nostdsysteminc -x objective-c -fobjc-gc -E -dM < /dev/null | c:\_work\llvm-project\llvm-project\build\bin\filecheck.exe -match-full-lines -check-prefix OBJCGC C:\_work\llvm-project\llvm-project\clang\test\Preprocessor\init.c
# executed command: 'c:\_work\llvm-project\llvm-project\build\bin\clang.exe' -cc1 -internal-isystem 'C:\_work\llvm-project\llvm-project\build\lib\clang\24\include' -nostdsysteminc -x objective-c -fobjc-gc -E -dM
# note: command had no output on stdout or stderr
# executed command: 'c:\_work\llvm-project\llvm-project\build\bin\filecheck.exe' -match-full-lines -check-prefix OBJCGC 'C:\_work\llvm-project\llvm-project\clang\test\Preprocessor\init.c'
# note: command had no output on stdout or stderr
# RUN: at line 334
c:\_work\llvm-project\llvm-project\build\bin\clang.exe -cc1 -internal-isystem C:\_work\llvm-project\llvm-project\build\lib\clang\24\include -nostdsysteminc -x objective-c -fobjc-exceptions -E -dM < /dev/null | c:\_work\llvm-project\llvm-project\build\bin\filecheck.exe -match-full-lines -check-prefix NONFRAGILE C:\_work\llvm-project\llvm-project\clang\test\Preprocessor\init.c
# executed command: 'c:\_work\llvm-project\llvm-project\build\bin\clang.exe' -cc1 -internal-isystem 'C:\_work\llvm-project\llvm-project\build\lib\clang\24\include' -nostdsysteminc -x objective-c -fobjc-exceptions -E -dM
# note: command had no output on stdout or stderr
# executed command: 'c:\_work\llvm-project\llvm-project\build\bin\filecheck.exe' -match-full-lines -check-prefix NONFRAGILE 'C:\_work\llvm-project\llvm-project\clang\test\Preprocessor\init.c'
# note: command had no output on stdout or stderr
# RUN: at line 340
c:\_work\llvm-project\llvm-project\build\bin\clang.exe -cc1 -internal-isystem C:\_work\llvm-project\llvm-project\build\lib\clang\24\include -nostdsysteminc -E -dM < /dev/null | c:\_work\llvm-project\llvm-project\build\bin\filecheck.exe -match-full-lines -check-prefix O0 C:\_work\llvm-project\llvm-project\clang\test\Preprocessor\init.c
# executed command: 'c:\_work\llvm-project\llvm-project\build\bin\clang.exe' -cc1 -internal-isystem 'C:\_work\llvm-project\llvm-project\build\lib\clang\24\include' -nostdsysteminc -E -dM
# note: command had no output on stdout or stderr
# executed command: 'c:\_work\llvm-project\llvm-project\build\bin\filecheck.exe' -match-full-lines -check-prefix O0 'C:\_work\llvm-project\llvm-project\clang\test\Preprocessor\init.c'
# note: command had no output on stdout or stderr
# RUN: at line 347
c:\_work\llvm-project\llvm-project\build\bin\clang.exe -cc1 -internal-isystem C:\_work\llvm-project\llvm-project\build\lib\clang\24\include -nostdsysteminc -fno-inline -O3 -E -dM < /dev/null | c:\_work\llvm-project\llvm-project\build\bin\filecheck.exe -match-full-lines -check-prefix NO_INLINE C:\_work\llvm-project\llvm-project\clang\test\Preprocessor\init.c
# executed command: 'c:\_work\llvm-project\llvm-project\build\bin\clang.exe' -cc1 -internal-isystem 'C:\_work\llvm-project\llvm-project\build\lib\clang\24\include' -nostdsysteminc -fno-inline -O3 -E -dM
# note: command had no output on stdout or stderr
# executed command: 'c:\_work\llvm-project\llvm-project\build\bin\filecheck.exe' -match-full-lines -check-prefix NO_INLINE 'C:\_work\llvm-project\llvm-project\clang\test\Preprocessor\init.c'
# note: command had no output on stdout or stderr
# RUN: at line 354
c:\_work\llvm-project\llvm-project\build\bin\clang.exe -cc1 -internal-isystem C:\_work\llvm-project\llvm-project\build\lib\clang\24\include -nostdsysteminc -O1 -E -dM < /dev/null | c:\_work\llvm-project\llvm-project\build\bin\filecheck.exe -match-full-lines -check-prefix O1 C:\_work\llvm-project\llvm-project\clang\test\Preprocessor\init.c
# executed command: 'c:\_work\llvm-project\llvm-project\build\bin\clang.exe' -cc1 -internal-isystem 'C:\_work\llvm-project\llvm-project\build\lib\clang\24\include' -nostdsysteminc -O1 -E -dM
# note: command had no output on stdout or stderr
# executed command: 'c:\_work\llvm-project\llvm-project\build\bin\filecheck.exe' -match-full-lines -check-prefix O1 'C:\_work\llvm-project\llvm-project\clang\test\Preprocessor\init.c'
# note: command had no output on stdout or stderr
# RUN: at line 360
c:\_work\llvm-project\llvm-project\build\bin\clang.exe -cc1 -internal-isystem C:\_work\llvm-project\llvm-project\build\lib\clang\24\include -nostdsysteminc -Og -E -dM < /dev/null | c:\_work\llvm-project\llvm-project\build\bin\filecheck.exe -match-full-lines -check-prefix Og C:\_work\llvm-project\llvm-project\clang\test\Preprocessor\init.c
# executed command: 'c:\_work\llvm-project\llvm-project\build\bin\clang.exe' -cc1 -internal-isystem 'C:\_work\llvm-project\llvm-project\build\lib\clang\24\include' -nostdsysteminc -Og -E -dM
# note: command had no output on stdout or stderr
# executed command: 'c:\_work\llvm-project\llvm-project\build\bin\filecheck.exe' -match-full-lines -check-prefix Og 'C:\_work\llvm-project\llvm-project\clang\test\Preprocessor\init.c'
# note: command had no output on stdout or stderr
# RUN: at line 366
c:\_work\llvm-project\llvm-project\build\bin\clang.exe -cc1 -internal-isystem C:\_work\llvm-project\llvm-project\build\lib\clang\24\include -nostdsysteminc -Os -E -dM < /dev/null | c:\_work\llvm-project\llvm-project\build\bin\filecheck.exe -match-full-lines -check-prefix Os C:\_work\llvm-project\llvm-project\clang\test\Preprocessor\init.c
# executed command: 'c:\_work\llvm-project\llvm-project\build\bin\clang.exe' -cc1 -internal-isystem 'C:\_work\llvm-project\llvm-project\build\lib\clang\24\include' -nostdsysteminc -Os -E -dM
# note: command had no output on stdout or stderr
# executed command: 'c:\_work\llvm-project\llvm-project\build\bin\filecheck.exe' -match-full-lines -check-prefix Os 'C:\_work\llvm-project\llvm-project\clang\test\Preprocessor\init.c'
# note: command had no output on stdout or stderr
# RUN: at line 372
c:\_work\llvm-project\llvm-project\build\bin\clang.exe -cc1 -internal-isystem C:\_work\llvm-project\llvm-project\build\lib\clang\24\include -nostdsysteminc -Oz -E -dM < /dev/null | c:\_work\llvm-project\llvm-project\build\bin\filecheck.exe -match-full-lines -check-prefix Oz C:\_work\llvm-project\llvm-project\clang\test\Preprocessor\init.c
# executed command: 'c:\_work\llvm-project\llvm-project\build\bin\clang.exe' -cc1 -internal-isystem 'C:\_work\llvm-project\llvm-project\build\lib\clang\24\include' -nostdsysteminc -Oz -E -dM
# note: command had no output on stdout or stderr
# executed command: 'c:\_work\llvm-project\llvm-project\build\bin\filecheck.exe' -match-full-lines -check-prefix Oz 'C:\_work\llvm-project\llvm-project\clang\test\Preprocessor\init.c'
# note: command had no output on stdout or stderr
# RUN: at line 378
c:\_work\llvm-project\llvm-project\build\bin\clang.exe -cc1 -internal-isystem C:\_work\llvm-project\llvm-project\build\lib\clang\24\include -nostdsysteminc -fpascal-strings -E -dM < /dev/null | c:\_work\llvm-project\llvm-project\build\bin\filecheck.exe -match-full-lines -check-prefix PASCAL C:\_work\llvm-project\llvm-project\clang\test\Preprocessor\init.c
# executed command: 'c:\_work\llvm-project\llvm-project\build\bin\clang.exe' -cc1 -internal-isystem 'C:\_work\llvm-project\llvm-project\build\lib\clang\24\include' -nostdsysteminc -fpascal-strings -E -dM
# note: command had no output on stdout or stderr
# executed command: 'c:\_work\llvm-project\llvm-project\build\bin\filecheck.exe' -match-full-lines -check-prefix PASCAL 'C:\_work\llvm-project\llvm-project\clang\test\Preprocessor\init.c'
# note: command had no output on stdout or stderr
# RUN: at line 383
c:\_work\llvm-project\llvm-project\build\bin\clang.exe -cc1 -internal-isystem C:\_work\llvm-project\llvm-project\build\lib\clang\24\include -nostdsysteminc -E -dM < /dev/null | c:\_work\llvm-project\llvm-project\build\bin\filecheck.exe -match-full-lines -check-prefix SCHAR C:\_work\llvm-project\llvm-project\clang\test\Preprocessor\init.c
# executed command: 'c:\_work\llvm-project\llvm-project\build\bin\clang.exe' -cc1 -internal-isystem 'C:\_work\llvm-project\llvm-project\build\lib\clang\24\include' -nostdsysteminc -E -dM
# note: command had no output on stdout or stderr
# executed command: 'c:\_work\llvm-project\llvm-project\build\bin\filecheck.exe' -match-full-lines -check-prefix SCHAR 'C:\_work\llvm-project\llvm-project\clang\test\Preprocessor\init.c'
# note: command had no output on stdout or stderr
# RUN: at line 389
c:\_work\llvm-project\llvm-project\build\bin\clang.exe -cc1 -internal-isystem C:\_work\llvm-project\llvm-project\build\lib\clang\24\include -nostdsysteminc -E -dM -fwchar-type=short -fno-signed-wchar < /dev/null | c:\_work\llvm-project\llvm-project\build\bin\filecheck.exe -match-full-lines -check-prefix SHORTWCHAR C:\_work\llvm-project\llvm-project\clang\test\Preprocessor\init.c
# executed command: 'c:\_work\llvm-project\llvm-project\build\bin\clang.exe' -cc1 -internal-isystem 'C:\_work\llvm-project\llvm-project\build\lib\clang\24\include' -nostdsysteminc -E -dM -fwchar-type=short -fno-signed-wchar
# note: command had no output on stdout or stderr
# executed command: 'c:\_work\llvm-project\llvm-project\build\bin\filecheck.exe' -match-full-lines -check-prefix SHORTWCHAR 'C:\_work\llvm-project\llvm-project\clang\test\Preprocessor\init.c'
# note: command had no output on stdout or stderr
# RUN: at line 391
c:\_work\llvm-project\llvm-project\build\bin\clang.exe -cc1 -internal-isystem C:\_work\llvm-project\llvm-project\build\lib\clang\24\include -nostdsysteminc -E -dM -fwchar-type=short -fno-signed-wchar -triple=x86_64-w64-mingw32 < /dev/null | c:\_work\llvm-project\llvm-project\build\bin\filecheck.exe -match-full-lines -check-prefix SHORTWCHAR C:\_work\llvm-project\llvm-project\clang\test\Preprocessor\init.c
# executed command: 'c:\_work\llvm-project\llvm-project\build\bin\clang.exe' -cc1 -internal-isystem 'C:\_work\llvm-project\llvm-project\build\lib\clang\24\include' -nostdsysteminc -E -dM -fwchar-type=short -fno-signed-wchar -triple=x86_64-w64-mingw32
# note: command had no output on stdout or stderr
# executed command: 'c:\_work\llvm-project\llvm-project\build\bin\filecheck.exe' -match-full-lines -check-prefix SHORTWCHAR 'C:\_work\llvm-project\llvm-project\clang\test\Preprocessor\init.c'
# note: command had no output on stdout or stderr
# RUN: at line 392
c:\_work\llvm-project\llvm-project\build\bin\clang.exe -cc1 -internal-isystem C:\_work\llvm-project\llvm-project\build\lib\clang\24\include -nostdsysteminc -dM -fwchar-type=short -fno-signed-wchar -triple=x86_64-unknown-windows-cygnus -E /dev/null | c:\_work\llvm-project\llvm-project\build\bin\filecheck.exe -match-full-lines -check-prefix SHORTWCHAR C:\_work\llvm-project\llvm-project\clang\test\Preprocessor\init.c
# executed command: 'c:\_work\llvm-project\llvm-project\build\bin\clang.exe' -cc1 -internal-isystem 'C:\_work\llvm-project\llvm-project\build\lib\clang\24\include' -nostdsysteminc -dM -fwchar-type=short -fno-signed-wchar -triple=x86_64-unknown-windows-cygnus -E /dev/null
# note: command had no output on stdout or stderr
# executed command: 'c:\_work\llvm-project\llvm-project\build\bin\filecheck.exe' -match-full-lines -check-prefix SHORTWCHAR 'C:\_work\llvm-project\llvm-project\clang\test\Preprocessor\init.c'
# note: command had no output on stdout or stderr
# RUN: at line 399
c:\_work\llvm-project\llvm-project\build\bin\clang.exe -cc1 -internal-isystem C:\_work\llvm-project\llvm-project\build\lib\clang\24\include -nostdsysteminc -E -dM -fwchar-type=int -triple=i686-unknown-unknown < /dev/null | c:\_work\llvm-project\llvm-project\build\bin\filecheck.exe -match-full-lines -check-prefix SHORTWCHAR2 C:\_work\llvm-project\llvm-project\clang\test\Preprocessor\init.c
# executed command: 'c:\_work\llvm-project\llvm-project\build\bin\clang.exe' -cc1 -internal-isystem 'C:\_work\llvm-project\llvm-project\build\lib\clang\24\include' -nostdsysteminc -E -dM -fwchar-type=int -triple=i686-unknown-unknown
# note: command had no output on stdout or stderr
# executed command: 'c:\_work\llvm-project\llvm-project\build\bin\filecheck.exe' -match-full-lines -check-prefix SHORTWCHAR2 'C:\_work\llvm-project\llvm-project\clang\test\Preprocessor\init.c'
# note: command had no output on stdout or stderr
# RUN: at line 400
c:\_work\llvm-project\llvm-project\build\bin\clang.exe -cc1 -internal-isystem C:\_work\llvm-project\llvm-project\build\lib\clang\24\include -nostdsysteminc -E -dM -fwchar-type=int -triple=x86_64-unknown-unknown < /dev/null | c:\_work\llvm-project\llvm-project\build\bin\filecheck.exe -match-full-lines -check-prefix SHORTWCHAR2 C:\_work\llvm-project\llvm-project\clang\test\Preprocessor\init.c
# executed command: 'c:\_work\llvm-project\llvm-project\build\bin\clang.exe' -cc1 -internal-isystem 'C:\_work\llvm-project\llvm-project\build\lib\clang\24\include' -nostdsysteminc -E -dM -fwchar-type=int -triple=x86_64-unknown-unknown
# note: command had no output on stdout or stderr
# executed command: 'c:\_work\llvm-project\llvm-project\build\bin\filecheck.exe' -match-full-lines -check-prefix SHORTWCHAR2 'C:\_work\llvm-project\llvm-project\clang\test\Preprocessor\init.c'
# note: command had no output on stdout or stderr
# RUN: at line 407
c:\_work\llvm-project\llvm-project\build\bin\clang.exe -cc1 -internal-isystem C:\_work\llvm-project\llvm-project\build\lib\clang\24\include -nostdsysteminc -E -dM -ffreestanding -triple=msp430-none-none < /dev/null | c:\_work\llvm-project\llvm-project\build\bin\filecheck.exe -match-full-lines -check-prefix MSP430 C:\_work\llvm-project\llvm-project\clang\test\Preprocessor\init.c
# executed command: 'c:\_work\llvm-project\llvm-project\build\bin\clang.exe' -cc1 -internal-isystem 'C:\_work\llvm-project\llvm-project\build\lib\clang\24\include' -nostdsysteminc -E -dM -ffreestanding -triple=msp430-none-none
# note: command had no output on stdout or stderr
# executed command: 'c:\_work\llvm-project\llvm-project\build\bin\filecheck.exe' -match-full-lines -check-prefix MSP430 'C:\_work\llvm-project\llvm-project\clang\test\Preprocessor\init.c'
# note: command had no output on stdout or stderr
# RUN: at line 408
c:\_work\llvm-project\llvm-project\build\bin\clang.exe -cc1 -internal-isystem C:\_work\llvm-project\llvm-project\build\lib\clang\24\include -nostdsysteminc -x c++ -E -dM -ffreestanding -triple=msp430-none-none < /dev/null | c:\_work\llvm-project\llvm-project\build\bin\filecheck.exe -match-full-lines -check-prefix MSP430 -check-prefix MSP430-CXX C:\_work\llvm-project\llvm-project\clang\test\Preprocessor\init.c
# executed command: 'c:\_work\llvm-project\llvm-project\build\bin\clang.exe' -cc1 -internal-isystem 'C:\_work\llvm-project\llvm-project\build\lib\clang\24\include' -nostdsysteminc -x c++ -E -dM -ffreestanding -triple=msp430-none-none
# note: command had no output on stdout or stderr
# executed command: 'c:\_work\llvm-project\llvm-project\build\bin\filecheck.exe' -match-full-lines -check-prefix MSP430 -check-prefix MSP430-CXX 'C:\_work\llvm-project\llvm-project\clang\test\Preprocessor\init.c'
# note: command had no output on stdout or stderr
# RUN: at line 603
c:\_work\llvm-project\llvm-project\build\bin\clang.exe -cc1 -internal-isystem C:\_work\llvm-project\llvm-project\build\lib\clang\24\include -nostdsysteminc -E -dM -ffreestanding -triple=nvptx-none-none < /dev/null | c:\_work\llvm-project\llvm-project\build\bin\filecheck.exe -match-full-lines -check-prefix NVPTX32 C:\_work\llvm-project\llvm-project\clang\test\Preprocessor\init.c
# executed command: 'c:\_work\llvm-project\llvm-project\build\bin\clang.exe' -cc1 -internal-isystem 'C:\_work\llvm-project\llvm-project\build\lib\clang\24\include' -nostdsysteminc -E -dM -ffreestanding -triple=nvptx-none-none
# note: command had no output on stdout or stderr
# executed command: 'c:\_work\llvm-project\llvm-project\build\bin\filecheck.exe' -match-full-lines -check-prefix NVPTX32 'C:\_work\llvm-project\llvm-project\clang\test\Preprocessor\init.c'
# note: command had no output on stdout or stderr
# RUN: at line 604
c:\_work\llvm-project\llvm-project\build\bin\clang.exe -cc1 -internal-isystem C:\_work\llvm-project\llvm-project\build\lib\clang\24\include -nostdsysteminc -x c++ -E -dM -ffreestanding -triple=nvptx-none-none < /dev/null | c:\_work\llvm-project\llvm-project\build\bin\filecheck.exe -match-full-lines -check-prefix NVPTX32 -check-prefix NVPTX32-CXX C:\_work\llvm-project\llvm-project\clang\test\Preprocessor\init.c
# executed command: 'c:\_work\llvm-project\llvm-project\build\bin\clang.exe' -cc1 -internal-isystem 'C:\_work\llvm-project\llvm-project\build\lib\clang\24\include' -nostdsysteminc -x c++ -E -dM -ffreestanding -triple=nvptx-none-none
# note: command had no output on stdout or stderr
# executed command: 'c:\_work\llvm-project\llvm-project\build\bin\filecheck.exe' -match-full-lines -check-prefix NVPTX32 -check-prefix NVPTX32-CXX 'C:\_work\llvm-project\llvm-project\clang\test\Preprocessor\init.c'
# note: command had no output on stdout or stderr
# RUN: at line 801
c:\_work\llvm-project\llvm-project\build\bin\clang.exe -cc1 -internal-isystem C:\_work\llvm-project\llvm-project\build\lib\clang\24\include -nostdsysteminc -E -dM -ffreestanding -triple=nvptx64-none-none < /dev/null | c:\_work\llvm-project\llvm-project\build\bin\filecheck.exe -match-full-lines -check-prefix NVPTX64 C:\_work\llvm-project\llvm-project\clang\test\Preprocessor\init.c
# executed command: 'c:\_work\llvm-project\llvm-project\build\bin\clang.exe' -cc1 -internal-isystem 'C:\_work\llvm-project\llvm-project\build\lib\clang\24\include' -nostdsysteminc -E -dM -ffreestanding -triple=nvptx64-none-none
# note: command had no output on stdout or stderr
# executed command: 'c:\_work\llvm-project\llvm-project\build\bin\filecheck.exe' -match-full-lines -check-prefix NVPTX64 'C:\_work\llvm-project\llvm-project\clang\test\Preprocessor\init.c'
# note: command had no output on stdout or stderr
# RUN: at line 802
c:\_work\llvm-project\llvm-project\build\bin\clang.exe -cc1 -internal-isystem C:\_work\llvm-project\llvm-project\build\lib\clang\24\include -nostdsysteminc -x c++ -E -dM -ffreestanding -triple=nvptx64-none-none < /dev/null | c:\_work\llvm-project\llvm-project\build\bin\filecheck.exe -match-full-lines -check-prefix NVPTX64 -check-prefix NVPTX64-CXX C:\_work\llvm-project\llvm-project\clang\test\Preprocessor\init.c
# executed command: 'c:\_work\llvm-project\llvm-project\build\bin\clang.exe' -cc1 -internal-isystem 'C:\_work\llvm-project\llvm-project\build\lib\clang\24\include' -nostdsysteminc -x c++ -E -dM -ffreestanding -triple=nvptx64-none-none
# note: command had no output on stdout or stderr
# executed command: 'c:\_work\llvm-project\llvm-project\build\bin\filecheck.exe' -match-full-lines -check-prefix NVPTX64 -check-prefix NVPTX64-CXX 'C:\_work\llvm-project\llvm-project\clang\test\Preprocessor\init.c'
# note: command had no output on stdout or stderr
# RUN: at line 1000
c:\_work\llvm-project\llvm-project\build\bin\clang.exe -cc1 -internal-isystem C:\_work\llvm-project\llvm-project\build\lib\clang\24\include -nostdsysteminc -x cl -E -dM -ffreestanding -triple=amdgpu < /dev/null | c:\_work\llvm-project\llvm-project\build\bin\filecheck.exe -match-full-lines -check-prefix AMDGCN --check-prefix AMDGPU C:\_work\llvm-project\llvm-project\clang\test\Preprocessor\init.c
# executed command: 'c:\_work\llvm-project\llvm-project\build\bin\clang.exe' -cc1 -internal-isystem 'C:\_work\llvm-project\llvm-project\build\lib\clang\24\include' -nostdsysteminc -x cl -E -dM -ffreestanding -triple=amdgpu
# note: command had no output on stdout or stderr
# executed command: 'c:\_work\llvm-project\llvm-project\build\bin\filecheck.exe' -match-full-lines -check-prefix AMDGCN --check-prefix AMDGPU 'C:\_work\llvm-project\llvm-project\clang\test\Preprocessor\init.c'
# note: command had no output on stdout or stderr
# RUN: at line 1001
c:\_work\llvm-project\llvm-project\build\bin\clang.exe -cc1 -internal-isystem C:\_work\llvm-project\llvm-project\build\lib\clang\24\include -nostdsysteminc -x cl -E -dM -ffreestanding -triple=r600 -target-cpu caicos < /dev/null | c:\_work\llvm-project\llvm-project\build\bin\filecheck.exe -match-full-lines --check-prefix AMDGPU C:\_work\llvm-project\llvm-project\clang\test\Preprocessor\init.c
# executed command: 'c:\_work\llvm-project\llvm-project\build\bin\clang.exe' -cc1 -internal-isystem 'C:\_work\llvm-project\llvm-project\build\lib\clang\24\include' -nostdsysteminc -x cl -E -dM -ffreestanding -triple=r600 -target-cpu caicos
# note: command had no output on stdout or stderr
# executed command: 'c:\_work\llvm-project\llvm-project\build\bin\filecheck.exe' -match-full-lines --check-prefix AMDGPU 'C:\_work\llvm-project\llvm-project\clang\test\Preprocessor\init.c'
# note: command had no output on stdout or stderr
# RUN: at line 1011
c:\_work\llvm-project\llvm-project\build\bin\clang.exe -cc1 -internal-isystem C:\_work\llvm-project\llvm-project\build\lib\clang\24\include -nostdsysteminc -E -dM -ffreestanding -fgnuc-version=4.2.1 -triple=sparc-none-none < /dev/null | c:\_work\llvm-project\llvm-project\build\bin\filecheck.exe -match-full-lines -check-prefix SPARC -check-prefix SPARC-DEFAULT -check-prefix SPARC-LDBL64 C:\_work\llvm-project\llvm-project\clang\test\Preprocessor\init.c
# executed command: 'c:\_work\llvm-project\llvm-project\build\bin\clang.exe' -cc1 -internal-isystem 'C:\_work\llvm-project\llvm-project\build\lib\clang\24\include' -nostdsysteminc -E -dM -ffreestanding -fgnuc-version=4.2.1 -triple=sparc-none-none
# note: command had no output on stdout or stderr
# executed command: 'c:\_work\llvm-project\llvm-project\build\bin\filecheck.exe' -match-full-lines -check-prefix SPARC -check-prefix SPARC-DEFAULT -check-prefix SPARC-LDBL64 'C:\_work\llvm-project\llvm-project\clang\test\Preprocessor\init.c'
# note: command had no output on stdout or stderr
# RUN: at line 1012
c:\_work\llvm-project\llvm-project\build\bin\clang.exe -cc1 -internal-isystem C:\_work\llvm-project\llvm-project\build\lib\clang\24\include -nostdsysteminc -E -dM -ffreestanding -fgnuc-version=4.2.1 -triple=sparc-rtems-elf < /dev/null | c:\_work\llvm-project\llvm-project\build\bin\filecheck.exe -match-full-lines -check-prefix SPARC -check-prefix SPARC-DEFAULT -check-prefix SPARC-LDBL64 C:\_work\llvm-project\llvm-project\clang\test\Preprocessor\init.c
# executed command: 'c:\_work\llvm-project\llvm-project\build\bin\clang.exe' -cc1 -internal-isystem 'C:\_work\llvm-project\llvm-project\build\lib\clang\24\include' -nostdsysteminc -E -dM -ffreestanding -fgnuc-version=4.2.1 -triple=sparc-rtems-elf
# note: command had no output on stdout or stderr
# executed command: 'c:\_work\llvm-project\llvm-project\build\bin\filecheck.exe' -match-full-lines -check-prefix SPARC -check-prefix SPARC-DEFAULT -check-prefix SPARC-LDBL64 'C:\_work\llvm-project\llvm-project\clang\test\Preprocessor\init.c'
# note: command had no output on stdout or stderr
# RUN: at line 1013
c:\_work\llvm-project\llvm-project\build\bin\clang.exe -cc1 -internal-isystem C:\_work\llvm-project\llvm-project\build\lib\clang\24\include -nostdsysteminc -E -dM -ffreestanding -fgnuc-version=4.2.1 -triple=sparc-none-netbsd < /dev/null | c:\_work\llvm-project\llvm-project\build\bin\filecheck.exe -match-full-lines -check-prefix SPARC -check-prefix SPARC-NETOPENBSD -check-prefix SPARC-LDBL128 C:\_work\llvm-project\llvm-project\clang\test\Preprocessor\init.c
# executed command: 'c:\_work\llvm-project\llvm-project\build\bin\clang.exe' -cc1 -internal-isystem 'C:\_work\llvm-project\llvm-project\build\lib\clang\24\include' -nostdsysteminc -E -dM -ffreestanding -fgnuc-version=4.2.1 -triple=sparc-none-netbsd
# note: command had no output on stdout or stderr
# executed command: 'c:\_work\llvm-project\llvm-project\build\bin\filecheck.exe' -match-full-lines -check-prefix SPARC -check-prefix SPARC-NETOPENBSD -check-prefix SPARC-LDBL128 'C:\_work\llvm-project\llvm-project\clang\test\Preprocessor\init.c'
# note: command had no output on stdout or stderr
# RUN: at line 1014
c:\_work\llvm-project\llvm-project\build\bin\clang.exe -cc1 -internal-isystem C:\_work\llvm-project\llvm-project\build\lib\clang\24\include -nostdsysteminc -E -dM -ffreestanding -fgnuc-version=4.2.1 -triple=sparc-unknown-linux-gnu < /dev/null | c:\_work\llvm-project\llvm-project\build\bin\filecheck.exe -match-full-lines -check-prefix SPARC-LDBL128 C:\_work\llvm-project\llvm-project\clang\test\Preprocessor\init.c
# executed command: 'c:\_work\llvm-project\llvm-project\build\bin\clang.exe' -cc1 -internal-isystem 'C:\_work\llvm-project\llvm-project\build\lib\clang\24\include' -nostdsysteminc -E -dM -ffreestanding -fgnuc-version=4.2.1 -triple=sparc-unknown-linux-gnu
# note: command had no output on stdout or stderr
# executed command: 'c:\_work\llvm-project\llvm-project\build\bin\filecheck.exe' -match-full-lines -check-prefix SPARC-LDBL128 'C:\_work\llvm-project\llvm-project\clang\test\Preprocessor\init.c'
# note: command had no output on stdout or stderr
# RUN: at line 1015
c:\_work\llvm-project\llvm-project\build\bin\clang.exe -cc1 -internal-isystem C:\_work\llvm-project\llvm-project\build\lib\clang\24\include -nostdsysteminc -E -dM -ffreestanding -fgnuc-version=4.2.1 -triple=sparc-sun-solaris < /dev/null | c:\_work\llvm-project\llvm-project\build\bin\filecheck.exe -match-full-lines -check-prefix SPARC-LDBL128 C:\_work\llvm-project\llvm-project\clang\test\Preprocessor\init.c
# executed command: 'c:\_work\llvm-project\llvm-project\build\bin\clang.exe' -cc1 -internal-isystem 'C:\_work\llvm-project\llvm-project\build\lib\clang\24\include' -nostdsysteminc -E -dM -ffreestanding -fgnuc-version=4.2.1 -triple=sparc-sun-solaris
# note: command had no output on stdout or stderr
# executed command: 'c:\_work\llvm-project\llvm-project\build\bin\filecheck.exe' -match-full-lines -check-prefix SPARC-LDBL128 'C:\_work\llvm-project\llvm-project\clang\test\Preprocessor\init.c'
# note: command had no output on stdout or stderr
# RUN: at line 1016
c:\_work\llvm-project\llvm-project\build\bin\clang.exe -cc1 -internal-isystem C:\_work\llvm-project\llvm-project\build\lib\clang\24\include -nostdsysteminc -x c++ -E -dM -ffreestanding -fgnuc-version=4.2.1 -triple=sparc-none-none < /dev/null | c:\_work\llvm-project\llvm-project\build\bin\filecheck.exe -match-full-lines -check-prefix SPARC -check-prefix SPARC-DEFAULT -check-prefix SPARC-LDBL64 -check-prefix SPARC-DEFAULT-CXX C:\_work\llvm-project\llvm-project\clang\test\Preprocessor\init.c
# executed command: 'c:\_work\llvm-project\llvm-project\build\bin\clang.exe' -cc1 -internal-isystem 'C:\_work\llvm-project\llvm-project\build\lib\clang\24\include' -nostdsysteminc -x c++ -E -dM -ffreestanding -fgnuc-version=4.2.1 -triple=sparc-none-none
# note: command had no output on stdout or stderr
# executed command: 'c:\_work\llvm-project\llvm-project\build\bin\filecheck.exe' -match-full-lines -check-prefix SPARC -check-prefix SPARC-DEFAULT -check-prefix SPARC-LDBL64 -check-prefix SPARC-DEFAULT-CXX 'C:\_work\llvm-project\llvm-project\clang\test\Preprocessor\init.c'
# note: command had no output on stdout or stderr
# RUN: at line 1235
c:\_work\llvm-project\llvm-project\build\bin\clang.exe -cc1 -internal-isystem C:\_work\llvm-project\llvm-project\build\lib\clang\24\include -nostdsysteminc -E -dM -ffreestanding -fgnuc-version=4.2.1 -triple=tce-none-none < /dev/null | c:\_work\llvm-project\llvm-project\build\bin\filecheck.exe -match-full-lines -check-prefix TCE C:\_work\llvm-project\llvm-project\clang\test\Preprocessor\init.c
# executed command: 'c:\_work\llvm-project\llvm-project\build\bin\clang.exe' -cc1 -internal-isystem 'C:\_work\llvm-project\llvm-project\build\lib\clang\24\include' -nostdsysteminc -E -dM -ffreestanding -fgnuc-version=4.2.1 -triple=tce-none-none
# note: command had no output on stdout or stderr
# executed command: 'c:\_work\llvm-project\llvm-project\build\bin\filecheck.exe' -match-full-lines -check-prefix TCE 'C:\_work\llvm-project\llvm-project\clang\test\Preprocessor\init.c'
# note: command had no output on stdout or stderr
# RUN: at line 1236
c:\_work\llvm-project\llvm-project\build\bin\clang.exe -cc1 -internal-isystem C:\_work\llvm-project\llvm-project\build\lib\clang\24\include -nostdsysteminc -x c++ -E -dM -ffreestanding -fgnuc-version=4.2.1 -triple=tce-none-none < /dev/null | c:\_work\llvm-project\llvm-project\build\bin\filecheck.exe -match-full-lines -check-prefix TCE -check-prefix TCE-CXX C:\_work\llvm-project\llvm-project\clang\test\Preprocessor\init.c
# executed command: 'c:\_work\llvm-project\llvm-project\build\bin\clang.exe' -cc1 -internal-isystem 'C:\_work\llvm-project\llvm-project\build\lib\clang\24\include' -nostdsysteminc -x c++ -E -dM -ffreestanding -fgnuc-version=4.2.1 -triple=tce-none-none
# note: command had no output on stdout or stderr
# executed command: 'c:\_work\llvm-project\llvm-project\build\bin\filecheck.exe' -match-full-lines -check-prefix TCE -check-prefix TCE-CXX 'C:\_work\llvm-project\llvm-project\clang\test\Preprocessor\init.c'
# note: command had no output on stdout or stderr
# RUN: at line 1411
c:\_work\llvm-project\llvm-project\build\bin\clang.exe -cc1 -internal-isystem C:\_work\llvm-project\llvm-project\build\lib\clang\24\include -nostdsysteminc -E -dM -ffreestanding -triple=x86_64-scei-ps4 < /dev/null | c:\_work\llvm-project\llvm-project\build\bin\filecheck.exe --match-full-lines --check-prefixes=PS4,PS4ONLY C:\_work\llvm-project\llvm-project\clang\test\Preprocessor\init.c
# executed command: 'c:\_work\llvm-project\llvm-project\build\bin\clang.exe' -cc1 -internal-isystem 'C:\_work\llvm-project\llvm-project\build\lib\clang\24\include' -nostdsysteminc -E -dM -ffreestanding -triple=x86_64-scei-ps4
# note: command had no output on stdout or stderr
# executed command: 'c:\_work\llvm-project\llvm-project\build\bin\filecheck.exe' --match-full-lines --check-prefixes=PS4,PS4ONLY 'C:\_work\llvm-project\llvm-project\clang\test\Preprocessor\init.c'
# note: command had no output on stdout or stderr
# RUN: at line 1412
c:\_work\llvm-project\llvm-project\build\bin\clang.exe -cc1 -internal-isystem C:\_work\llvm-project\llvm-project\build\lib\clang\24\include -nostdsysteminc -E -dM -ffreestanding -triple=x86_64-sie-ps5 < /dev/null | c:\_work\llvm-project\llvm-project\build\bin\filecheck.exe --match-full-lines --check-prefixes=PS4,PS5ONLY C:\_work\llvm-project\llvm-project\clang\test\Preprocessor\init.c
# executed command: 'c:\_work\llvm-project\llvm-project\build\bin\clang.exe' -cc1 -internal-isystem 'C:\_work\llvm-project\llvm-project\build\lib\clang\24\include' -nostdsysteminc -E -dM -ffreestanding -triple=x86_64-sie-ps5
# note: command had no output on stdout or stderr
# executed command: 'c:\_work\llvm-project\llvm-project\build\bin\filecheck.exe' --match-full-lines --check-prefixes=PS4,PS5ONLY 'C:\_work\llvm-project\llvm-project\clang\test\Preprocessor\init.c'
# note: command had no output on stdout or stderr
# RUN: at line 1531
c:\_work\llvm-project\llvm-project\build\bin\clang.exe -cc1 -internal-isystem C:\_work\llvm-project\llvm-project\build\lib\clang\24\include -nostdsysteminc -x c++ -E -dM -ffreestanding -triple=x86_64-scei-ps4 < /dev/null | c:\_work\llvm-project\llvm-project\build\bin\filecheck.exe --match-full-lines --check-prefix PS4-CXX C:\_work\llvm-project\llvm-project\clang\test\Preprocessor\init.c
# executed command: 'c:\_work\llvm-project\llvm-project\build\bin\clang.exe' -cc1 -internal-isystem 'C:\_work\llvm-project\llvm-project\build\lib\clang\24\include' -nostdsysteminc -x c++ -E -dM -ffreestanding -triple=x86_64-scei-ps4
# note: command had no output on stdout or stderr
# executed command: 'c:\_work\llvm-project\llvm-project\build\bin\filecheck.exe' --match-full-lines --check-prefix PS4-CXX 'C:\_work\llvm-project\llvm-project\clang\test\Preprocessor\init.c'
# note: command had no output on stdout or stderr
# RUN: at line 1532
c:\_work\llvm-project\llvm-project\build\bin\clang.exe -cc1 -internal-isystem C:\_work\llvm-project\llvm-project\build\lib\clang\24\include -nostdsysteminc -x c++ -E -dM -ffreestanding -triple=x86_64-sie-ps5 < /dev/null | c:\_work\llvm-project\llvm-project\build\bin\filecheck.exe --match-full-lines --check-prefix PS4-CXX C:\_work\llvm-project\llvm-project\clang\test\Preprocessor\init.c
# executed command: 'c:\_work\llvm-project\llvm-project\build\bin\clang.exe' -cc1 -internal-isystem 'C:\_work\llvm-project\llvm-project\build\lib\clang\24\include' -nostdsysteminc -x c++ -E -dM -ffreestanding -triple=x86_64-sie-ps5
# note: command had no output on stdout or stderr
# executed command: 'c:\_work\llvm-project\llvm-project\build\bin\filecheck.exe' --match-full-lines --check-prefix PS4-CXX 'C:\_work\llvm-project\llvm-project\clang\test\Preprocessor\init.c'
# note: command had no output on stdout or stderr
# RUN: at line 1535
c:\_work\llvm-project\llvm-project\build\bin\clang.exe -cc1 -internal-isystem C:\_work\llvm-project\llvm-project\build\lib\clang\24\include -nostdsysteminc -E -dM -triple=x86_64-pc-mingw32 < /dev/null | c:\_work\llvm-project\llvm-project\build\bin\filecheck.exe -match-full-lines -check-prefix X86-64-DECLSPEC-GNU C:\_work\llvm-project\llvm-project\clang\test\Preprocessor\init.c
# executed command: 'c:\_work\llvm-project\llvm-project\build\bin\clang.exe' -cc1 -internal-isystem 'C:\_work\llvm-project\llvm-project\build\lib\clang\24\include' -nostdsysteminc -E -dM -triple=x86_64-pc-mingw32
# note: command had no output on stdout or stderr
# executed command: 'c:\_work\llvm-project\llvm-project\build\bin\filecheck.exe' -match-full-lines -check-prefix X86-64-DECLSPEC-GNU 'C:\_work\llvm-project\llvm-project\clang\test\Preprocessor\init.c'
# note: command had no output on stdout or stderr
# RUN: at line 1538
c:\_work\llvm-project\llvm-project\build\bin\clang.exe -cc1 -internal-isystem C:\_work\llvm-project\llvm-project\build\lib\clang\24\include -nostdsysteminc -E -dM -fms-extensions -triple=x86_64-unknown-mingw32 < /dev/null | c:\_work\llvm-project\llvm-project\build\bin\filecheck.exe -match-full-lines -check-prefix X86-64-DECLSPEC-MS C:\_work\llvm-project\llvm-project\clang\test\Preprocessor\init.c
# executed command: 'c:\_work\llvm-project\llvm-project\build\bin\clang.exe' -cc1 -internal-isystem 'C:\_work\llvm-project\llvm-project\build\lib\clang\24\include' -nostdsysteminc -E -dM -fms-extensions -triple=x86_64-unknown-mingw32
# note: command had no output on stdout or stderr
# executed command: 'c:\_work\llvm-project\llvm-project\build\bin\filecheck.exe' -match-full-lines -check-prefix X86-64-DECLSPEC-MS 'C:\_work\llvm-project\llvm-project\clang\test\Preprocessor\init.c'
# note: command had no output on stdout or stderr
# RUN: at line 1539
c:\_work\llvm-project\llvm-project\build\bin\clang.exe -cc1 -internal-isystem C:\_work\llvm-project\llvm-project\build\lib\clang\24\include -nostdsysteminc -E -dM -fdeclspec -triple=x86_64-unknown-mingw32 < /dev/null | c:\_work\llvm-project\llvm-project\build\bin\filecheck.exe -match-full-lines -check-prefix X86-64-DECLSPEC-MS C:\_work\llvm-project\llvm-project\clang\test\Preprocessor\init.c
# executed command: 'c:\_work\llvm-project\llvm-project\build\bin\clang.exe' -cc1 -internal-isystem 'C:\_work\llvm-project\llvm-project\build\lib\clang\24\include' -nostdsysteminc -E -dM -fdeclspec -triple=x86_64-unknown-mingw32
# note: command had no output on stdout or stderr
# executed command: 'c:\_work\llvm-project\llvm-project\build\bin\filecheck.exe' -match-full-lines -check-prefix X86-64-DECLSPEC-MS 'C:\_work\llvm-project\llvm-project\clang\test\Preprocessor\init.c'
# note: command had no output on stdout or stderr
# RUN: at line 1542
c:\_work\llvm-project\llvm-project\build\bin\clang.exe -cc1 -internal-isystem C:\_work\llvm-project\llvm-project\build\lib\clang\24\include -nostdsysteminc -E -dM -ffreestanding -triple=sparc64-none-none < /dev/null | c:\_work\llvm-project\llvm-project\build\bin\filecheck.exe -match-full-lines -check-prefix SPARCV9 C:\_work\llvm-project\llvm-project\clang\test\Preprocessor\init.c
# executed command: 'c:\_work\llvm-project\llvm-project\build\bin\clang.exe' -cc1 -internal-isystem 'C:\_work\llvm-project\llvm-project\build\lib\clang\24\include' -nostdsysteminc -E -dM -ffreestanding -triple=sparc64-none-none
# note: command had no output on stdout or stderr
# executed command: 'c:\_work\llvm-project\llvm-project\build\bin\filecheck.exe' -match-full-lines -check-prefix SPARCV9 'C:\_work\llvm-project\llvm-project\clang\test\Preprocessor\init.c'
# note: command had no output on stdout or stderr
# RUN: at line 1555
c:\_work\llvm-project\llvm-project\build\bin\clang.exe -cc1 -internal-isystem C:\_work\llvm-project\llvm-project\build\lib\clang\24\include -nostdsysteminc -E -dM -ffreestanding -triple=sparc64-none-openbsd < /dev/null | c:\_work\llvm-project\llvm-project\build\bin\filecheck.exe -match-full-lines -check-prefix SPARC64-OBSD C:\_work\llvm-project\llvm-project\clang\test\Preprocessor\init.c
# executed command: 'c:\_work\llvm-project\llvm-project\build\bin\clang.exe' -cc1 -internal-isystem 'C:\_work\llvm-project\llvm-project\build\lib\clang\24\include' -nostdsysteminc -E -dM -ffreestanding -triple=sparc64-none-openbsd
# note: command had no output on stdout or stderr
# executed command: 'c:\_work\llvm-project\llvm-project\build\bin\filecheck.exe' -match-full-lines -check-prefix SPARC64-OBSD 'C:\_work\llvm-project\llvm-project\clang\test\Preprocessor\init.c'
# note: command had no output on stdout or stderr
# RUN: at line 1564
c:\_work\llvm-project\llvm-project\build\bin\clang.exe -cc1 -internal-isystem C:\_work\llvm-project\llvm-project\build\lib\clang\24\include -nostdsysteminc -E -dM -ffreestanding -triple=x86_64-pc-kfreebsd-gnu < /dev/null | c:\_work\llvm-project\llvm-project\build\bin\filecheck.exe -match-full-lines -check-prefix KFREEBSD-DEF C:\_work\llvm-project\llvm-project\clang\test\Preprocessor\init.c
# executed command: 'c:\_work\llvm-project\llvm-project\build\bin\clang.exe' -cc1 -internal-isystem 'C:\_work\llvm-project\llvm-project\build\lib\clang\24\include' -nostdsysteminc -E -dM -ffreestanding -triple=x86_64-pc-kfreebsd-gnu
# note: command had no output on stdout or stderr
# executed command: 'c:\_work\llvm-project\llvm-project\build\bin\filecheck.exe' -match-full-lines -check-prefix KFREEBSD-DEF 'C:\_work\llvm-project\llvm-project\clang\test\Preprocessor\init.c'
# note: command had no output on stdout or stderr
# RUN: at line 1568
c:\_work\llvm-project\llvm-project\build\bin\clang.exe -cc1 -internal-isystem C:\_work\llvm-project\llvm-project\build\lib\clang\24\include -nostdsysteminc -E -dM -ffreestanding -triple=i686-pc-kfreebsd-gnu < /dev/null | c:\_work\llvm-project\llvm-project\build\bin\filecheck.exe -match-full-lines -check-prefix KFREEBSDI686-DEF C:\_work\llvm-project\llvm-project\clang\test\Preprocessor\init.c
# executed command: 'c:\_work\llvm-project\llvm-project\build\bin\clang.exe' -cc1 -internal-isystem 'C:\_work\llvm-project\llvm-project\build\lib\clang\24\include' -nostdsysteminc -E -dM -ffreestanding -triple=i686-pc-kfreebsd-gnu
# note: command had no output on stdout or stderr
# executed command: 'c:\_work\llvm-project\llvm-project\build\bin\filecheck.exe' -match-full-lines -check-prefix KFREEBSDI686-DEF 'C:\_work\llvm-project\llvm-project\clang\test\Preprocessor\init.c'
# note: command had no output on stdout or stderr
# RUN: at line 1572
c:\_work\llvm-project\llvm-project\build\bin\clang.exe -cc1 -internal-isystem C:\_work\llvm-project\llvm-project\build\lib\clang\24\include -nostdsysteminc -x c++ -triple i686-pc-linux-gnu -fobjc-runtime=gcc -E -dM < /dev/null | c:\_work\llvm-project\llvm-project\build\bin\filecheck.exe -match-full-lines -check-prefix GNUSOURCE C:\_work\llvm-project\llvm-project\clang\test\Preprocessor\init.c
# executed command: 'c:\_work\llvm-project\llvm-project\build\bin\clang.exe' -cc1 -internal-isystem 'C:\_work\llvm-project\llvm-project\build\lib\clang\24\include' -nostdsysteminc -x c++ -triple i686-pc-linux-gnu -fobjc-runtime=gcc -E -dM
# note: command had no output on stdout or stderr
# executed command: 'c:\_work\llvm-project\llvm-project\build\bin\filecheck.exe' -match-full-lines -check-prefix GNUSOURCE 'C:\_work\llvm-project\llvm-project\clang\test\Preprocessor\init.c'
# note: command had no output on stdout or stderr
# RUN: at line 1573
c:\_work\llvm-project\llvm-project\build\bin\clang.exe -cc1 -internal-isystem C:\_work\llvm-project\llvm-project\build\lib\clang\24\include -nostdsysteminc -x c++ -triple sparc-rtems-elf -E -dM < /dev/null | c:\_work\llvm-project\llvm-project\build\bin\filecheck.exe -match-full-lines -check-prefix GNUSOURCE C:\_work\llvm-project\llvm-project\clang\test\Preprocessor\init.c
# executed command: 'c:\_work\llvm-project\llvm-project\build\bin\clang.exe' -cc1 -internal-isystem 'C:\_work\llvm-project\llvm-project\build\lib\clang\24\include' -nostdsysteminc -x c++ -triple sparc-rtems-elf -E -dM
# note: command had no output on stdout or stderr
# executed command: 'c:\_work\llvm-project\llvm-project\build\bin\filecheck.exe' -match-full-lines -check-prefix GNUSOURCE 'C:\_work\llvm-project\llvm-project\clang\test\Preprocessor\init.c'
# note: command had no output on stdout or stderr
# RUN: at line 1578
c:\_work\llvm-project\llvm-project\build\bin\clang.exe -cc1 -internal-isystem C:\_work\llvm-project\llvm-project\build\lib\clang\24\include -nostdsysteminc -x objective-c -triple i386-unknown-freebsd -fobjc-runtime=gnustep-1.9 -E -dM < /dev/null | c:\_work\llvm-project\llvm-project\build\bin\filecheck.exe -match-full-lines -check-prefix GNUSTEP1 C:\_work\llvm-project\llvm-project\clang\test\Preprocessor\init.c
# executed command: 'c:\_work\llvm-project\llvm-project\build\bin\clang.exe' -cc1 -internal-isystem 'C:\_work\llvm-project\llvm-project\build\lib\clang\24\include' -nostdsysteminc -x objective-c -triple i386-unknown-freebsd -fobjc-runtime=gnustep-1.9 -E -dM
# note: command had no output on stdout or stderr
# executed command: 'c:\_work\llvm-project\llvm-project\build\bin\filecheck.exe' -match-full-lines -check-prefix GNUSTEP1 'C:\_work\llvm-project\llvm-project\clang\test\Preprocessor\init.c'
# note: command had no output on stdout or stderr
# RUN: at line 1580
c:\_work\llvm-project\llvm-project\build\bin\clang.exe -cc1 -internal-isystem C:\_work\llvm-project\llvm-project\build\lib\clang\24\include -nostdsysteminc -x objective-c -triple i386-unknown-freebsd -fobjc-runtime=gnustep-2.5 -E -dM < /dev/null | c:\_work\llvm-project\llvm-project\build\bin\filecheck.exe -match-full-lines -check-prefix GNUSTEP2 C:\_work\llvm-project\llvm-project\clang\test\Preprocessor\init.c
# executed command: 'c:\_work\llvm-project\llvm-project\build\bin\clang.exe' -cc1 -internal-isystem 'C:\_work\llvm-project\llvm-project\build\lib\clang\24\include' -nostdsysteminc -x objective-c -triple i386-unknown-freebsd -fobjc-runtime=gnustep-2.5 -E -dM
# note: command had no output on stdout or stderr
# executed command: 'c:\_work\llvm-project\llvm-project\build\bin\filecheck.exe' -match-full-lines -check-prefix GNUSTEP2 'C:\_work\llvm-project\llvm-project\clang\test\Preprocessor\init.c'
# note: command had no output on stdout or stderr
# RUN: at line 1583
c:\_work\llvm-project\llvm-project\build\bin\clang.exe -cc1 -internal-isystem C:\_work\llvm-project\llvm-project\build\lib\clang\24\include -nostdsysteminc -x c++ -fgnuc-version=4.2.1 -std=c++98 -fno-rtti -E -dM < /dev/null | c:\_work\llvm-project\llvm-project\build\bin\filecheck.exe -match-full-lines -check-prefix NORTTI C:\_work\llvm-project\llvm-project\clang\test\Preprocessor\init.c
# executed command: 'c:\_work\llvm-project\llvm-project\build\bin\clang.exe' -cc1 -internal-isystem 'C:\_work\llvm-project\llvm-project\build\lib\clang\24\include' -nostdsysteminc -x c++ -fgnuc-version=4.2.1 -std=c++98 -fno-rtti -E -dM
# note: command had no output on stdout or stderr
# executed command: 'c:\_work\llvm-project\llvm-project\build\bin\filecheck.exe' -match-full-lines -check-prefix NORTTI 'C:\_work\llvm-project\llvm-project\clang\test\Preprocessor\init.c'
# note: command had no output on stdout or stderr
# RUN: at line 1588
c:\_work\llvm-project\llvm-project\build\bin\clang.exe -cc1 -internal-isystem C:\_work\llvm-project\llvm-project\build\lib\clang\24\include -nostdsysteminc -triple arm-linux-androideabi -E -dM < /dev/null | c:\_work\llvm-project\llvm-project\build\bin\filecheck.exe -match-full-lines -check-prefix ANDROID C:\_work\llvm-project\llvm-project\clang\test\Preprocessor\init.c
# executed command: 'c:\_work\llvm-project\llvm-project\build\bin\clang.exe' -cc1 -internal-isystem 'C:\_work\llvm-project\llvm-project\build\lib\clang\24\include' -nostdsysteminc -triple arm-linux-androideabi -E -dM
# note: command had no output on stdout or stderr
# executed command: 'c:\_work\llvm-project\llvm-project\build\bin\filecheck.exe' -match-full-lines -check-prefix ANDROID 'C:\_work\llvm-project\llvm-project\clang\test\Preprocessor\init.c'
# note: command had no output on stdout or stderr
# RUN: at line 1594
c:\_work\llvm-project\llvm-project\build\bin\clang.exe -cc1 -internal-isystem C:\_work\llvm-project\llvm-project\build\lib\clang\24\include -nostdsysteminc -x c++ -triple i686-linux-android -E -dM < /dev/null | c:\_work\llvm-project\llvm-project\build\bin\filecheck.exe -match-full-lines -check-prefix I386-ANDROID-CXX C:\_work\llvm-project\llvm-project\clang\test\Preprocessor\init.c
# executed command: 'c:\_work\llvm-project\llvm-project\build\bin\clang.exe' -cc1 -internal-isystem 'C:\_work\llvm-project\llvm-project\build\lib\clang\24\include' -nostdsysteminc -x c++ -triple i686-linux-android -E -dM
# note: command had no output on stdout or stderr
# executed command: 'c:\_work\llvm-project\llvm-project\build\bin\filecheck.exe' -match-full-lines -check-prefix I386-ANDROID-CXX 'C:\_work\llvm-project\llvm-project\clang\test\Preprocessor\init.c'
# note: command had no output on stdout or stderr
# RUN: at line 1597
c:\_work\llvm-project\llvm-project\build\bin\clang.exe -cc1 -internal-isystem C:\_work\llvm-project\llvm-project\build\lib\clang\24\include -nostdsysteminc -x c++ -triple x86_64-linux-android -E -dM < /dev/null | c:\_work\llvm-project\llvm-project\build\bin\filecheck.exe -match-full-lines -check-prefix X86_64-ANDROID-CXX C:\_work\llvm-project\llvm-project\clang\test\Preprocessor\init.c
# executed command: 'c:\_work\llvm-project\llvm-project\build\bin\clang.exe' -cc1 -internal-isystem 'C:\_work\llvm-project\llvm-project\build\lib\clang\24\include' -nostdsysteminc -x c++ -triple x86_64-linux-android -E -dM
# note: command had no output on stdout or stderr
# executed command: 'c:\_work\llvm-project\llvm-project\build\bin\filecheck.exe' -match-full-lines -check-prefix X86_64-ANDROID-CXX 'C:\_work\llvm-project\llvm-project\clang\test\Preprocessor\init.c'
# note: command had no output on stdout or stderr
# RUN: at line 1600
c:\_work\llvm-project\llvm-project\build\bin\clang.exe -cc1 -internal-isystem C:\_work\llvm-project\llvm-project\build\lib\clang\24\include -nostdsysteminc -triple arm-linux-androideabi20 -E -dM < /dev/null | c:\_work\llvm-project\llvm-project\build\bin\filecheck.exe -match-full-lines -check-prefix ANDROID20 C:\_work\llvm-project\llvm-project\clang\test\Preprocessor\init.c
# executed command: 'c:\_work\llvm-project\llvm-project\build\bin\clang.exe' -cc1 -internal-isystem 'C:\_work\llvm-project\llvm-project\build\lib\clang\24\include' -nostdsysteminc -triple arm-linux-androideabi20 -E -dM
# note: command had no output on stdout or stderr
# executed command: 'c:\_work\llvm-project\llvm-project\build\bin\filecheck.exe' -match-full-lines -check-prefix ANDROID20 'C:\_work\llvm-project\llvm-project\clang\test\Preprocessor\init.c'
# note: command had no output on stdout or stderr
# RUN: at line 1606
c:\_work\llvm-project\llvm-project\build\bin\clang.exe -cc1 -internal-isystem C:\_work\llvm-project\llvm-project\build\lib\clang\24\include -nostdsysteminc -triple lanai-unknown-unknown -E -dM < /dev/null | c:\_work\llvm-project\llvm-project\build\bin\filecheck.exe -match-full-lines -check-prefix LANAI C:\_work\llvm-project\llvm-project\clang\test\Preprocessor\init.c
# executed command: 'c:\_work\llvm-project\llvm-project\build\bin\clang.exe' -cc1 -internal-isystem 'C:\_work\llvm-project\llvm-project\build\lib\clang\24\include' -nostdsysteminc -triple lanai-unknown-unknown -E -dM
# note: command had no output on stdout or stderr
# executed command: 'c:\_work\llvm-project\llvm-project\build\bin\filecheck.exe' -match-full-lines -check-prefix LANAI 'C:\_work\llvm-project\llvm-project\clang\test\Preprocessor\init.c'
# note: command had no output on stdout or stderr
# RUN: at line 1609
c:\_work\llvm-project\llvm-project\build\bin\clang.exe -cc1 -internal-isystem C:\_work\llvm-project\llvm-project\build\lib\clang\24\include -nostdsysteminc -triple=aarch64-unknown-haiku -E -dM < /dev/null | c:\_work\llvm-project\llvm-project\build\bin\filecheck.exe -match-full-lines -check-prefix HAIKU C:\_work\llvm-project\llvm-project\clang\test\Preprocessor\init.c
# executed command: 'c:\_work\llvm-project\llvm-project\build\bin\clang.exe' -cc1 -internal-isystem 'C:\_work\llvm-project\llvm-project\build\lib\clang\24\include' -nostdsysteminc -triple=aarch64-unknown-haiku -E -dM
# note: command had no output on stdout or stderr
# executed command: 'c:\_work\llvm-project\llvm-project\build\bin\filecheck.exe' -match-full-lines -check-prefix HAIKU 'C:\_work\llvm-project\llvm-project\clang\test\Preprocessor\init.c'
# note: command had no output on stdout or stderr
# RUN: at line 1610
c:\_work\llvm-project\llvm-project\build\bin\clang.exe -cc1 -internal-isystem C:\_work\llvm-project\llvm-project\build\lib\clang\24\include -nostdsysteminc -triple=arm-unknown-haiku -E -dM < /dev/null | c:\_work\llvm-project\llvm-project\build\bin\filecheck.exe -match-full-lines -check-prefix HAIKU C:\_work\llvm-project\llvm-project\clang\test\Preprocessor\init.c
# executed command: 'c:\_work\llvm-project\llvm-project\build\bin\clang.exe' -cc1 -internal-isystem 'C:\_work\llvm-project\llvm-project\build\lib\clang\24\include' -nostdsysteminc -triple=arm-unknown-haiku -E -dM
# note: command had no output on stdout or stderr
# executed command: 'c:\_work\llvm-project\llvm-project\build\bin\filecheck.exe' -match-full-lines -check-prefix HAIKU 'C:\_work\llvm-project\llvm-project\clang\test\Preprocessor\init.c'
# note: command had no output on stdout or stderr
# RUN: at line 1611
c:\_work\llvm-project\llvm-project\build\bin\clang.exe -cc1 -internal-isystem C:\_work\llvm-project\llvm-project\build\lib\clang\24\include -nostdsysteminc -triple=riscv64-unknown-haiku -E -dM < /dev/null | c:\_work\llvm-project\llvm-project\build\bin\filecheck.exe -match-full-lines -check-prefix HAIKU C:\_work\llvm-project\llvm-project\clang\test\Preprocessor\init.c
# executed command: 'c:\_work\llvm-project\llvm-project\build\bin\clang.exe' -cc1 -internal-isystem 'C:\_work\llvm-project\llvm-project\build\lib\clang\24\include' -nostdsysteminc -triple=riscv64-unknown-haiku -E -dM
# note: command had no output on stdout or stderr
# executed command: 'c:\_work\llvm-project\llvm-project\build\bin\filecheck.exe' -match-full-lines -check-prefix HAIKU 'C:\_work\llvm-project\llvm-project\clang\test\Preprocessor\init.c'
# note: command had no output on stdout or stderr
# RUN: at line 1612
c:\_work\llvm-project\llvm-project\build\bin\clang.exe -cc1 -internal-isystem C:\_work\llvm-project\llvm-project\build\lib\clang\24\include -nostdsysteminc -triple=x86_64-unknown-haiku -E -dM < /dev/null | c:\_work\llvm-project\llvm-project\build\bin\filecheck.exe -match-full-lines -check-prefix HAIKU C:\_work\llvm-project\llvm-project\clang\test\Preprocessor\init.c
# executed command: 'c:\_work\llvm-project\llvm-project\build\bin\clang.exe' -cc1 -internal-isystem 'C:\_work\llvm-project\llvm-project\build\lib\clang\24\include' -nostdsysteminc -triple=x86_64-unknown-haiku -E -dM
# note: command had no output on stdout or stderr
# executed command: 'c:\_work\llvm-project\llvm-project\build\bin\filecheck.exe' -match-full-lines -check-prefix HAIKU 'C:\_work\llvm-project\llvm-project\clang\test\Preprocessor\init.c'
# note: command had no output on stdout or stderr
# RUN: at line 1613
c:\_work\llvm-project\llvm-project\build\bin\clang.exe -cc1 -internal-isystem C:\_work\llvm-project\llvm-project\build\lib\clang\24\include -nostdsysteminc -triple=i386-unknown-haiku -E -dM < /dev/null | c:\_work\llvm-project\llvm-project\build\bin\filecheck.exe -match-full-lines -check-prefix HAIKU C:\_work\llvm-project\llvm-project\clang\test\Preprocessor\init.c
# executed command: 'c:\_work\llvm-project\llvm-project\build\bin\clang.exe' -cc1 -internal-isystem 'C:\_work\llvm-project\llvm-project\build\lib\clang\24\include' -nostdsysteminc -triple=i386-unknown-haiku -E -dM
# note: command had no output on stdout or stderr
# executed command: 'c:\_work\llvm-project\llvm-project\build\bin\filecheck.exe' -match-full-lines -check-prefix HAIKU 'C:\_work\llvm-project\llvm-project\clang\test\Preprocessor\init.c'
# note: command had no output on stdout or stderr
# RUN: at line 1616
c:\_work\llvm-project\llvm-project\build\bin\clang.exe -cc1 -internal-isystem C:\_work\llvm-project\llvm-project\build\lib\clang\24\include -nostdsysteminc -E -dM -ffreestanding -triple=amd64-unknown-openbsd6.1 < /dev/null | c:\_work\llvm-project\llvm-project\build\bin\filecheck.exe -match-full-lines -check-prefix OPENBSD C:\_work\llvm-project\llvm-project\clang\test\Preprocessor\init.c
# executed command: 'c:\_work\llvm-project\llvm-project\build\bin\clang.exe' -cc1 -internal-isystem 'C:\_work\llvm-project\llvm-project\build\lib\clang\24\include' -nostdsysteminc -E -dM -ffreestanding -triple=amd64-unknown-openbsd6.1
# note: command had no output on stdout or stderr
# executed command: 'c:\_work\llvm-project\llvm-project\build\bin\filecheck.exe' -match-full-lines -check-prefix OPENBSD 'C:\_work\llvm-project\llvm-project\clang\test\Preprocessor\init.c'
# note: command had no output on stdout or stderr
# RUN: at line 1617
c:\_work\llvm-project\llvm-project\build\bin\clang.exe -cc1 -internal-isystem C:\_work\llvm-project\llvm-project\build\lib\clang\24\include -nostdsysteminc -E -dM -ffreestanding -triple=aarch64-unknown-openbsd6.1 < /dev/null | c:\_work\llvm-project\llvm-project\build\bin\filecheck.exe -match-full-lines -check-prefix OPENBSD C:\_work\llvm-project\llvm-project\clang\test\Preprocessor\init.c
# executed command: 'c:\_work\llvm-project\llvm-project\build\bin\clang.exe' -cc1 -internal-isystem 'C:\_work\llvm-project\llvm-project\build\lib\clang\24\include' -nostdsysteminc -E -dM -ffreestanding -triple=aarch64-unknown-openbsd6.1
# note: command had no output on stdout or stderr
# executed command: 'c:\_work\llvm-project\llvm-project\build\bin\filecheck.exe' -match-full-lines -check-prefix OPENBSD 'C:\_work\llvm-project\llvm-project\clang\test\Preprocessor\init.c'
# note: command had no output on stdout or stderr
# RUN: at line 1618
c:\_work\llvm-project\llvm-project\build\bin\clang.exe -cc1 -internal-isystem C:\_work\llvm-project\llvm-project\build\lib\clang\24\include -nostdsysteminc -E -dM -ffreestanding -triple=arm-unknown-openbsd6.1-gnueabi < /dev/null | c:\_work\llvm-project\llvm-project\build\bin\filecheck.exe -match-full-lines -check-prefix OPENBSD C:\_work\llvm-project\llvm-project\clang\test\Preprocessor\init.c
# executed command: 'c:\_work\llvm-project\llvm-project\build\bin\clang.exe' -cc1 -internal-isystem 'C:\_work\llvm-project\llvm-project\build\lib\clang\24\include' -nostdsysteminc -E -dM -ffreestanding -triple=arm-unknown-openbsd6.1-gnueabi
# note: command had no output on stdout or stderr
# executed command: 'c:\_work\llvm-project\llvm-project\build\bin\filecheck.exe' -match-full-lines -check-prefix OPENBSD 'C:\_work\llvm-project\llvm-project\clang\test\Preprocessor\init.c'
# note: command had no output on stdout or stderr
# RUN: at line 1619
c:\_work\llvm-project\llvm-project\build\bin\clang.exe -cc1 -internal-isystem C:\_work\llvm-project\llvm-project\build\lib\clang\24\include -nostdsysteminc -E -dM -ffreestanding -triple=i386-unknown-openbsd6.1 < /dev/null | c:\_work\llvm-project\llvm-project\build\bin\filecheck.exe -match-full-lines -check-prefix OPENBSD C:\_work\llvm-project\llvm-project\clang\test\Preprocessor\init.c
# executed command: 'c:\_work\llvm-project\llvm-project\build\bin\clang.exe' -cc1 -internal-isystem 'C:\_work\llvm-project\llvm-project\build\lib\clang\24\include' -nostdsysteminc -E -dM -ffreestanding -triple=i386-unknown-openbsd6.1
# note: command had no output on stdout or stderr
# executed command: 'c:\_work\llvm-project\llvm-project\build\bin\filecheck.exe' -match-full-lines -check-prefix OPENBSD 'C:\_work\llvm-project\llvm-project\clang\test\Preprocessor\init.c'
# note: command had no output on stdout or stderr
# RUN: at line 1620
c:\_work\llvm-project\llvm-project\build\bin\clang.exe -cc1 -internal-isystem C:\_work\llvm-project\llvm-project\build\lib\clang\24\include -nostdsysteminc -E -dM -ffreestanding -triple=powerpc-unknown-openbsd6.1 < /dev/null | c:\_work\llvm-project\llvm-project\build\bin\filecheck.exe -match-full-lines -check-prefix OPENBSD C:\_work\llvm-project\llvm-project\clang\test\Preprocessor\init.c
# executed command: 'c:\_work\llvm-project\llvm-project\build\bin\clang.exe' -cc1 -internal-isystem 'C:\_work\llvm-project\llvm-project\build\lib\clang\24\include' -nostdsysteminc -E -dM -ffreestanding -triple=powerpc-unknown-openbsd6.1
# note: command had no output on stdout or stderr
# executed command: 'c:\_work\llvm-project\llvm-project\build\bin\filecheck.exe' -match-full-lines -check-prefix OPENBSD 'C:\_work\llvm-project\llvm-project\clang\test\Preprocessor\init.c'
# note: command had no output on stdout or stderr
# RUN: at line 1621
c:\_work\llvm-project\llvm-project\build\bin\clang.exe -cc1 -internal-isystem C:\_work\llvm-project\llvm-project\build\lib\clang\24\include -nostdsysteminc -E -dM -ffreestanding -triple=powerpc64-unknown-openbsd6.1 < /dev/null | c:\_work\llvm-project\llvm-project\build\bin\filecheck.exe -match-full-lines -check-prefix OPENBSD C:\_work\llvm-project\llvm-project\clang\test\Preprocessor\init.c
# executed command: 'c:\_work\llvm-project\llvm-project\build\bin\clang.exe' -cc1 -internal-isystem 'C:\_work\llvm-project\llvm-project\build\lib\clang\24\include' -nostdsysteminc -E -dM -ffreestanding -triple=powerpc64-unknown-openbsd6.1
# note: command had no output on stdout or stderr
# executed command: 'c:\_work\llvm-project\llvm-project\build\bin\filecheck.exe' -match-full-lines -check-prefix OPENBSD 'C:\_work\llvm-project\llvm-project\clang\test\Preprocessor\init.c'
# note: command had no output on stdout or stderr
# RUN: at line 1622
c:\_work\llvm-project\llvm-project\build\bin\clang.exe -cc1 -internal-isystem C:\_work\llvm-project\llvm-project\build\lib\clang\24\include -nostdsysteminc -E -dM -ffreestanding -triple=powerpc64le-unknown-openbsd6.1 < /dev/null | c:\_work\llvm-project\llvm-project\build\bin\filecheck.exe -match-full-lines -check-prefix OPENBSD C:\_work\llvm-project\llvm-project\clang\test\Preprocessor\init.c
# executed command: 'c:\_work\llvm-project\llvm-project\build\bin\clang.exe' -cc1 -internal-isystem 'C:\_work\llvm-project\llvm-project\build\lib\clang\24\include' -nostdsysteminc -E -dM -ffreestanding -triple=powerpc64le-unknown-openbsd6.1
# note: command had no output on stdout or stderr
# executed command: 'c:\_work\llvm-project\llvm-project\build\bin\filecheck.exe' -match-full-lines -check-prefix OPENBSD 'C:\_work\llvm-project\llvm-project\clang\test\Preprocessor\init.c'
# note: command had no output on stdout or stderr
# RUN: at line 1623
c:\_work\llvm-project\llvm-project\build\bin\clang.exe -cc1 -internal-isystem C:\_work\llvm-project\llvm-project\build\lib\clang\24\include -nostdsysteminc -E -dM -ffreestanding -triple=mips64-unknown-openbsd6.1 < /dev/null | c:\_work\llvm-project\llvm-project\build\bin\filecheck.exe -match-full-lines -check-prefix OPENBSD C:\_work\llvm-project\llvm-project\clang\test\Preprocessor\init.c
# executed command: 'c:\_work\llvm-project\llvm-project\build\bin\clang.exe' -cc1 -internal-isystem 'C:\_work\llvm-project\llvm-project\build\lib\clang\24\include' -nostdsysteminc -E -dM -ffreestanding -triple=mips64-unknown-openbsd6.1
# note: command had no output on stdout or stderr
# executed command: 'c:\_work\llvm-project\llvm-project\build\bin\filecheck.exe' -match-full-lines -check-prefix OPENBSD 'C:\_work\llvm-project\llvm-project\clang\test\Preprocessor\init.c'
# note: command had no output on stdout or stderr
# RUN: at line 1624
c:\_work\llvm-project\llvm-project\build\bin\clang.exe -cc1 -internal-isystem C:\_work\llvm-project\llvm-project\build\lib\clang\24\include -nostdsysteminc -E -dM -ffreestanding -triple=mips64el-unknown-openbsd6.1 < /dev/null | c:\_work\llvm-project\llvm-project\build\bin\filecheck.exe -match-full-lines -check-prefix OPENBSD C:\_work\llvm-project\llvm-project\clang\test\Preprocessor\init.c
# executed command: 'c:\_work\llvm-project\llvm-project\build\bin\clang.exe' -cc1 -internal-isystem 'C:\_work\llvm-project\llvm-project\build\lib\clang\24\include' -nostdsysteminc -E -dM -ffreestanding -triple=mips64el-unknown-openbsd6.1
# note: command had no output on stdout or stderr
# executed command: 'c:\_work\llvm-project\llvm-project\build\bin\filecheck.exe' -match-full-lines -check-prefix OPENBSD 'C:\_work\llvm-project\llvm-project\clang\test\Preprocessor\init.c'
# note: command had no output on stdout or stderr
# RUN: at line 1625
c:\_work\llvm-project\llvm-project\build\bin\clang.exe -cc1 -internal-isystem C:\_work\llvm-project\llvm-project\build\lib\clang\24\include -nostdsysteminc -E -dM -ffreestanding -triple=sparc64-unknown-openbsd6.1 < /dev/null | c:\_work\llvm-project\llvm-project\build\bin\filecheck.exe -match-full-lines -check-prefix OPENBSD C:\_work\llvm-project\llvm-project\clang\test\Preprocessor\init.c
# executed command: 'c:\_work\llvm-project\llvm-project\build\bin\clang.exe' -cc1 -internal-isystem 'C:\_work\llvm-project\llvm-project\build\lib\clang\24\include' -nostdsysteminc -E -dM -ffreestanding -triple=sparc64-unknown-openbsd6.1
# note: command had no output on stdout or stderr
# executed command: 'c:\_work\llvm-project\llvm-project\build\bin\filecheck.exe' -match-full-lines -check-prefix OPENBSD 'C:\_work\llvm-project\llvm-project\clang\test\Preprocessor\init.c'
# note: command had no output on stdout or stderr
# RUN: at line 1626
c:\_work\llvm-project\llvm-project\build\bin\clang.exe -cc1 -internal-isystem C:\_work\llvm-project\llvm-project\build\lib\clang\24\include -nostdsysteminc -E -dM -ffreestanding -triple=riscv64-unknown-openbsd6.1 < /dev/null | c:\_work\llvm-project\llvm-project\build\bin\filecheck.exe -match-full-lines -check-prefix OPENBSD C:\_work\llvm-project\llvm-project\clang\test\Preprocessor\init.c
# executed command: 'c:\_work\llvm-project\llvm-project\build\bin\clang.exe' -cc1 -internal-isystem 'C:\_work\llvm-project\llvm-project\build\lib\clang\24\include' -nostdsysteminc -E -dM -ffreestanding -triple=riscv64-unknown-openbsd6.1
# note: command had no output on stdout or stderr
# executed command: 'c:\_work\llvm-project\llvm-project\build\bin\filecheck.exe' -match-full-lines -check-prefix OPENBSD 'C:\_work\llvm-project\llvm-project\clang\test\Preprocessor\init.c'
# note: command had no output on stdout or stderr
# RUN: at line 1646
c:\_work\llvm-project\llvm-project\build\bin\clang.exe -cc1 -internal-isystem C:\_work\llvm-project\llvm-project\build\lib\clang\24\include -nostdsysteminc -x c -std=c11 -E -dM -ffreestanding -triple=amd64-unknown-openbsd < /dev/null | c:\_work\llvm-project\llvm-project\build\bin\filecheck.exe -match-full-lines -check-prefix OPENBSD-STDC C:\_work\llvm-project\llvm-project\clang\test\Preprocessor\init.c
# executed command: 'c:\_work\llvm-project\llvm-project\build\bin\clang.exe' -cc1 -internal-isystem 'C:\_work\llvm-project\llvm-project\build\lib\clang\24\include' -nostdsysteminc -x c -std=c11 -E -dM -ffreestanding -triple=amd64-unknown-openbsd
# note: command had no output on stdout or stderr
# executed command: 'c:\_work\llvm-project\llvm-project\build\bin\filecheck.exe' -match-full-lines -check-prefix OPENBSD-STDC 'C:\_work\llvm-project\llvm-project\clang\test\Preprocessor\init.c'
# note: command had no output on stdout or stderr
# RUN: at line 1647
c:\_work\llvm-project\llvm-project\build\bin\clang.exe -cc1 -internal-isystem C:\_work\llvm-project\llvm-project\build\lib\clang\24\include -nostdsysteminc -x c -std=gnu11 -E -dM -ffreestanding -triple=amd64-unknown-openbsd < /dev/null | c:\_work\llvm-project\llvm-project\build\bin\filecheck.exe -match-full-lines -check-prefix OPENBSD-STDC C:\_work\llvm-project\llvm-project\clang\test\Preprocessor\init.c
# executed command: 'c:\_work\llvm-project\llvm-project\build\bin\clang.exe' -cc1 -internal-isystem 'C:\_work\llvm-project\llvm-project\build\lib\clang\24\include' -nostdsysteminc -x c -std=gnu11 -E -dM -ffreestanding -triple=amd64-unknown-openbsd
# note: command had no output on stdout or stderr
# executed command: 'c:\_work\llvm-project\llvm-project\build\bin\filecheck.exe' -match-full-lines -check-prefix OPENBSD-STDC 'C:\_work\llvm-project\llvm-project\clang\test\Preprocessor\init.c'
# note: command had no output on stdout or stderr
# RUN: at line 1648
c:\_work\llvm-project\llvm-project\build\bin\clang.exe -cc1 -internal-isystem C:\_work\llvm-project\llvm-project\build\lib\clang\24\include -nostdsysteminc -x c -std=c17 -E -dM -ffreestanding -triple=amd64-unknown-openbsd < /dev/null | c:\_work\llvm-project\llvm-project\build\bin\filecheck.exe -match-full-lines -check-prefix OPENBSD-STDC C:\_work\llvm-project\llvm-project\clang\test\Preprocessor\init.c
# executed command: 'c:\_work\llvm-project\llvm-project\build\bin\clang.exe' -cc1 -internal-isystem 'C:\_work\llvm-project\llvm-project\build\lib\clang\24\include' -nostdsysteminc -x c -std=c17 -E -dM -ffreestanding -triple=amd64-unknown-openbsd
# note: command had no output on stdout or stderr
# executed command: 'c:\_work\llvm-project\llvm-project\build\bin\filecheck.exe' -match-full-lines -check-prefix OPENBSD-STDC 'C:\_work\llvm-project\llvm-project\clang\test\Preprocessor\init.c'
# note: command had no output on stdout or stderr
# RUN: at line 1651
c:\_work\llvm-project\llvm-project\build\bin\clang.exe -cc1 -internal-isystem C:\_work\llvm-project\llvm-project\build\lib\clang\24\include -nostdsysteminc -x c -std=c99 -E -dM -ffreestanding -triple=amd64-unknown-openbsd < /dev/null | c:\_work\llvm-project\llvm-project\build\bin\filecheck.exe -match-full-lines -check-prefix OPENBSD-STDC-N C:\_work\llvm-project\llvm-project\clang\test\Preprocessor\init.c
# executed command: 'c:\_work\llvm-project\llvm-project\build\bin\clang.exe' -cc1 -internal-isystem 'C:\_work\llvm-project\llvm-project\build\lib\clang\24\include' -nostdsysteminc -x c -std=c99 -E -dM -ffreestanding -triple=amd64-unknown-openbsd
# note: command had no output on stdout or stderr
# executed command: 'c:\_work\llvm-project\llvm-project\build\bin\filecheck.exe' -match-full-lines -check-prefix OPENBSD-STDC-N 'C:\_work\llvm-project\llvm-project\clang\test\Preprocessor\init.c'
# note: command had no output on stdout or stderr
# RUN: at line 1654
c:\_work\llvm-project\llvm-project\build\bin\clang.exe -cc1 -internal-isystem C:\_work\llvm-project\llvm-project\build\lib\clang\24\include -nostdsysteminc -x c -std=c11 -E -dM -ffreestanding -triple=x86_64-unknown-dragonfly < /dev/null | c:\_work\llvm-project\llvm-project\build\bin\filecheck.exe -match-full-lines -check-prefix DRAGONFLY-STDC C:\_work\llvm-project\llvm-project\clang\test\Preprocessor\init.c
# executed command: 'c:\_work\llvm-project\llvm-project\build\bin\clang.exe' -cc1 -internal-isystem 'C:\_work\llvm-project\llvm-project\build\lib\clang\24\include' -nostdsysteminc -x c -std=c11 -E -dM -ffreestanding -triple=x86_64-unknown-dragonfly
# note: command had no output on stdout or stderr
# executed command: 'c:\_work\llvm-project\llvm-project\build\bin\filecheck.exe' -match-full-lines -check-prefix DRAGONFLY-STDC 'C:\_work\llvm-project\llvm-project\clang\test\Preprocessor\init.c'
# note: command had no output on stdout or stderr
# RUN: at line 1655
c:\_work\llvm-project\llvm-project\build\bin\clang.exe -cc1 -internal-isystem C:\_work\llvm-project\llvm-project\build\lib\clang\24\include -nostdsysteminc -x c -std=gnu11 -E -dM -ffreestanding -triple=x86_64-unknown-dragonfly < /dev/null | c:\_work\llvm-project\llvm-project\build\bin\filecheck.exe -match-full-lines -check-prefix DRAGONFLY-STDC C:\_work\llvm-project\llvm-project\clang\test\Preprocessor\init.c
# executed command: 'c:\_work\llvm-project\llvm-project\build\bin\clang.exe' -cc1 -internal-isystem 'C:\_work\llvm-project\llvm-project\build\lib\clang\24\include' -nostdsysteminc -x c -std=gnu11 -E -dM -ffreestanding -triple=x86_64-unknown-dragonfly
# note: command had no output on stdout or stderr
# executed command: 'c:\_work\llvm-project\llvm-project\build\bin\filecheck.exe' -match-full-lines -check-prefix DRAGONFLY-STDC 'C:\_work\llvm-project\llvm-project\clang\test\Preprocessor\init.c'
# note: command had no output on stdout or stderr
# RUN: at line 1656
c:\_work\llvm-project\llvm-project\build\bin\clang.exe -cc1 -internal-isystem C:\_work\llvm-project\llvm-project\build\lib\clang\24\include -nostdsysteminc -x c -std=c17 -E -dM -ffreestanding -triple=x86_64-unknown-dragonfly < /dev/null | c:\_work\llvm-project\llvm-project\build\bin\filecheck.exe -match-full-lines -check-prefix DRAGONFLY-STDC C:\_work\llvm-project\llvm-project\clang\test\Preprocessor\init.c
# executed command: 'c:\_work\llvm-project\llvm-project\build\bin\clang.exe' -cc1 -internal-isystem 'C:\_work\llvm-project\llvm-project\build\lib\clang\24\include' -nostdsysteminc -x c -std=c17 -E -dM -ffreestanding -triple=x86_64-unknown-dragonfly
# note: command had no output on stdout or stderr
# executed command: 'c:\_work\llvm-project\llvm-project\build\bin\filecheck.exe' -match-full-lines -check-prefix DRAGONFLY-STDC 'C:\_work\llvm-project\llvm-project\clang\test\Preprocessor\init.c'
# note: command had no output on stdout or stderr
# RUN: at line 1659
c:\_work\llvm-project\llvm-project\build\bin\clang.exe -cc1 -internal-isystem C:\_work\llvm-project\llvm-project\build\lib\clang\24\include -nostdsysteminc -x c -std=c99 -E -dM -ffreestanding -triple=x86_64-unknown-dragonfly < /dev/null | c:\_work\llvm-project\llvm-project\build\bin\filecheck.exe -match-full-lines -check-prefix DRAGONFLY-STDC-N C:\_work\llvm-project\llvm-project\clang\test\Preprocessor\init.c
# executed command: 'c:\_work\llvm-project\llvm-project\build\bin\clang.exe' -cc1 -internal-isystem 'C:\_work\llvm-project\llvm-project\build\lib\clang\24\include' -nostdsysteminc -x c -std=c99 -E -dM -ffreestanding -triple=x86_64-unknown-dragonfly
# note: command had no output on stdout or stderr
# executed command: 'c:\_work\llvm-project\llvm-project\build\bin\filecheck.exe' -match-full-lines -check-prefix DRAGONFLY-STDC-N 'C:\_work\llvm-project\llvm-project\clang\test\Preprocessor\init.c'
# note: command had no output on stdout or stderr
# RUN: at line 1662
c:\_work\llvm-project\llvm-project\build\bin\clang.exe -cc1 -internal-isystem C:\_work\llvm-project\llvm-project\build\lib\clang\24\include -nostdsysteminc -triple=aarch64-unknown-managarm-mlibc -E -dM < /dev/null | c:\_work\llvm-project\llvm-project\build\bin\filecheck.exe -match-full-lines -check-prefix MANAGARM C:\_work\llvm-project\llvm-project\clang\test\Preprocessor\init.c
# executed command: 'c:\_work\llvm-project\llvm-project\build\bin\clang.exe' -cc1 -internal-isystem 'C:\_work\llvm-project\llvm-project\build\lib\clang\24\include' -nostdsysteminc -triple=aarch64-unknown-managarm-mlibc -E -dM
# note: command had no output on stdout or stderr
# executed command: 'c:\_work\llvm-project\llvm-project\build\bin\filecheck.exe' -match-full-lines -check-prefix MANAGARM 'C:\_work\llvm-project\llvm-project\clang\test\Preprocessor\init.c'
# note: command had no output on stdout or stderr
# RUN: at line 1663
c:\_work\llvm-project\llvm-project\build\bin\clang.exe -cc1 -internal-isystem C:\_work\llvm-project\llvm-project\build\lib\clang\24\include -nostdsysteminc -triple=riscv64-unknown-managarm-mlibc -E -dM < /dev/null | c:\_work\llvm-project\llvm-project\build\bin\filecheck.exe -match-full-lines -check-prefix MANAGARM C:\_work\llvm-project\llvm-project\clang\test\Preprocessor\init.c
# executed command: 'c:\_work\llvm-project\llvm-project\build\bin\clang.exe' -cc1 -internal-isystem 'C:\_work\llvm-project\llvm-project\build\lib\clang\24\include' -nostdsysteminc -triple=riscv64-unknown-managarm-mlibc -E -dM
# note: command had no output on stdout or stderr
# executed command: 'c:\_work\llvm-project\llvm-project\build\bin\filecheck.exe' -match-full-lines -check-prefix MANAGARM 'C:\_work\llvm-project\llvm-project\clang\test\Preprocessor\init.c'
# note: command had no output on stdout or stderr
# RUN: at line 1664
c:\_work\llvm-project\llvm-project\build\bin\clang.exe -cc1 -internal-isystem C:\_work\llvm-project\llvm-project\build\lib\clang\24\include -nostdsysteminc -triple=x86_64-unknown-managarm-mlibc -E -dM < /dev/null | c:\_work\llvm-project\llvm-project\build\bin\filecheck.exe -match-full-lines -check-prefix MANAGARM C:\_work\llvm-project\llvm-project\clang\test\Preprocessor\init.c
# executed command: 'c:\_work\llvm-project\llvm-project\build\bin\clang.exe' -cc1 -internal-isystem 'C:\_work\llvm-project\llvm-project\build\lib\clang\24\include' -nostdsysteminc -triple=x86_64-unknown-managarm-mlibc -E -dM
# note: command had no output on stdout or stderr
# executed command: 'c:\_work\llvm-project\llvm-project\build\bin\filecheck.exe' -match-full-lines -check-prefix MANAGARM 'C:\_work\llvm-project\llvm-project\clang\test\Preprocessor\init.c'
# note: command had no output on stdout or stderr
# RUN: at line 1668
c:\_work\llvm-project\llvm-project\build\bin\clang.exe -cc1 -internal-isystem C:\_work\llvm-project\llvm-project\build\lib\clang\24\include -nostdsysteminc -E -dM -ffreestanding -triple=xcore-none-none < /dev/null | c:\_work\llvm-project\llvm-project\build\bin\filecheck.exe -match-full-lines -check-prefix XCORE C:\_work\llvm-project\llvm-project\clang\test\Preprocessor\init.c
# executed command: 'c:\_work\llvm-project\llvm-project\build\bin\clang.exe' -cc1 -internal-isystem 'C:\_work\llvm-project\llvm-project\build\lib\clang\24\include' -nostdsysteminc -E -dM -ffreestanding -triple=xcore-none-none
# note: command had no output on stdout or stderr
# executed command: 'c:\_work\llvm-project\llvm-project\build\bin\filecheck.exe' -match-full-lines -check-prefix XCORE 'C:\_work\llvm-project\llvm-project\clang\test\Preprocessor\init.c'
# note: command had no output on stdout or stderr
# RUN: at line 1674
c:\_work\llvm-project\llvm-project\build\bin\clang.exe -cc1 -internal-isystem C:\_work\llvm-project\llvm-project\build\lib\clang\24\include -nostdsysteminc -E -dM -ffreestanding -fgnuc-version=4.2.1 -triple=wasm32-unknown-unknown < /dev/null | c:\_work\llvm-project\llvm-project\build\bin\filecheck.exe -match-full-lines -check-prefixes=WEBASSEMBLY,WEBASSEMBLY32 C:\_work\llvm-project\llvm-project\clang\test\Preprocessor\init.c
# executed command: 'c:\_work\llvm-project\llvm-project\build\bin\clang.exe' -cc1 -internal-isystem 'C:\_work\llvm-project\llvm-project\build\lib\clang\24\include' -nostdsysteminc -E -dM -ffreestanding -fgnuc-version=4.2.1 -triple=wasm32-unknown-unknown
# note: command had no output on stdout or stderr
# executed command: 'c:\_work\llvm-project\llvm-project\build\bin\filecheck.exe' -match-full-lines -check-prefixes=WEBASSEMBLY,WEBASSEMBLY32 'C:\_work\llvm-project\llvm-project\clang\test\Preprocessor\init.c'
# note: command had no output on stdout or stderr
# RUN: at line 1677
c:\_work\llvm-project\llvm-project\build\bin\clang.exe -cc1 -internal-isystem C:\_work\llvm-project\llvm-project\build\lib\clang\24\include -nostdsysteminc -E -dM -ffreestanding -fgnuc-version=4.2.1 -triple=wasm64-unknown-unknown < /dev/null | c:\_work\llvm-project\llvm-project\build\bin\filecheck.exe -match-full-lines -check-prefixes=WEBASSEMBLY,WEBASSEMBLY64 C:\_work\llvm-project\llvm-project\clang\test\Preprocessor\init.c
# executed command: 'c:\_work\llvm-project\llvm-project\build\bin\clang.exe' -cc1 -internal-isystem 'C:\_work\llvm-project\llvm-project\build\lib\clang\24\include' -nostdsysteminc -E -dM -ffreestanding -fgnuc-version=4.2.1 -triple=wasm64-unknown-unknown
# note: command had no output on stdout or stderr
# executed command: 'c:\_work\llvm-project\llvm-project\build\bin\filecheck.exe' -match-full-lines -check-prefixes=WEBASSEMBLY,WEBASSEMBLY64 'C:\_work\llvm-project\llvm-project\clang\test\Preprocessor\init.c'
# note: command had no output on stdout or stderr
# RUN: at line 1680
c:\_work\llvm-project\llvm-project\build\bin\clang.exe -cc1 -internal-isystem C:\_work\llvm-project\llvm-project\build\lib\clang\24\include -nostdsysteminc -E -dM -ffreestanding -fgnuc-version=4.2.1 -triple=wasm32-emscripten < /dev/null | c:\_work\llvm-project\llvm-project\build\bin\filecheck.exe -match-full-lines -check-prefixes=WEBASSEMBLY,WEBASSEMBLY32,EMSCRIPTEN C:\_work\llvm-project\llvm-project\clang\test\Preprocessor\init.c
# executed command: 'c:\_work\llvm-project\llvm-project\build\bin\clang.exe' -cc1 -internal-isystem 'C:\_work\llvm-project\llvm-project\build\lib\clang\24\include' -nostdsysteminc -E -dM -ffreestanding -fgnuc-version=4.2.1 -triple=wasm32-emscripten
# note: command had no output on stdout or stderr
# executed command: 'c:\_work\llvm-project\llvm-project\build\bin\filecheck.exe' -match-full-lines -check-prefixes=WEBASSEMBLY,WEBASSEMBLY32,EMSCRIPTEN 'C:\_work\llvm-project\llvm-project\clang\test\Preprocessor\init.c'
# note: command had no output on stdout or stderr
# RUN: at line 1683
c:\_work\llvm-project\llvm-project\build\bin\clang.exe -cc1 -internal-isystem C:\_work\llvm-project\llvm-project\build\lib\clang\24\include -nostdsysteminc -E -dM -ffreestanding -fgnuc-version=4.2.1 -triple=wasm32-emscripten -pthread -target-feature +atomics -target-feature +bulk-memory < /dev/null | c:\_work\llvm-project\llvm-project\build\bin\filecheck.exe -match-full-lines -check-prefixes=WEBASSEMBLY,WEBASSEMBLY32,EMSCRIPTEN,EMSCRIPTEN-THREADS C:\_work\llvm-project\llvm-project\clang\test\Preprocessor\init.c
# executed command: 'c:\_work\llvm-project\llvm-project\build\bin\clang.exe' -cc1 -internal-isystem 'C:\_work\llvm-project\llvm-project\build\lib\clang\24\include' -nostdsysteminc -E -dM -ffreestanding -fgnuc-version=4.2.1 -triple=wasm32-emscripten -pthread -target-feature +atomics -target-feature +bulk-memory
# note: command had no output on stdout or stderr
# executed command: 'c:\_work\llvm-project\llvm-project\build\bin\filecheck.exe' -match-full-lines -check-prefixes=WEBASSEMBLY,WEBASSEMBLY32,EMSCRIPTEN,EMSCRIPTEN-THREADS 'C:\_work\llvm-project\llvm-project\clang\test\Preprocessor\init.c'
# note: command had no output on stdout or stderr
# RUN: at line 1686
c:\_work\llvm-project\llvm-project\build\bin\clang.exe -cc1 -internal-isystem C:\_work\llvm-project\llvm-project\build\lib\clang\24\include -nostdsysteminc -E -dM -ffreestanding -fgnuc-version=4.2.1 -triple=wasm64-emscripten < /dev/null | c:\_work\llvm-project\llvm-project\build\bin\filecheck.exe -match-full-lines -check-prefixes=WEBASSEMBLY,WEBASSEMBLY64,EMSCRIPTEN C:\_work\llvm-project\llvm-project\clang\test\Preprocessor\init.c
# executed command: 'c:\_work\llvm-project\llvm-project\build\bin\clang.exe' -cc1 -internal-isystem 'C:\_work\llvm-project\llvm-project\build\lib\clang\24\include' -nostdsysteminc -E -dM -ffreestanding -fgnuc-version=4.2.1 -triple=wasm64-emscripten
# note: command had no output on stdout or stderr
# executed command: 'c:\_work\llvm-project\llvm-project\build\bin\filecheck.exe' -match-full-lines -check-prefixes=WEBASSEMBLY,WEBASSEMBLY64,EMSCRIPTEN 'C:\_work\llvm-project\llvm-project\clang\test\Preprocessor\init.c'
# note: command had no output on stdout or stderr
# RUN: at line 1689
c:\_work\llvm-project\llvm-project\build\bin\clang.exe -cc1 -internal-isystem C:\_work\llvm-project\llvm-project\build\lib\clang\24\include -nostdsysteminc -E -dM -ffreestanding -fgnuc-version=4.2.1 -triple=wasm32-wasip1 < /dev/null | c:\_work\llvm-project\llvm-project\build\bin\filecheck.exe -match-full-lines -check-prefixes=WEBASSEMBLY,WEBASSEMBLY32,WASI,WASIP1 C:\_work\llvm-project\llvm-project\clang\test\Preprocessor\init.c
# executed command: 'c:\_work\llvm-project\llvm-project\build\bin\clang.exe' -cc1 -internal-isystem 'C:\_work\llvm-project\llvm-project\build\lib\clang\24\include' -nostdsysteminc -E -dM -ffreestanding -fgnuc-version=4.2.1 -triple=wasm32-wasip1
# note: command had no output on stdout or stderr
# executed command: 'c:\_work\llvm-project\llvm-project\build\bin\filecheck.exe' -match-full-lines -check-prefixes=WEBASSEMBLY,WEBASSEMBLY32,WASI,WASIP1 'C:\_work\llvm-project\llvm-project\clang\test\Preprocessor\init.c'
# note: command had no output on stdout or stderr
# RUN: at line 1692
c:\_work\llvm-project\llvm-project\build\bin\clang.exe -cc1 -internal-isystem C:\_work\llvm-project\llvm-project\build\lib\clang\24\include -nostdsysteminc -E -dM -ffreestanding -fgnuc-version=4.2.1 -triple=wasm64-wasip1 < /dev/null | c:\_work\llvm-project\llvm-project\build\bin\filecheck.exe -match-full-lines -check-prefixes=WEBASSEMBLY,WEBASSEMBLY64,WASI,WASIP1 C:\_work\llvm-project\llvm-project\clang\test\Preprocessor\init.c
# executed command: 'c:\_work\llvm-project\llvm-project\build\bin\clang.exe' -cc1 -internal-isystem 'C:\_work\llvm-project\llvm-project\build\lib\clang\24\include' -nostdsysteminc -E -dM -ffreestanding -fgnuc-version=4.2.1 -triple=wasm64-wasip1
# note: command had no output on stdout or stderr
# executed command: 'c:\_work\llvm-project\llvm-project\build\bin\filecheck.exe' -match-full-lines -check-prefixes=WEBASSEMBLY,WEBASSEMBLY64,WASI,WASIP1 'C:\_work\llvm-project\llvm-project\clang\test\Preprocessor\init.c'
# note: command had no output on stdout or stderr
# RUN: at line 1695
c:\_work\llvm-project\llvm-project\build\bin\clang.exe -cc1 -internal-isystem C:\_work\llvm-project\llvm-project\build\lib\clang\24\include -nostdsysteminc -E -dM -ffreestanding -fgnuc-version=4.2.1 -triple=wasm32-wasip2 < /dev/null | c:\_work\llvm-project\llvm-project\build\bin\filecheck.exe -match-full-lines -check-prefixes=WEBASSEMBLY,WEBASSEMBLY32,WASI,WASIP2 C:\_work\llvm-project\llvm-project\clang\test\Preprocessor\init.c
# executed command: 'c:\_work\llvm-project\llvm-project\build\bin\clang.exe' -cc1 -internal-isystem 'C:\_work\llvm-project\llvm-project\build\lib\clang\24\include' -nostdsysteminc -E -dM -ffreestanding -fgnuc-version=4.2.1 -triple=wasm32-wasip2
# note: command had no output on stdout or stderr
# executed command: 'c:\_work\llvm-project\llvm-project\build\bin\filecheck.exe' -match-full-lines -check-prefixes=WEBASSEMBLY,WEBASSEMBLY32,WASI,WASIP2 'C:\_work\llvm-project\llvm-project\clang\test\Preprocessor\init.c'
# note: command had no output on stdout or stderr
# RUN: at line 1698
c:\_work\llvm-project\llvm-project\build\bin\clang.exe -cc1 -internal-isystem C:\_work\llvm-project\llvm-project\build\lib\clang\24\include -nostdsysteminc -E -dM -ffreestanding -fgnuc-version=4.2.1 -triple=wasm64-wasip2 < /dev/null | c:\_work\llvm-project\llvm-project\build\bin\filecheck.exe -match-full-lines -check-prefixes=WEBASSEMBLY,WEBASSEMBLY64,WASI,WASIP2 C:\_work\llvm-project\llvm-project\clang\test\Preprocessor\init.c
# executed command: 'c:\_work\llvm-project\llvm-project\build\bin\clang.exe' -cc1 -internal-isystem 'C:\_work\llvm-project\llvm-project\build\lib\clang\24\include' -nostdsysteminc -E -dM -ffreestanding -fgnuc-version=4.2.1 -triple=wasm64-wasip2
# note: command had no output on stdout or stderr
# executed command: 'c:\_work\llvm-project\llvm-project\build\bin\filecheck.exe' -match-full-lines -check-prefixes=WEBASSEMBLY,WEBASSEMBLY64,WASI,WASIP2 'C:\_work\llvm-project\llvm-project\clang\test\Preprocessor\init.c'
# note: command had no output on stdout or stderr
# RUN: at line 1701
c:\_work\llvm-project\llvm-project\build\bin\clang.exe -cc1 -internal-isystem C:\_work\llvm-project\llvm-project\build\lib\clang\24\include -nostdsysteminc -E -dM -ffreestanding -fgnuc-version=4.2.1 -triple=wasm32-wasip3 < /dev/null | c:\_work\llvm-project\llvm-project\build\bin\filecheck.exe -match-full-lines -check-prefixes=WEBASSEMBLY,WEBASSEMBLY32,WASI,WASIP3 C:\_work\llvm-project\llvm-project\clang\test\Preprocessor\init.c
# executed command: 'c:\_work\llvm-project\llvm-project\build\bin\clang.exe' -cc1 -internal-isystem 'C:\_work\llvm-project\llvm-project\build\lib\clang\24\include' -nostdsysteminc -E -dM -ffreestanding -fgnuc-version=4.2.1 -triple=wasm32-wasip3
# note: command had no output on stdout or stderr
# executed command: 'c:\_work\llvm-project\llvm-project\build\bin\filecheck.exe' -match-full-lines -check-prefixes=WEBASSEMBLY,WEBASSEMBLY32,WASI,WASIP3 'C:\_work\llvm-project\llvm-project\clang\test\Preprocessor\init.c'
# note: command had no output on stdout or stderr
# RUN: at line 1704
c:\_work\llvm-project\llvm-project\build\bin\clang.exe -cc1 -internal-isystem C:\_work\llvm-project\llvm-project\build\lib\clang\24\include -nostdsysteminc -E -dM -ffreestanding -fgnuc-version=4.2.1 -triple=wasm64-wasip3 < /dev/null | c:\_work\llvm-project\llvm-project\build\bin\filecheck.exe -match-full-lines -check-prefixes=WEBASSEMBLY,WEBASSEMBLY64,WASI,WASIP3 C:\_work\llvm-project\llvm-project\clang\test\Preprocessor\init.c
# executed command: 'c:\_work\llvm-project\llvm-project\build\bin\clang.exe' -cc1 -internal-isystem 'C:\_work\llvm-project\llvm-project\build\lib\clang\24\include' -nostdsysteminc -E -dM -ffreestanding -fgnuc-version=4.2.1 -triple=wasm64-wasip3
# note: command had no output on stdout or stderr
# executed command: 'c:\_work\llvm-project\llvm-project\build\bin\filecheck.exe' -match-full-lines -check-prefixes=WEBASSEMBLY,WEBASSEMBLY64,WASI,WASIP3 'C:\_work\llvm-project\llvm-project\clang\test\Preprocessor\init.c'
# note: command had no output on stdout or stderr
# RUN: at line 1707
c:\_work\llvm-project\llvm-project\build\bin\clang.exe -cc1 -internal-isystem C:\_work\llvm-project\llvm-project\build\lib\clang\24\include -nostdsysteminc -E -dM -ffreestanding -fgnuc-version=4.2.1 -triple=wasm32-unknown-unknown -x c++ < /dev/null | c:\_work\llvm-project\llvm-project\build\bin\filecheck.exe -match-full-lines -check-prefixes=WEBASSEMBLY-CXX C:\_work\llvm-project\llvm-project\clang\test\Preprocessor\init.c
# executed command: 'c:\_work\llvm-project\llvm-project\build\bin\clang.exe' -cc1 -internal-isystem 'C:\_work\llvm-project\llvm-project\build\lib\clang\24\include' -nostdsysteminc -E -dM -ffreestanding -fgnuc-version=4.2.1 -triple=wasm32-unknown-unknown -x c++
# note: command had no output on stdout or stderr
# executed command: 'c:\_work\llvm-project\llvm-project\build\bin\filecheck.exe' -match-full-lines -check-prefixes=WEBASSEMBLY-CXX 'C:\_work\llvm-project\llvm-project\clang\test\Preprocessor\init.c'
# note: command had no output on stdout or stderr
# RUN: at line 1710
c:\_work\llvm-project\llvm-project\build\bin\clang.exe -cc1 -internal-isystem C:\_work\llvm-project\llvm-project\build\lib\clang\24\include -nostdsysteminc -E -dM -ffreestanding -fgnuc-version=4.2.1 -triple=wasm32-unknown-unknown -x c++ -pthread -target-feature +atomics -target-feature +bulk-memory < /dev/null | c:\_work\llvm-project\llvm-project\build\bin\filecheck.exe -match-full-lines -check-prefixes=WEBASSEMBLY-CXX-ATOMICS C:\_work\llvm-project\llvm-project\clang\test\Preprocessor\init.c
# executed command: 'c:\_work\llvm-project\llvm-project\build\bin\clang.exe' -cc1 -internal-isystem 'C:\_work\llvm-project\llvm-project\build\lib\clang\24\include' -nostdsysteminc -E -dM -ffreestanding -fgnuc-version=4.2.1 -triple=wasm32-unknown-unknown -x c++ -pthread -target-feature +atomics -target-feature +bulk-memory
# note: command had no output on stdout or stderr
# executed command: 'c:\_work\llvm-project\llvm-project\build\bin\filecheck.exe' -match-full-lines -check-prefixes=WEBASSEMBLY-CXX-ATOMICS 'C:\_work\llvm-project\llvm-project\clang\test\Preprocessor\init.c'
# note: command had no output on stdout or stderr
# RUN: at line 2158
c:\_work\llvm-project\llvm-project\build\bin\clang.exe -cc1 -internal-isystem C:\_work\llvm-project\llvm-project\build\lib\clang\24\include -nostdsysteminc -E -dM -ffreestanding -fgnuc-version=4.2.1 -triple=avr < /dev/null | c:\_work\llvm-project\llvm-project\build\bin\filecheck.exe -match-full-lines -check-prefix=AVR C:\_work\llvm-project\llvm-project\clang\test\Preprocessor\init.c
# executed command: 'c:\_work\llvm-project\llvm-project\build\bin\clang.exe' -cc1 -internal-isystem 'C:\_work\llvm-project\llvm-project\build\lib\clang\24\include' -nostdsysteminc -E -dM -ffreestanding -fgnuc-version=4.2.1 -triple=avr
# note: command had no output on stdout or stderr
# executed command: 'c:\_work\llvm-project\llvm-project\build\bin\filecheck.exe' -match-full-lines -check-prefix=AVR 'C:\_work\llvm-project\llvm-project\clang\test\Preprocessor\init.c'
# note: command had no output on stdout or stderr
# RUN: at line 2344
c:\_work\llvm-project\llvm-project\build\bin\clang.exe -cc1 -internal-isystem C:\_work\llvm-project\llvm-project\build\lib\clang\24\include -nostdsysteminc -E -dM -ffreestanding -triple i686-windows-msvc -fms-compatibility -x c++ < /dev/null | c:\_work\llvm-project\llvm-project\build\bin\filecheck.exe -match-full-lines -check-prefix MSVC-X32 C:\_work\llvm-project\llvm-project\clang\test\Preprocessor\init.c
# executed command: 'c:\_work\llvm-project\llvm-project\build\bin\clang.exe' -cc1 -internal-isystem 'C:\_work\llvm-project\llvm-project\build\lib\clang\24\include' -nostdsysteminc -E -dM -ffreestanding -triple i686-windows-msvc -fms-compatibility -x c++
# note: command had no output on stdout or stderr
# executed command: 'c:\_work\llvm-project\llvm-project\build\bin\filecheck.exe' -match-full-lines -check-prefix MSVC-X32 'C:\_work\llvm-project\llvm-project\clang\test\Preprocessor\init.c'
# note: command had no output on stdout or stderr
# RUN: at line 2348
c:\_work\llvm-project\llvm-project\build\bin\clang.exe -cc1 -internal-isystem C:\_work\llvm-project\llvm-project\build\lib\clang\24\include -nostdsysteminc -E -dM -ffreestanding -triple x86_64-windows-msvc -fms-compatibility -x c++ < /dev/null | c:\_work\llvm-project\llvm-project\build\bin\filecheck.exe -match-full-lines -check-prefix MSVC-X64 C:\_work\llvm-project\llvm-project\clang\test\Preprocessor\init.c
# executed command: 'c:\_work\llvm-project\llvm-project\build\bin\clang.exe' -cc1 -internal-isystem 'C:\_work\llvm-project\llvm-project\build\lib\clang\24\include' -nostdsysteminc -E -dM -ffreestanding -triple x86_64-windows-msvc -fms-compatibility -x c++
# note: command had no output on stdout or stderr
# executed command: 'c:\_work\llvm-project\llvm-project\build\bin\filecheck.exe' -match-full-lines -check-prefix MSVC-X64 'C:\_work\llvm-project\llvm-project\clang\test\Preprocessor\init.c'
# note: command had no output on stdout or stderr
# RUN: at line 2378
c:\_work\llvm-project\llvm-project\build\bin\clang.exe -cc1 -internal-isystem C:\_work\llvm-project\llvm-project\build\lib\clang\24\include -nostdsysteminc -E -dM -ffreestanding -fgnuc-version=4.2.1 -triple=aarch64-apple-ios9 < /dev/null | c:\_work\llvm-project\llvm-project\build\bin\filecheck.exe -check-prefix=DARWIN C:\_work\llvm-project\llvm-project\clang\test\Preprocessor\init.c
# executed command: 'c:\_work\llvm-project\llvm-project\build\bin\clang.exe' -cc1 -internal-isystem 'C:\_work\llvm-project\llvm-project\build\lib\clang\24\include' -nostdsysteminc -E -dM -ffreestanding -fgnuc-version=4.2.1 -triple=aarch64-apple-ios9
# note: command had no output on stdout or stderr
# executed command: 'c:\_work\llvm-project\llvm-project\build\bin\filecheck.exe' -check-prefix=DARWIN 'C:\_work\llvm-project\llvm-project\clang\test\Preprocessor\init.c'
# note: command had no output on stdout or stderr
# RUN: at line 2381
c:\_work\llvm-project\llvm-project\build\bin\clang.exe -cc1 -internal-isystem C:\_work\llvm-project\llvm-project\build\lib\clang\24\include -nostdsysteminc -E -dM -ffreestanding -fgnuc-version=4.2.1 -triple=aarch64-apple-macosx10.12 < /dev/null | c:\_work\llvm-project\llvm-project\build\bin\filecheck.exe -check-prefix=DARWIN C:\_work\llvm-project\llvm-project\clang\test\Preprocessor\init.c
# executed command: 'c:\_work\llvm-project\llvm-project\build\bin\clang.exe' -cc1 -internal-isystem 'C:\_work\llvm-project\llvm-project\build\lib\clang\24\include' -nostdsysteminc -E -dM -ffreestanding -fgnuc-version=4.2.1 -triple=aarch64-apple-macosx10.12
# note: command had no output on stdout or stderr
# executed command: 'c:\_work\llvm-project\llvm-project\build\bin\filecheck.exe' -check-prefix=DARWIN 'C:\_work\llvm-project\llvm-project\clang\test\Preprocessor\init.c'
# note: command had no output on stdout or stderr
# RUN: at line 2388
c:\_work\llvm-project\llvm-project\build\bin\clang.exe -cc1 -internal-isystem C:\_work\llvm-project\llvm-project\build\lib\clang\24\include -nostdsysteminc -triple i386-apple-macosx -ffreestanding -dM -E /dev/null -o - | c:\_work\llvm-project\llvm-project\build\bin\filecheck.exe -match-full-lines -check-prefix MACOS-32 C:\_work\llvm-project\llvm-project\clang\test\Preprocessor\init.c
# executed command: 'c:\_work\llvm-project\llvm-project\build\bin\clang.exe' -cc1 -internal-isystem 'C:\_work\llvm-project\llvm-project\build\lib\clang\24\include' -nostdsysteminc -triple i386-apple-macosx -ffreestanding -dM -E /dev/null -o -
# note: command had no output on stdout or stderr
# executed command: 'c:\_work\llvm-project\llvm-project\build\bin\filecheck.exe' -match-full-lines -check-prefix MACOS-32 'C:\_work\llvm-project\llvm-project\clang\test\Preprocessor\init.c'
# note: command had no output on stdout or stderr
# RUN: at line 2389
c:\_work\llvm-project\llvm-project\build\bin\clang.exe -cc1 -internal-isystem C:\_work\llvm-project\llvm-project\build\lib\clang\24\include -nostdsysteminc -triple x86_64-apple-macosx -ffreestanding -dM -E /dev/null -o - | c:\_work\llvm-project\llvm-project\build\bin\filecheck.exe -match-full-lines -check-prefix MACOS-64 C:\_work\llvm-project\llvm-project\clang\test\Preprocessor\init.c
# executed command: 'c:\_work\llvm-project\llvm-project\build\bin\clang.exe' -cc1 -internal-isystem 'C:\_work\llvm-project\llvm-project\build\lib\clang\24\include' -nostdsysteminc -triple x86_64-apple-macosx -ffreestanding -dM -E /dev/null -o -
# note: command had no output on stdout or stderr
# executed command: 'c:\_work\llvm-project\llvm-project\build\bin\filecheck.exe' -match-full-lines -check-prefix MACOS-64 'C:\_work\llvm-project\llvm-project\clang\test\Preprocessor\init.c'
# note: command had no output on stdout or stderr
# RUN: at line 2399
c:\_work\llvm-project\llvm-project\build\bin\clang.exe -cc1 -internal-isystem C:\_work\llvm-project\llvm-project\build\lib\clang\24\include -nostdsysteminc -triple i386-apple-ios-simulator -ffreestanding -dM -E /dev/null -o - | c:\_work\llvm-project\llvm-project\build\bin\filecheck.exe -match-full-lines -check-prefix IOS-32 C:\_work\llvm-project\llvm-project\clang\test\Preprocessor\init.c
# executed command: 'c:\_work\llvm-project\llvm-project\build\bin\clang.exe' -cc1 -internal-isystem 'C:\_work\llvm-project\llvm-project\build\lib\clang\24\include' -nostdsysteminc -triple i386-apple-ios-simulator -ffreestanding -dM -E /dev/null -o -
# note: command had no output on stdout or stderr
# executed command: 'c:\_work\llvm-project\llvm-project\build\bin\filecheck.exe' -match-full-lines -check-prefix IOS-32 'C:\_work\llvm-project\llvm-project\clang\test\Preprocessor\init.c'
# note: command had no output on stdout or stderr
# RUN: at line 2400
c:\_work\llvm-project\llvm-project\build\bin\clang.exe -cc1 -internal-isystem C:\_work\llvm-project\llvm-project\build\lib\clang\24\include -nostdsysteminc -triple armv7-apple-ios -ffreestanding -dM -E /dev/null -o - | c:\_work\llvm-project\llvm-project\build\bin\filecheck.exe -match-full-lines -check-prefix IOS-32 C:\_work\llvm-project\llvm-project\clang\test\Preprocessor\init.c
# executed command: 'c:\_work\llvm-project\llvm-project\build\bin\clang.exe' -cc1 -internal-isystem 'C:\_work\llvm-project\llvm-project\build\lib\clang\24\include' -nostdsysteminc -triple armv7-apple-ios -ffreestanding -dM -E /dev/null -o -
# note: command had no output on stdout or stderr
# executed command: 'c:\_work\llvm-project\llvm-project\build\bin\filecheck.exe' -match-full-lines -check-prefix IOS-32 'C:\_work\llvm-project\llvm-project\clang\test\Preprocessor\init.c'
# note: command had no output on stdout or stderr
# RUN: at line 2401
c:\_work\llvm-project\llvm-project\build\bin\clang.exe -cc1 -internal-isystem C:\_work\llvm-project\llvm-project\build\lib\clang\24\include -nostdsysteminc -triple x86_64-apple-ios-simulator -ffreestanding -dM -E /dev/null -o - | c:\_work\llvm-project\llvm-project\build\bin\filecheck.exe -match-full-lines -check-prefix IOS-64 C:\_work\llvm-project\llvm-project\clang\test\Preprocessor\init.c
# executed command: 'c:\_work\llvm-project\llvm-project\build\bin\clang.exe' -cc1 -internal-isystem 'C:\_work\llvm-project\llvm-project\build\lib\clang\24\include' -nostdsysteminc -triple x86_64-apple-ios-simulator -ffreestanding -dM -E /dev/null -o -
# note: command had no output on stdout or stderr
# executed command: 'c:\_work\llvm-project\llvm-project\build\bin\filecheck.exe' -match-full-lines -check-prefix IOS-64 'C:\_work\llvm-project\llvm-project\clang\test\Preprocessor\init.c'
# note: command had no output on stdout or stderr
# RUN: at line 2402
c:\_work\llvm-project\llvm-project\build\bin\clang.exe -cc1 -internal-isystem C:\_work\llvm-project\llvm-project\build\lib\clang\24\include -nostdsysteminc -triple arm64-apple-ios -ffreestanding -dM -E /dev/null -o - | c:\_work\llvm-project\llvm-project\build\bin\filecheck.exe -match-full-lines -check-prefix IOS-64 C:\_work\llvm-project\llvm-project\clang\test\Preprocessor\init.c
# executed command: 'c:\_work\llvm-project\llvm-project\build\bin\clang.exe' -cc1 -internal-isystem 'C:\_work\llvm-project\llvm-project\build\lib\clang\24\include' -nostdsysteminc -triple arm64-apple-ios -ffreestanding -dM -E /dev/null -o -
# note: command had no output on stdout or stderr
# executed command: 'c:\_work\llvm-project\llvm-project\build\bin\filecheck.exe' -match-full-lines -check-prefix IOS-64 'C:\_work\llvm-project\llvm-project\clang\test\Preprocessor\init.c'
# note: command had no output on stdout or stderr
# RUN: at line 2412
c:\_work\llvm-project\llvm-project\build\bin\clang.exe -cc1 -internal-isystem C:\_work\llvm-project\llvm-project\build\lib\clang\24\include -nostdsysteminc -triple i386-apple-tvos-simulator -ffreestanding -dM -E /dev/null -o - | c:\_work\llvm-project\llvm-project\build\bin\filecheck.exe -match-full-lines -check-prefix TVOS-32 C:\_work\llvm-project\llvm-project\clang\test\Preprocessor\init.c
# executed command: 'c:\_work\llvm-project\llvm-project\build\bin\clang.exe' -cc1 -internal-isystem 'C:\_work\llvm-project\llvm-project\build\lib\clang\24\include' -nostdsysteminc -triple i386-apple-tvos-simulator -ffreestanding -dM -E /dev/null -o -
# note: command had no output on stdout or stderr
# executed command: 'c:\_work\llvm-project\llvm-project\build\bin\filecheck.exe' -match-full-lines -check-prefix TVOS-32 'C:\_work\llvm-project\llvm-project\clang\test\Preprocessor\init.c'
# note: command had no output on stdout or stderr
# RUN: at line 2413
c:\_work\llvm-project\llvm-project\build\bin\clang.exe -cc1 -internal-isystem C:\_work\llvm-project\llvm-project\build\lib\clang\24\include -nostdsysteminc -triple armv7-apple-tvos -ffreestanding -dM -E /dev/null -o - | c:\_work\llvm-project\llvm-project\build\bin\filecheck.exe -match-full-lines -check-prefix TVOS-32 C:\_work\llvm-project\llvm-project\clang\test\Preprocessor\init.c
# executed command: 'c:\_work\llvm-project\llvm-project\build\bin\clang.exe' -cc1 -internal-isystem 'C:\_work\llvm-project\llvm-project\build\lib\clang\24\include' -nostdsysteminc -triple armv7-apple-tvos -ffreestanding -dM -E /dev/null -o -
# note: command had no output on stdout or stderr
# executed command: 'c:\_work\llvm-project\llvm-project\build\bin\filecheck.exe' -match-full-lines -check-prefix TVOS-32 'C:\_work\llvm-project\llvm-project\clang\test\Preprocessor\init.c'
# note: command had no output on stdout or stderr
# RUN: at line 2414
c:\_work\llvm-project\llvm-project\build\bin\clang.exe -cc1 -internal-isystem C:\_work\llvm-project\llvm-project\build\lib\clang\24\include -nostdsysteminc -triple x86_64-apple-tvos-simulator -ffreestanding -dM -E /dev/null -o - | c:\_work\llvm-project\llvm-project\build\bin\filecheck.exe -match-full-lines -check-prefix TVOS-64 C:\_work\llvm-project\llvm-project\clang\test\Preprocessor\init.c
# executed command: 'c:\_work\llvm-project\llvm-project\build\bin\clang.exe' -cc1 -internal-isystem 'C:\_work\llvm-project\llvm-project\build\lib\clang\24\include' -nostdsysteminc -triple x86_64-apple-tvos-simulator -ffreestanding -dM -E /dev/null -o -
# note: command had no output on stdout or stderr
# executed command: 'c:\_work\llvm-project\llvm-project\build\bin\filecheck.exe' -match-full-lines -check-prefix TVOS-64 'C:\_work\llvm-project\llvm-project\clang\test\Preprocessor\init.c'
# note: command had no output on stdout or stderr
# RUN: at line 2415
c:\_work\llvm-project\llvm-project\build\bin\clang.exe -cc1 -internal-isystem C:\_work\llvm-project\llvm-project\build\lib\clang\24\include -nostdsysteminc -triple arm64-apple-tvos -ffreestanding -dM -E /dev/null -o - | c:\_work\llvm-project\llvm-project\build\bin\filecheck.exe -match-full-lines -check-prefix TVOS-64 C:\_work\llvm-project\llvm-project\clang\test\Preprocessor\init.c
# executed command: 'c:\_work\llvm-project\llvm-project\build\bin\clang.exe' -cc1 -internal-isystem 'C:\_work\llvm-project\llvm-project\build\lib\clang\24\include' -nostdsysteminc -triple arm64-apple-tvos -ffreestanding -dM -E /dev/null -o -
# note: command had no output on stdout or stderr
# executed command: 'c:\_work\llvm-project\llvm-project\build\bin\filecheck.exe' -match-full-lines -check-prefix TVOS-64 'C:\_work\llvm-project\llvm-project\clang\test\Preprocessor\init.c'
# note: command had no output on stdout or stderr
# RUN: at line 2425
c:\_work\llvm-project\llvm-project\build\bin\clang.exe -cc1 -internal-isystem C:\_work\llvm-project\llvm-project\build\lib\clang\24\include -nostdsysteminc -triple i386-apple-watchos-simulator -ffreestanding -dM -E /dev/null -o - | c:\_work\llvm-project\llvm-project\build\bin\filecheck.exe -match-full-lines -check-prefix WATCHOS-32 C:\_work\llvm-project\llvm-project\clang\test\Preprocessor\init.c
# executed command: 'c:\_work\llvm-project\llvm-project\build\bin\clang.exe' -cc1 -internal-isystem 'C:\_work\llvm-project\llvm-project\build\lib\clang\24\include' -nostdsysteminc -triple i386-apple-watchos-simulator -ffreestanding -dM -E /dev/null -o -
# note: command had no output on stdout or stderr
# executed command: 'c:\_work\llvm-project\llvm-project\build\bin\filecheck.exe' -match-full-lines -check-prefix WATCHOS-32 'C:\_work\llvm-project\llvm-project\clang\test\Preprocessor\init.c'
# note: command had no output on stdout or stderr
# RUN: at line 2426
c:\_work\llvm-project\llvm-project\build\bin\clang.exe -cc1 -internal-isystem C:\_work\llvm-project\llvm-project\build\lib\clang\24\include -nostdsysteminc -triple armv7k-apple-watchos -ffreestanding -dM -E /dev/null -o - | c:\_work\llvm-project\llvm-project\build\bin\filecheck.exe -match-full-lines -check-prefix WATCHOS-64 C:\_work\llvm-project\llvm-project\clang\test\Preprocessor\init.c
# executed command: 'c:\_work\llvm-project\llvm-project\build\bin\clang.exe' -cc1 -internal-isystem 'C:\_work\llvm-project\llvm-project\build\lib\clang\24\include' -nostdsysteminc -triple armv7k-apple-watchos -ffreestanding -dM -E /dev/null -o -
# note: command had no output on stdout or stderr
# executed command: 'c:\_work\llvm-project\llvm-project\build\bin\filecheck.exe' -match-full-lines -check-prefix WATCHOS-64 'C:\_work\llvm-project\llvm-project\clang\test\Preprocessor\init.c'
# note: command had no output on stdout or stderr
# RUN: at line 2427
c:\_work\llvm-project\llvm-project\build\bin\clang.exe -cc1 -internal-isystem C:\_work\llvm-project\llvm-project\build\lib\clang\24\include -nostdsysteminc -triple x86_64-apple-watchos-simulator -ffreestanding -dM -E /dev/null -o - | c:\_work\llvm-project\llvm-project\build\bin\filecheck.exe -match-full-lines -check-prefix WATCHOS-64 C:\_work\llvm-project\llvm-project\clang\test\Preprocessor\init.c
# executed command: 'c:\_work\llvm-project\llvm-project\build\bin\clang.exe' -cc1 -internal-isystem 'C:\_work\llvm-project\llvm-project\build\lib\clang\24\include' -nostdsysteminc -triple x86_64-apple-watchos-simulator -ffreestanding -dM -E /dev/null -o -
# note: command had no output on stdout or stderr
# executed command: 'c:\_work\llvm-project\llvm-project\build\bin\filecheck.exe' -match-full-lines -check-prefix WATCHOS-64 'C:\_work\llvm-project\llvm-project\clang\test\Preprocessor\init.c'
# note: command had no output on stdout or stderr
# RUN: at line 2428
c:\_work\llvm-project\llvm-project\build\bin\clang.exe -cc1 -internal-isystem C:\_work\llvm-project\llvm-project\build\lib\clang\24\include -nostdsysteminc -triple arm64-apple-watchos -ffreestanding -dM -E /dev/null -o - | c:\_work\llvm-project\llvm-project\build\bin\filecheck.exe -match-full-lines -check-prefix WATCHOS-64 C:\_work\llvm-project\llvm-project\clang\test\Preprocessor\init.c
# executed command: 'c:\_work\llvm-project\llvm-project\build\bin\clang.exe' -cc1 -internal-isystem 'C:\_work\llvm-project\llvm-project\build\lib\clang\24\include' -nostdsysteminc -triple arm64-apple-watchos -ffreestanding -dM -E /dev/null -o -
# note: command had no output on stdout or stderr
# executed command: 'c:\_work\llvm-project\llvm-project\build\bin\filecheck.exe' -match-full-lines -check-prefix WATCHOS-64 'C:\_work\llvm-project\llvm-project\clang\test\Preprocessor\init.c'
# note: command had no output on stdout or stderr
# RUN: at line 2438
c:\_work\llvm-project\llvm-project\build\bin\clang.exe -cc1 -internal-isystem C:\_work\llvm-project\llvm-project\build\lib\clang\24\include -nostdsysteminc -triple armv7-apple-none-macho -ffreestanding -dM -E /dev/null -o - | c:\_work\llvm-project\llvm-project\build\bin\filecheck.exe -match-full-lines -check-prefix ARM-DARWIN-BAREMETAL-32 C:\_work\llvm-project\llvm-project\clang\test\Preprocessor\init.c
# executed command: 'c:\_work\llvm-project\llvm-project\build\bin\clang.exe' -cc1 -internal-isystem 'C:\_work\llvm-project\llvm-project\build\lib\clang\24\include' -nostdsysteminc -triple armv7-apple-none-macho -ffreestanding -dM -E /dev/null -o -
# note: command had no output on stdout or stderr
# executed command: 'c:\_work\llvm-project\llvm-project\build\bin\filecheck.exe' -match-full-lines -check-prefix ARM-DARWIN-BAREMETAL-32 'C:\_work\llvm-project\llvm-project\clang\test\Preprocessor\init.c'
# note: command had no output on stdout or stderr
# RUN: at line 2439
c:\_work\llvm-project\llvm-project\build\bin\clang.exe -cc1 -internal-isystem C:\_work\llvm-project\llvm-project\build\lib\clang\24\include -nostdsysteminc -triple arm64-apple-none-macho -ffreestanding -dM -E /dev/null -o - | c:\_work\llvm-project\llvm-project\build\bin\filecheck.exe -match-full-lines -check-prefix ARM-DARWIN-BAREMETAL-64 C:\_work\llvm-project\llvm-project\clang\test\Preprocessor\init.c
# executed command: 'c:\_work\llvm-project\llvm-project\build\bin\clang.exe' -cc1 -internal-isystem 'C:\_work\llvm-project\llvm-project\build\lib\clang\24\include' -nostdsysteminc -triple arm64-apple-none-macho -ffreestanding -dM -E /dev/null -o -
# note: command had no output on stdout or stderr
# executed command: 'c:\_work\llvm-project\llvm-project\build\bin\filecheck.exe' -match-full-lines -check-prefix ARM-DARWIN-BAREMETAL-64 'C:\_work\llvm-project\llvm-project\clang\test\Preprocessor\init.c'
# note: command had no output on stdout or stderr
# RUN: at line 2451
c:\_work\llvm-project\llvm-project\build\bin\clang.exe -cc1 -internal-isystem C:\_work\llvm-project\llvm-project\build\lib\clang\24\include -nostdsysteminc -E -dM -ffreestanding -fgnuc-version=4.2.1 -triple=riscv32 < /dev/null | c:\_work\llvm-project\llvm-project\build\bin\filecheck.exe -match-full-lines -check-prefix=RISCV32 C:\_work\llvm-project\llvm-project\clang\test\Preprocessor\init.c
# executed command: 'c:\_work\llvm-project\llvm-project\build\bin\clang.exe' -cc1 -internal-isystem 'C:\_work\llvm-project\llvm-project\build\lib\clang\24\include' -nostdsysteminc -E -dM -ffreestanding -fgnuc-version=4.2.1 -triple=riscv32
# note: command had no output on stdout or stderr
# executed command: 'c:\_work\llvm-project\llvm-project\build\bin\filecheck.exe' -match-full-lines -check-prefix=RISCV32 'C:\_work\llvm-project\llvm-project\clang\test\Preprocessor\init.c'
# note: command had no output on stdout or stderr
# RUN: at line 2453
c:\_work\llvm-project\llvm-project\build\bin\clang.exe -cc1 -internal-isystem C:\_work\llvm-project\llvm-project\build\lib\clang\24\include -nostdsysteminc -E -dM -ffreestanding -fgnuc-version=4.2.1 -triple=riscv32-unknown-linux < /dev/null | c:\_work\llvm-project\llvm-project\build\bin\filecheck.exe -match-full-lines -check-prefixes=RISCV32,RISCV32-LINUX C:\_work\llvm-project\llvm-project\clang\test\Preprocessor\init.c
# executed command: 'c:\_work\llvm-project\llvm-project\build\bin\clang.exe' -cc1 -internal-isystem 'C:\_work\llvm-project\llvm-project\build\lib\clang\24\include' -nostdsysteminc -E -dM -ffreestanding -fgnuc-version=4.2.1 -triple=riscv32-unknown-linux
# note: command had no output on stdout or stderr
# executed command: 'c:\_work\llvm-project\llvm-project\build\bin\filecheck.exe' -match-full-lines -check-prefixes=RISCV32,RISCV32-LINUX 'C:\_work\llvm-project\llvm-project\clang\test\Preprocessor\init.c'
# .---command stderr------------
# | C:\_work\llvm-project\llvm-project\clang\test\Preprocessor\init.c:2665:19: error: RISCV32-LINUX: expected string not found in input
# | // RISCV32-LINUX: #define __gnu_linux__ 1
# | ^
# | <stdin>:366:26: note: scanning from here
# | #define __WINT_WIDTH__ 32
# | ^
# | <stdin>:375:1: note: possible intended match here
# | #define __linux__ 1
# | ^
# |
# | Input file: <stdin>
# | Check file: C:\_work\llvm-project\llvm-project\clang\test\Preprocessor\init.c
# |
# | -dump-input=help explains the following input dump.
# |
# | Input was:
# | <<<<<<
# | .
# | .
# | .
# | 361: #define __WCHAR_WIDTH__ 32
# | 362: #define __WINT_MAX__ 4294967295U
# | 363: #define __WINT_MIN__ 0U
# | 364: #define __WINT_TYPE__ unsigned int
# | 365: #define __WINT_UNSIGNED__ 1
# | 366: #define __WINT_WIDTH__ 32
# | check:2665'0 { search range start (exclusive)
# | check:2665'1 error: no match found in search range
# | 367: #define __clang__ 1
# | 368: #define __clang_literal_encoding__ "UTF-8"
# | 369: #define __clang_major__ 24
# | 370: #define __clang_minor__ 0
# | 371: #define __clang_patchlevel__ 0
# | 372: #define __clang_version__ "24.0.0git (https://github.com/llvm/llvm-project 1e36267418e9d99c458d16594aae9b2ea77f98b7)"
# | 373: #define __clang_wide_literal_encoding__ "UTF-32"
# | 374: #define __linux 1
# | 375: #define __linux__ 1
# | check:2665'2 ? possible intended match
# | 376: #define __llvm__ 1
# | 377: #define __riscv 1
# | 378: #define __riscv_arch_test 1
# | 379: #define __riscv_cmodel_medlow 1
# | 380: #define __riscv_float_abi_soft 1
# | 381: #define __riscv_i 2001000
# | 382: #define __riscv_misaligned_avoid 1
# | 383: #define __riscv_v_intrinsic 1000000
# | 384: #define __riscv_xlen 32
# | 385: #define __unix 1
# | 386: #define __unix__ 1
# | 387: #define linux 1
# | 388: #define unix 1
# | check:2665'3 } search range end (exclusive)
# | >>>>>>
# `-----------------------------
# error: command failed with exit status: 1
--
```
</details>
If these failures are unrelated to your changes (for example tests are broken or flaky at HEAD), please open an issue at https://github.com/llvm/llvm-project/issues and add the `infrastructure` label.
https://github.com/llvm/llvm-project/pull/227243
More information about the cfe-commits
mailing list