[clang] [clang][OSTargets] Only predefine `__gnu_linux__` on *-linux-gnu (PR #227243)
via cfe-commits
cfe-commits at lists.llvm.org
Tue Sep 29 03:49:41 PDT 2026
github-actions[bot] wrote:
<!--PREMERGE ADVISOR COMMENT: Linux-->
# :penguin: Linux x64 Test Results
* 61686 tests passed
* 1964 tests skipped
* 4 tests failed
## Failed Tests
(click on a test name to see its output)
### Clang
<details>
<summary>Clang.Preprocessor/hexagon-predefines.c</summary>
```
Exit Code: 1
Command Output (stdout):
--
# RUN: at line 1
/home/gha/actions-runner/_work/llvm-project/llvm-project/build/bin/clang -cc1 -internal-isystem /home/gha/actions-runner/_work/llvm-project/llvm-project/build/lib/clang/24/include -nostdsysteminc -E -dM -triple hexagon-unknown-elf -target-cpu hexagonv5 /home/gha/actions-runner/_work/llvm-project/llvm-project/clang/test/Preprocessor/hexagon-predefines.c | /home/gha/actions-runner/_work/llvm-project/llvm-project/build/bin/FileCheck /home/gha/actions-runner/_work/llvm-project/llvm-project/clang/test/Preprocessor/hexagon-predefines.c -check-prefix CHECK-V5
# executed command: /home/gha/actions-runner/_work/llvm-project/llvm-project/build/bin/clang -cc1 -internal-isystem /home/gha/actions-runner/_work/llvm-project/llvm-project/build/lib/clang/24/include -nostdsysteminc -E -dM -triple hexagon-unknown-elf -target-cpu hexagonv5 /home/gha/actions-runner/_work/llvm-project/llvm-project/clang/test/Preprocessor/hexagon-predefines.c
# note: command had no output on stdout or stderr
# executed command: /home/gha/actions-runner/_work/llvm-project/llvm-project/build/bin/FileCheck /home/gha/actions-runner/_work/llvm-project/llvm-project/clang/test/Preprocessor/hexagon-predefines.c -check-prefix CHECK-V5
# note: command had no output on stdout or stderr
# RUN: at line 8
/home/gha/actions-runner/_work/llvm-project/llvm-project/build/bin/clang -cc1 -internal-isystem /home/gha/actions-runner/_work/llvm-project/llvm-project/build/lib/clang/24/include -nostdsysteminc -E -dM -triple hexagon-unknown-elf -target-cpu hexagonv55 /home/gha/actions-runner/_work/llvm-project/llvm-project/clang/test/Preprocessor/hexagon-predefines.c | /home/gha/actions-runner/_work/llvm-project/llvm-project/build/bin/FileCheck /home/gha/actions-runner/_work/llvm-project/llvm-project/clang/test/Preprocessor/hexagon-predefines.c -check-prefix CHECK-V55
# executed command: /home/gha/actions-runner/_work/llvm-project/llvm-project/build/bin/clang -cc1 -internal-isystem /home/gha/actions-runner/_work/llvm-project/llvm-project/build/lib/clang/24/include -nostdsysteminc -E -dM -triple hexagon-unknown-elf -target-cpu hexagonv55 /home/gha/actions-runner/_work/llvm-project/llvm-project/clang/test/Preprocessor/hexagon-predefines.c
# note: command had no output on stdout or stderr
# executed command: /home/gha/actions-runner/_work/llvm-project/llvm-project/build/bin/FileCheck /home/gha/actions-runner/_work/llvm-project/llvm-project/clang/test/Preprocessor/hexagon-predefines.c -check-prefix CHECK-V55
# note: command had no output on stdout or stderr
# RUN: at line 15
/home/gha/actions-runner/_work/llvm-project/llvm-project/build/bin/clang -cc1 -internal-isystem /home/gha/actions-runner/_work/llvm-project/llvm-project/build/lib/clang/24/include -nostdsysteminc -E -dM -triple hexagon-unknown-elf -target-cpu hexagonv60 /home/gha/actions-runner/_work/llvm-project/llvm-project/clang/test/Preprocessor/hexagon-predefines.c | /home/gha/actions-runner/_work/llvm-project/llvm-project/build/bin/FileCheck /home/gha/actions-runner/_work/llvm-project/llvm-project/clang/test/Preprocessor/hexagon-predefines.c -check-prefix CHECK-V60
# executed command: /home/gha/actions-runner/_work/llvm-project/llvm-project/build/bin/clang -cc1 -internal-isystem /home/gha/actions-runner/_work/llvm-project/llvm-project/build/lib/clang/24/include -nostdsysteminc -E -dM -triple hexagon-unknown-elf -target-cpu hexagonv60 /home/gha/actions-runner/_work/llvm-project/llvm-project/clang/test/Preprocessor/hexagon-predefines.c
# note: command had no output on stdout or stderr
# executed command: /home/gha/actions-runner/_work/llvm-project/llvm-project/build/bin/FileCheck /home/gha/actions-runner/_work/llvm-project/llvm-project/clang/test/Preprocessor/hexagon-predefines.c -check-prefix CHECK-V60
# note: command had no output on stdout or stderr
# RUN: at line 22
/home/gha/actions-runner/_work/llvm-project/llvm-project/build/bin/clang -cc1 -internal-isystem /home/gha/actions-runner/_work/llvm-project/llvm-project/build/lib/clang/24/include -nostdsysteminc -E -dM -triple hexagon-unknown-elf -target-cpu hexagonv62 /home/gha/actions-runner/_work/llvm-project/llvm-project/clang/test/Preprocessor/hexagon-predefines.c | /home/gha/actions-runner/_work/llvm-project/llvm-project/build/bin/FileCheck /home/gha/actions-runner/_work/llvm-project/llvm-project/clang/test/Preprocessor/hexagon-predefines.c -check-prefix CHECK-V62
# executed command: /home/gha/actions-runner/_work/llvm-project/llvm-project/build/bin/clang -cc1 -internal-isystem /home/gha/actions-runner/_work/llvm-project/llvm-project/build/lib/clang/24/include -nostdsysteminc -E -dM -triple hexagon-unknown-elf -target-cpu hexagonv62 /home/gha/actions-runner/_work/llvm-project/llvm-project/clang/test/Preprocessor/hexagon-predefines.c
# note: command had no output on stdout or stderr
# executed command: /home/gha/actions-runner/_work/llvm-project/llvm-project/build/bin/FileCheck /home/gha/actions-runner/_work/llvm-project/llvm-project/clang/test/Preprocessor/hexagon-predefines.c -check-prefix CHECK-V62
# note: command had no output on stdout or stderr
# RUN: at line 29
/home/gha/actions-runner/_work/llvm-project/llvm-project/build/bin/clang -cc1 -internal-isystem /home/gha/actions-runner/_work/llvm-project/llvm-project/build/lib/clang/24/include -nostdsysteminc -E -dM -triple hexagon-unknown-elf -target-cpu hexagonv65 /home/gha/actions-runner/_work/llvm-project/llvm-project/clang/test/Preprocessor/hexagon-predefines.c | /home/gha/actions-runner/_work/llvm-project/llvm-project/build/bin/FileCheck /home/gha/actions-runner/_work/llvm-project/llvm-project/clang/test/Preprocessor/hexagon-predefines.c -check-prefix CHECK-V65
# executed command: /home/gha/actions-runner/_work/llvm-project/llvm-project/build/bin/clang -cc1 -internal-isystem /home/gha/actions-runner/_work/llvm-project/llvm-project/build/lib/clang/24/include -nostdsysteminc -E -dM -triple hexagon-unknown-elf -target-cpu hexagonv65 /home/gha/actions-runner/_work/llvm-project/llvm-project/clang/test/Preprocessor/hexagon-predefines.c
# note: command had no output on stdout or stderr
# executed command: /home/gha/actions-runner/_work/llvm-project/llvm-project/build/bin/FileCheck /home/gha/actions-runner/_work/llvm-project/llvm-project/clang/test/Preprocessor/hexagon-predefines.c -check-prefix CHECK-V65
# note: command had no output on stdout or stderr
# RUN: at line 36
/home/gha/actions-runner/_work/llvm-project/llvm-project/build/bin/clang -cc1 -internal-isystem /home/gha/actions-runner/_work/llvm-project/llvm-project/build/lib/clang/24/include -nostdsysteminc -E -dM -triple hexagon-unknown-elf -target-cpu hexagonv66 /home/gha/actions-runner/_work/llvm-project/llvm-project/clang/test/Preprocessor/hexagon-predefines.c | /home/gha/actions-runner/_work/llvm-project/llvm-project/build/bin/FileCheck /home/gha/actions-runner/_work/llvm-project/llvm-project/clang/test/Preprocessor/hexagon-predefines.c -check-prefix CHECK-V66
# executed command: /home/gha/actions-runner/_work/llvm-project/llvm-project/build/bin/clang -cc1 -internal-isystem /home/gha/actions-runner/_work/llvm-project/llvm-project/build/lib/clang/24/include -nostdsysteminc -E -dM -triple hexagon-unknown-elf -target-cpu hexagonv66 /home/gha/actions-runner/_work/llvm-project/llvm-project/clang/test/Preprocessor/hexagon-predefines.c
# note: command had no output on stdout or stderr
# executed command: /home/gha/actions-runner/_work/llvm-project/llvm-project/build/bin/FileCheck /home/gha/actions-runner/_work/llvm-project/llvm-project/clang/test/Preprocessor/hexagon-predefines.c -check-prefix CHECK-V66
# note: command had no output on stdout or stderr
# RUN: at line 46
/home/gha/actions-runner/_work/llvm-project/llvm-project/build/bin/clang -cc1 -internal-isystem /home/gha/actions-runner/_work/llvm-project/llvm-project/build/lib/clang/24/include -nostdsysteminc -E -dM -triple hexagon-unknown-elf -target-cpu hexagonv60 -target-feature +hvxv60 -target-feature +hvx-length64b /home/gha/actions-runner/_work/llvm-project/llvm-project/clang/test/Preprocessor/hexagon-predefines.c | /home/gha/actions-runner/_work/llvm-project/llvm-project/build/bin/FileCheck /home/gha/actions-runner/_work/llvm-project/llvm-project/clang/test/Preprocessor/hexagon-predefines.c -check-prefix CHECK-V60HVX-64B
# executed command: /home/gha/actions-runner/_work/llvm-project/llvm-project/build/bin/clang -cc1 -internal-isystem /home/gha/actions-runner/_work/llvm-project/llvm-project/build/lib/clang/24/include -nostdsysteminc -E -dM -triple hexagon-unknown-elf -target-cpu hexagonv60 -target-feature +hvxv60 -target-feature +hvx-length64b /home/gha/actions-runner/_work/llvm-project/llvm-project/clang/test/Preprocessor/hexagon-predefines.c
# note: command had no output on stdout or stderr
# executed command: /home/gha/actions-runner/_work/llvm-project/llvm-project/build/bin/FileCheck /home/gha/actions-runner/_work/llvm-project/llvm-project/clang/test/Preprocessor/hexagon-predefines.c -check-prefix CHECK-V60HVX-64B
# note: command had no output on stdout or stderr
# RUN: at line 57
/home/gha/actions-runner/_work/llvm-project/llvm-project/build/bin/clang -cc1 -internal-isystem /home/gha/actions-runner/_work/llvm-project/llvm-project/build/lib/clang/24/include -nostdsysteminc -E -dM -triple hexagon-unknown-elf -target-cpu hexagonv60 -target-feature +hvxv60 -target-feature +hvx-length128b /home/gha/actions-runner/_work/llvm-project/llvm-project/clang/test/Preprocessor/hexagon-predefines.c | /home/gha/actions-runner/_work/llvm-project/llvm-project/build/bin/FileCheck /home/gha/actions-runner/_work/llvm-project/llvm-project/clang/test/Preprocessor/hexagon-predefines.c -check-prefix CHECK-V60HVX-128B
# executed command: /home/gha/actions-runner/_work/llvm-project/llvm-project/build/bin/clang -cc1 -internal-isystem /home/gha/actions-runner/_work/llvm-project/llvm-project/build/lib/clang/24/include -nostdsysteminc -E -dM -triple hexagon-unknown-elf -target-cpu hexagonv60 -target-feature +hvxv60 -target-feature +hvx-length128b /home/gha/actions-runner/_work/llvm-project/llvm-project/clang/test/Preprocessor/hexagon-predefines.c
# note: command had no output on stdout or stderr
# executed command: /home/gha/actions-runner/_work/llvm-project/llvm-project/build/bin/FileCheck /home/gha/actions-runner/_work/llvm-project/llvm-project/clang/test/Preprocessor/hexagon-predefines.c -check-prefix CHECK-V60HVX-128B
# note: command had no output on stdout or stderr
# RUN: at line 68
/home/gha/actions-runner/_work/llvm-project/llvm-project/build/bin/clang -cc1 -internal-isystem /home/gha/actions-runner/_work/llvm-project/llvm-project/build/lib/clang/24/include -nostdsysteminc -E -dM -triple hexagon-unknown-elf -target-cpu hexagonv66 -target-feature +hvxv66 -target-feature +hvx-length64b /home/gha/actions-runner/_work/llvm-project/llvm-project/clang/test/Preprocessor/hexagon-predefines.c | /home/gha/actions-runner/_work/llvm-project/llvm-project/build/bin/FileCheck /home/gha/actions-runner/_work/llvm-project/llvm-project/clang/test/Preprocessor/hexagon-predefines.c -check-prefix CHECK-V66HVX-64B
# executed command: /home/gha/actions-runner/_work/llvm-project/llvm-project/build/bin/clang -cc1 -internal-isystem /home/gha/actions-runner/_work/llvm-project/llvm-project/build/lib/clang/24/include -nostdsysteminc -E -dM -triple hexagon-unknown-elf -target-cpu hexagonv66 -target-feature +hvxv66 -target-feature +hvx-length64b /home/gha/actions-runner/_work/llvm-project/llvm-project/clang/test/Preprocessor/hexagon-predefines.c
# note: command had no output on stdout or stderr
# executed command: /home/gha/actions-runner/_work/llvm-project/llvm-project/build/bin/FileCheck /home/gha/actions-runner/_work/llvm-project/llvm-project/clang/test/Preprocessor/hexagon-predefines.c -check-prefix CHECK-V66HVX-64B
# note: command had no output on stdout or stderr
# RUN: at line 79
/home/gha/actions-runner/_work/llvm-project/llvm-project/build/bin/clang -cc1 -internal-isystem /home/gha/actions-runner/_work/llvm-project/llvm-project/build/lib/clang/24/include -nostdsysteminc -E -dM -triple hexagon-unknown-elf -target-cpu hexagonv66 -target-feature +hvxv66 -target-feature +hvx-length128b /home/gha/actions-runner/_work/llvm-project/llvm-project/clang/test/Preprocessor/hexagon-predefines.c | /home/gha/actions-runner/_work/llvm-project/llvm-project/build/bin/FileCheck /home/gha/actions-runner/_work/llvm-project/llvm-project/clang/test/Preprocessor/hexagon-predefines.c -check-prefix CHECK-V66HVX-128B
# executed command: /home/gha/actions-runner/_work/llvm-project/llvm-project/build/bin/clang -cc1 -internal-isystem /home/gha/actions-runner/_work/llvm-project/llvm-project/build/lib/clang/24/include -nostdsysteminc -E -dM -triple hexagon-unknown-elf -target-cpu hexagonv66 -target-feature +hvxv66 -target-feature +hvx-length128b /home/gha/actions-runner/_work/llvm-project/llvm-project/clang/test/Preprocessor/hexagon-predefines.c
# note: command had no output on stdout or stderr
# executed command: /home/gha/actions-runner/_work/llvm-project/llvm-project/build/bin/FileCheck /home/gha/actions-runner/_work/llvm-project/llvm-project/clang/test/Preprocessor/hexagon-predefines.c -check-prefix CHECK-V66HVX-128B
# note: command had no output on stdout or stderr
# RUN: at line 90
/home/gha/actions-runner/_work/llvm-project/llvm-project/build/bin/clang -cc1 -internal-isystem /home/gha/actions-runner/_work/llvm-project/llvm-project/build/lib/clang/24/include -nostdsysteminc -E -dM -triple hexagon-unknown-elf -target-cpu hexagonv67 -target-feature +hvxv67 -target-feature +hvx-length128b /home/gha/actions-runner/_work/llvm-project/llvm-project/clang/test/Preprocessor/hexagon-predefines.c | /home/gha/actions-runner/_work/llvm-project/llvm-project/build/bin/FileCheck /home/gha/actions-runner/_work/llvm-project/llvm-project/clang/test/Preprocessor/hexagon-predefines.c -check-prefix CHECK-V67HVX-128B
# executed command: /home/gha/actions-runner/_work/llvm-project/llvm-project/build/bin/clang -cc1 -internal-isystem /home/gha/actions-runner/_work/llvm-project/llvm-project/build/lib/clang/24/include -nostdsysteminc -E -dM -triple hexagon-unknown-elf -target-cpu hexagonv67 -target-feature +hvxv67 -target-feature +hvx-length128b /home/gha/actions-runner/_work/llvm-project/llvm-project/clang/test/Preprocessor/hexagon-predefines.c
# note: command had no output on stdout or stderr
# executed command: /home/gha/actions-runner/_work/llvm-project/llvm-project/build/bin/FileCheck /home/gha/actions-runner/_work/llvm-project/llvm-project/clang/test/Preprocessor/hexagon-predefines.c -check-prefix CHECK-V67HVX-128B
# note: command had no output on stdout or stderr
# RUN: at line 100
/home/gha/actions-runner/_work/llvm-project/llvm-project/build/bin/clang -cc1 -internal-isystem /home/gha/actions-runner/_work/llvm-project/llvm-project/build/lib/clang/24/include -nostdsysteminc -E -dM -triple hexagon-unknown-elf -target-cpu hexagonv68 -target-feature +hvxv68 -target-feature +hvx-length128b /home/gha/actions-runner/_work/llvm-project/llvm-project/clang/test/Preprocessor/hexagon-predefines.c | /home/gha/actions-runner/_work/llvm-project/llvm-project/build/bin/FileCheck /home/gha/actions-runner/_work/llvm-project/llvm-project/clang/test/Preprocessor/hexagon-predefines.c -check-prefix CHECK-V68HVX-128B
# executed command: /home/gha/actions-runner/_work/llvm-project/llvm-project/build/bin/clang -cc1 -internal-isystem /home/gha/actions-runner/_work/llvm-project/llvm-project/build/lib/clang/24/include -nostdsysteminc -E -dM -triple hexagon-unknown-elf -target-cpu hexagonv68 -target-feature +hvxv68 -target-feature +hvx-length128b /home/gha/actions-runner/_work/llvm-project/llvm-project/clang/test/Preprocessor/hexagon-predefines.c
# note: command had no output on stdout or stderr
# executed command: /home/gha/actions-runner/_work/llvm-project/llvm-project/build/bin/FileCheck /home/gha/actions-runner/_work/llvm-project/llvm-project/clang/test/Preprocessor/hexagon-predefines.c -check-prefix CHECK-V68HVX-128B
# note: command had no output on stdout or stderr
# RUN: at line 111
/home/gha/actions-runner/_work/llvm-project/llvm-project/build/bin/clang -cc1 -internal-isystem /home/gha/actions-runner/_work/llvm-project/llvm-project/build/lib/clang/24/include -nostdsysteminc -E -dM -triple hexagon-unknown-elf -target-cpu hexagonv68 -target-feature +hvxv68 -target-feature +hvx-length128b -target-feature +hvx-ieee-fp /home/gha/actions-runner/_work/llvm-project/llvm-project/clang/test/Preprocessor/hexagon-predefines.c | /home/gha/actions-runner/_work/llvm-project/llvm-project/build/bin/FileCheck /home/gha/actions-runner/_work/llvm-project/llvm-project/clang/test/Preprocessor/hexagon-predefines.c -check-prefix CHECK-V68HVX-IEEE-FP
# executed command: /home/gha/actions-runner/_work/llvm-project/llvm-project/build/bin/clang -cc1 -internal-isystem /home/gha/actions-runner/_work/llvm-project/llvm-project/build/lib/clang/24/include -nostdsysteminc -E -dM -triple hexagon-unknown-elf -target-cpu hexagonv68 -target-feature +hvxv68 -target-feature +hvx-length128b -target-feature +hvx-ieee-fp /home/gha/actions-runner/_work/llvm-project/llvm-project/clang/test/Preprocessor/hexagon-predefines.c
# note: command had no output on stdout or stderr
# executed command: /home/gha/actions-runner/_work/llvm-project/llvm-project/build/bin/FileCheck /home/gha/actions-runner/_work/llvm-project/llvm-project/clang/test/Preprocessor/hexagon-predefines.c -check-prefix CHECK-V68HVX-IEEE-FP
# note: command had no output on stdout or stderr
# RUN: at line 123
/home/gha/actions-runner/_work/llvm-project/llvm-project/build/bin/clang -cc1 -internal-isystem /home/gha/actions-runner/_work/llvm-project/llvm-project/build/lib/clang/24/include -nostdsysteminc -E -dM -triple hexagon-unknown-elf -target-cpu hexagonv69 -target-feature +hvxv69 -target-feature +hvx-length128b /home/gha/actions-runner/_work/llvm-project/llvm-project/clang/test/Preprocessor/hexagon-predefines.c | /home/gha/actions-runner/_work/llvm-project/llvm-project/build/bin/FileCheck /home/gha/actions-runner/_work/llvm-project/llvm-project/clang/test/Preprocessor/hexagon-predefines.c -check-prefix CHECK-V69HVX-128B
# executed command: /home/gha/actions-runner/_work/llvm-project/llvm-project/build/bin/clang -cc1 -internal-isystem /home/gha/actions-runner/_work/llvm-project/llvm-project/build/lib/clang/24/include -nostdsysteminc -E -dM -triple hexagon-unknown-elf -target-cpu hexagonv69 -target-feature +hvxv69 -target-feature +hvx-length128b /home/gha/actions-runner/_work/llvm-project/llvm-project/clang/test/Preprocessor/hexagon-predefines.c
# note: command had no output on stdout or stderr
# executed command: /home/gha/actions-runner/_work/llvm-project/llvm-project/build/bin/FileCheck /home/gha/actions-runner/_work/llvm-project/llvm-project/clang/test/Preprocessor/hexagon-predefines.c -check-prefix CHECK-V69HVX-128B
# note: command had no output on stdout or stderr
# RUN: at line 133
/home/gha/actions-runner/_work/llvm-project/llvm-project/build/bin/clang -cc1 -internal-isystem /home/gha/actions-runner/_work/llvm-project/llvm-project/build/lib/clang/24/include -nostdsysteminc -E -dM -triple hexagon-unknown-elf -target-cpu hexagonv71 -target-feature +hvxv71 -target-feature +hvx-length128b /home/gha/actions-runner/_work/llvm-project/llvm-project/clang/test/Preprocessor/hexagon-predefines.c | /home/gha/actions-runner/_work/llvm-project/llvm-project/build/bin/FileCheck /home/gha/actions-runner/_work/llvm-project/llvm-project/clang/test/Preprocessor/hexagon-predefines.c -check-prefix CHECK-V71HVX-128B
# executed command: /home/gha/actions-runner/_work/llvm-project/llvm-project/build/bin/clang -cc1 -internal-isystem /home/gha/actions-runner/_work/llvm-project/llvm-project/build/lib/clang/24/include -nostdsysteminc -E -dM -triple hexagon-unknown-elf -target-cpu hexagonv71 -target-feature +hvxv71 -target-feature +hvx-length128b /home/gha/actions-runner/_work/llvm-project/llvm-project/clang/test/Preprocessor/hexagon-predefines.c
# note: command had no output on stdout or stderr
# executed command: /home/gha/actions-runner/_work/llvm-project/llvm-project/build/bin/FileCheck /home/gha/actions-runner/_work/llvm-project/llvm-project/clang/test/Preprocessor/hexagon-predefines.c -check-prefix CHECK-V71HVX-128B
# note: command had no output on stdout or stderr
# RUN: at line 143
/home/gha/actions-runner/_work/llvm-project/llvm-project/build/bin/clang -cc1 -internal-isystem /home/gha/actions-runner/_work/llvm-project/llvm-project/build/lib/clang/24/include -nostdsysteminc -E -dM -triple hexagon-unknown-elf -target-cpu hexagonv73 -target-feature +hvxv73 -target-feature +hvx-length128b /home/gha/actions-runner/_work/llvm-project/llvm-project/clang/test/Preprocessor/hexagon-predefines.c | /home/gha/actions-runner/_work/llvm-project/llvm-project/build/bin/FileCheck /home/gha/actions-runner/_work/llvm-project/llvm-project/clang/test/Preprocessor/hexagon-predefines.c -check-prefix CHECK-V73HVX-128B
# executed command: /home/gha/actions-runner/_work/llvm-project/llvm-project/build/bin/clang -cc1 -internal-isystem /home/gha/actions-runner/_work/llvm-project/llvm-project/build/lib/clang/24/include -nostdsysteminc -E -dM -triple hexagon-unknown-elf -target-cpu hexagonv73 -target-feature +hvxv73 -target-feature +hvx-length128b /home/gha/actions-runner/_work/llvm-project/llvm-project/clang/test/Preprocessor/hexagon-predefines.c
# note: command had no output on stdout or stderr
# executed command: /home/gha/actions-runner/_work/llvm-project/llvm-project/build/bin/FileCheck /home/gha/actions-runner/_work/llvm-project/llvm-project/clang/test/Preprocessor/hexagon-predefines.c -check-prefix CHECK-V73HVX-128B
# note: command had no output on stdout or stderr
# RUN: at line 153
/home/gha/actions-runner/_work/llvm-project/llvm-project/build/bin/clang -cc1 -internal-isystem /home/gha/actions-runner/_work/llvm-project/llvm-project/build/lib/clang/24/include -nostdsysteminc -E -dM -triple hexagon-unknown-elf -target-cpu hexagonv75 /home/gha/actions-runner/_work/llvm-project/llvm-project/clang/test/Preprocessor/hexagon-predefines.c | /home/gha/actions-runner/_work/llvm-project/llvm-project/build/bin/FileCheck /home/gha/actions-runner/_work/llvm-project/llvm-project/clang/test/Preprocessor/hexagon-predefines.c -check-prefix CHECK-V75
# executed command: /home/gha/actions-runner/_work/llvm-project/llvm-project/build/bin/clang -cc1 -internal-isystem /home/gha/actions-runner/_work/llvm-project/llvm-project/build/lib/clang/24/include -nostdsysteminc -E -dM -triple hexagon-unknown-elf -target-cpu hexagonv75 /home/gha/actions-runner/_work/llvm-project/llvm-project/clang/test/Preprocessor/hexagon-predefines.c
# note: command had no output on stdout or stderr
# executed command: /home/gha/actions-runner/_work/llvm-project/llvm-project/build/bin/FileCheck /home/gha/actions-runner/_work/llvm-project/llvm-project/clang/test/Preprocessor/hexagon-predefines.c -check-prefix CHECK-V75
# note: command had no output on stdout or stderr
# RUN: at line 160
/home/gha/actions-runner/_work/llvm-project/llvm-project/build/bin/clang -cc1 -internal-isystem /home/gha/actions-runner/_work/llvm-project/llvm-project/build/lib/clang/24/include -nostdsysteminc -E -dM -triple hexagon-unknown-elf -target-cpu hexagonv75 -target-feature +hvxv75 -target-feature +hvx-length128b /home/gha/actions-runner/_work/llvm-project/llvm-project/clang/test/Preprocessor/hexagon-predefines.c | /home/gha/actions-runner/_work/llvm-project/llvm-project/build/bin/FileCheck /home/gha/actions-runner/_work/llvm-project/llvm-project/clang/test/Preprocessor/hexagon-predefines.c -check-prefix CHECK-V75HVX-128B
# executed command: /home/gha/actions-runner/_work/llvm-project/llvm-project/build/bin/clang -cc1 -internal-isystem /home/gha/actions-runner/_work/llvm-project/llvm-project/build/lib/clang/24/include -nostdsysteminc -E -dM -triple hexagon-unknown-elf -target-cpu hexagonv75 -target-feature +hvxv75 -target-feature +hvx-length128b /home/gha/actions-runner/_work/llvm-project/llvm-project/clang/test/Preprocessor/hexagon-predefines.c
# note: command had no output on stdout or stderr
# executed command: /home/gha/actions-runner/_work/llvm-project/llvm-project/build/bin/FileCheck /home/gha/actions-runner/_work/llvm-project/llvm-project/clang/test/Preprocessor/hexagon-predefines.c -check-prefix CHECK-V75HVX-128B
# note: command had no output on stdout or stderr
# RUN: at line 170
/home/gha/actions-runner/_work/llvm-project/llvm-project/build/bin/clang -cc1 -internal-isystem /home/gha/actions-runner/_work/llvm-project/llvm-project/build/lib/clang/24/include -nostdsysteminc -E -dM -triple hexagon-unknown-elf -target-cpu hexagonv79 /home/gha/actions-runner/_work/llvm-project/llvm-project/clang/test/Preprocessor/hexagon-predefines.c | /home/gha/actions-runner/_work/llvm-project/llvm-project/build/bin/FileCheck /home/gha/actions-runner/_work/llvm-project/llvm-project/clang/test/Preprocessor/hexagon-predefines.c -check-prefix CHECK-V79
# executed command: /home/gha/actions-runner/_work/llvm-project/llvm-project/build/bin/clang -cc1 -internal-isystem /home/gha/actions-runner/_work/llvm-project/llvm-project/build/lib/clang/24/include -nostdsysteminc -E -dM -triple hexagon-unknown-elf -target-cpu hexagonv79 /home/gha/actions-runner/_work/llvm-project/llvm-project/clang/test/Preprocessor/hexagon-predefines.c
# note: command had no output on stdout or stderr
# executed command: /home/gha/actions-runner/_work/llvm-project/llvm-project/build/bin/FileCheck /home/gha/actions-runner/_work/llvm-project/llvm-project/clang/test/Preprocessor/hexagon-predefines.c -check-prefix CHECK-V79
# note: command had no output on stdout or stderr
# RUN: at line 177
/home/gha/actions-runner/_work/llvm-project/llvm-project/build/bin/clang -cc1 -internal-isystem /home/gha/actions-runner/_work/llvm-project/llvm-project/build/lib/clang/24/include -nostdsysteminc -E -dM -triple hexagon-unknown-elf -target-cpu hexagonv79 -target-feature +hvxv79 -target-feature +hvx-length128b /home/gha/actions-runner/_work/llvm-project/llvm-project/clang/test/Preprocessor/hexagon-predefines.c | /home/gha/actions-runner/_work/llvm-project/llvm-project/build/bin/FileCheck /home/gha/actions-runner/_work/llvm-project/llvm-project/clang/test/Preprocessor/hexagon-predefines.c -check-prefix CHECK-V79HVX-128B
# executed command: /home/gha/actions-runner/_work/llvm-project/llvm-project/build/bin/clang -cc1 -internal-isystem /home/gha/actions-runner/_work/llvm-project/llvm-project/build/lib/clang/24/include -nostdsysteminc -E -dM -triple hexagon-unknown-elf -target-cpu hexagonv79 -target-feature +hvxv79 -target-feature +hvx-length128b /home/gha/actions-runner/_work/llvm-project/llvm-project/clang/test/Preprocessor/hexagon-predefines.c
# note: command had no output on stdout or stderr
# executed command: /home/gha/actions-runner/_work/llvm-project/llvm-project/build/bin/FileCheck /home/gha/actions-runner/_work/llvm-project/llvm-project/clang/test/Preprocessor/hexagon-predefines.c -check-prefix CHECK-V79HVX-128B
# note: command had no output on stdout or stderr
# RUN: at line 187
/home/gha/actions-runner/_work/llvm-project/llvm-project/build/bin/clang -cc1 -internal-isystem /home/gha/actions-runner/_work/llvm-project/llvm-project/build/lib/clang/24/include -nostdsysteminc -E -dM -triple hexagon-unknown-elf -target-cpu hexagonv81 /home/gha/actions-runner/_work/llvm-project/llvm-project/clang/test/Preprocessor/hexagon-predefines.c | /home/gha/actions-runner/_work/llvm-project/llvm-project/build/bin/FileCheck /home/gha/actions-runner/_work/llvm-project/llvm-project/clang/test/Preprocessor/hexagon-predefines.c -check-prefix CHECK-V81
# executed command: /home/gha/actions-runner/_work/llvm-project/llvm-project/build/bin/clang -cc1 -internal-isystem /home/gha/actions-runner/_work/llvm-project/llvm-project/build/lib/clang/24/include -nostdsysteminc -E -dM -triple hexagon-unknown-elf -target-cpu hexagonv81 /home/gha/actions-runner/_work/llvm-project/llvm-project/clang/test/Preprocessor/hexagon-predefines.c
# note: command had no output on stdout or stderr
# executed command: /home/gha/actions-runner/_work/llvm-project/llvm-project/build/bin/FileCheck /home/gha/actions-runner/_work/llvm-project/llvm-project/clang/test/Preprocessor/hexagon-predefines.c -check-prefix CHECK-V81
# note: command had no output on stdout or stderr
# RUN: at line 194
/home/gha/actions-runner/_work/llvm-project/llvm-project/build/bin/clang -cc1 -internal-isystem /home/gha/actions-runner/_work/llvm-project/llvm-project/build/lib/clang/24/include -nostdsysteminc -E -dM -triple hexagon-unknown-elf -target-cpu hexagonv81 -target-feature +hvxv81 -target-feature +hvx-length128b /home/gha/actions-runner/_work/llvm-project/llvm-project/clang/test/Preprocessor/hexagon-predefines.c | /home/gha/actions-runner/_work/llvm-project/llvm-project/build/bin/FileCheck /home/gha/actions-runner/_work/llvm-project/llvm-project/clang/test/Preprocessor/hexagon-predefines.c -check-prefix CHECK-V81HVX-128B
# executed command: /home/gha/actions-runner/_work/llvm-project/llvm-project/build/bin/clang -cc1 -internal-isystem /home/gha/actions-runner/_work/llvm-project/llvm-project/build/lib/clang/24/include -nostdsysteminc -E -dM -triple hexagon-unknown-elf -target-cpu hexagonv81 -target-feature +hvxv81 -target-feature +hvx-length128b /home/gha/actions-runner/_work/llvm-project/llvm-project/clang/test/Preprocessor/hexagon-predefines.c
# note: command had no output on stdout or stderr
# executed command: /home/gha/actions-runner/_work/llvm-project/llvm-project/build/bin/FileCheck /home/gha/actions-runner/_work/llvm-project/llvm-project/clang/test/Preprocessor/hexagon-predefines.c -check-prefix CHECK-V81HVX-128B
# note: command had no output on stdout or stderr
# RUN: at line 204
/home/gha/actions-runner/_work/llvm-project/llvm-project/build/bin/clang -cc1 -internal-isystem /home/gha/actions-runner/_work/llvm-project/llvm-project/build/lib/clang/24/include -nostdsysteminc -E -dM -triple hexagon-unknown-elf -target-cpu hexagonv67 -target-feature +hvxv67 -target-feature +hvx-length128b /home/gha/actions-runner/_work/llvm-project/llvm-project/clang/test/Preprocessor/hexagon-predefines.c | /home/gha/actions-runner/_work/llvm-project/llvm-project/build/bin/FileCheck /home/gha/actions-runner/_work/llvm-project/llvm-project/clang/test/Preprocessor/hexagon-predefines.c -check-prefix CHECK-ELF
# executed command: /home/gha/actions-runner/_work/llvm-project/llvm-project/build/bin/clang -cc1 -internal-isystem /home/gha/actions-runner/_work/llvm-project/llvm-project/build/lib/clang/24/include -nostdsysteminc -E -dM -triple hexagon-unknown-elf -target-cpu hexagonv67 -target-feature +hvxv67 -target-feature +hvx-length128b /home/gha/actions-runner/_work/llvm-project/llvm-project/clang/test/Preprocessor/hexagon-predefines.c
# note: command had no output on stdout or stderr
# executed command: /home/gha/actions-runner/_work/llvm-project/llvm-project/build/bin/FileCheck /home/gha/actions-runner/_work/llvm-project/llvm-project/clang/test/Preprocessor/hexagon-predefines.c -check-prefix CHECK-ELF
# note: command had no output on stdout or stderr
# RUN: at line 209
/home/gha/actions-runner/_work/llvm-project/llvm-project/build/bin/clang -cc1 -internal-isystem /home/gha/actions-runner/_work/llvm-project/llvm-project/build/lib/clang/24/include -nostdsysteminc -E -dM -triple hexagon-unknown-linux-musl -target-cpu hexagonv67 -target-feature +hvxv67 -target-feature +hvx-length128b /home/gha/actions-runner/_work/llvm-project/llvm-project/clang/test/Preprocessor/hexagon-predefines.c | /home/gha/actions-runner/_work/llvm-project/llvm-project/build/bin/FileCheck /home/gha/actions-runner/_work/llvm-project/llvm-project/clang/test/Preprocessor/hexagon-predefines.c -check-prefix CHECK-LINUX
# executed command: /home/gha/actions-runner/_work/llvm-project/llvm-project/build/bin/clang -cc1 -internal-isystem /home/gha/actions-runner/_work/llvm-project/llvm-project/build/lib/clang/24/include -nostdsysteminc -E -dM -triple hexagon-unknown-linux-musl -target-cpu hexagonv67 -target-feature +hvxv67 -target-feature +hvx-length128b /home/gha/actions-runner/_work/llvm-project/llvm-project/clang/test/Preprocessor/hexagon-predefines.c
# note: command had no output on stdout or stderr
# executed command: /home/gha/actions-runner/_work/llvm-project/llvm-project/build/bin/FileCheck /home/gha/actions-runner/_work/llvm-project/llvm-project/clang/test/Preprocessor/hexagon-predefines.c -check-prefix CHECK-LINUX
# .---command stderr------------
# | /home/gha/actions-runner/_work/llvm-project/llvm-project/clang/test/Preprocessor/hexagon-predefines.c:213:17: error: CHECK-LINUX: expected string not found in input
# | // CHECK-LINUX: #define __gnu_linux__ 1
# | ^
# | <stdin>:1:1: note: scanning from here
# | #define _ILP32 1
# | ^
# | <stdin>:28:1: note: possible intended match here
# | #define __DBL_DIG__ 15
# | ^
# |
# | Input file: <stdin>
# | Check file: /home/gha/actions-runner/_work/llvm-project/llvm-project/clang/test/Preprocessor/hexagon-predefines.c
# |
# | -dump-input=help explains the following input dump.
# |
# | Input was:
# | <<<<<<
# | 1: #define _ILP32 1
# | check:213'0 { search range start (exclusive)
# | check:213'1 error: no match found in search range
# | 2: #define __ATOMIC_ACQUIRE 2
# | 3: #define __ATOMIC_ACQ_REL 4
# | 4: #define __ATOMIC_CONSUME 1
# | 5: #define __ATOMIC_RELAXED 0
# | 6: #define __ATOMIC_RELEASE 3
# | .
# | .
# | .
# | 23: #define __CLANG_ATOMIC_SHORT_LOCK_FREE 2
# | 24: #define __CLANG_ATOMIC_WCHAR_T_LOCK_FREE 2
# | 25: #define __CONSTANT_CFSTRINGS__ 1
# | 26: #define __DBL_DECIMAL_DIG__ 17
# | 27: #define __DBL_DENORM_MIN__ 4.9406564584124654e-324
# | 28: #define __DBL_DIG__ 15
# | check:213'2 ? possible intended match
# | 29: #define __DBL_EPSILON__ 2.2204460492503131e-16
# | 30: #define __DBL_HAS_DENORM__ 1
# | 31: #define __DBL_HAS_INFINITY__ 1
# | 32: #define __DBL_HAS_QUIET_NAN__ 1
# | 33: #define __DBL_MANT_DIG__ 53
# | .
# | .
# | .
# | 356: #define __llvm__ 1
# | 357: #define __qdsp6__ 1
# | 358: #define __unix 1
# | 359: #define __unix__ 1
# | 360: #define linux 1
# | 361: #define unix 1
# | check:213'3 } search range end (exclusive)
# | >>>>>>
# `-----------------------------
# error: command failed with exit status: 1
--
```
</details>
<details>
<summary>Clang.Preprocessor/init-csky.c</summary>
```
Exit Code: 1
Command Output (stdout):
--
# RUN: at line 1
/home/gha/actions-runner/_work/llvm-project/llvm-project/build/bin/clang -cc1 -internal-isystem /home/gha/actions-runner/_work/llvm-project/llvm-project/build/lib/clang/24/include -nostdsysteminc -E -dM -ffreestanding -fgnuc-version=4.2.1 -triple=csky < /dev/null | /home/gha/actions-runner/_work/llvm-project/llvm-project/build/bin/FileCheck -match-full-lines -check-prefix=CSKY /home/gha/actions-runner/_work/llvm-project/llvm-project/clang/test/Preprocessor/init-csky.c
# executed command: /home/gha/actions-runner/_work/llvm-project/llvm-project/build/bin/clang -cc1 -internal-isystem /home/gha/actions-runner/_work/llvm-project/llvm-project/build/lib/clang/24/include -nostdsysteminc -E -dM -ffreestanding -fgnuc-version=4.2.1 -triple=csky
# note: command had no output on stdout or stderr
# executed command: /home/gha/actions-runner/_work/llvm-project/llvm-project/build/bin/FileCheck -match-full-lines -check-prefix=CSKY /home/gha/actions-runner/_work/llvm-project/llvm-project/clang/test/Preprocessor/init-csky.c
# note: command had no output on stdout or stderr
# RUN: at line 3
/home/gha/actions-runner/_work/llvm-project/llvm-project/build/bin/clang -cc1 -internal-isystem /home/gha/actions-runner/_work/llvm-project/llvm-project/build/lib/clang/24/include -nostdsysteminc -E -dM -ffreestanding -fgnuc-version=4.2.1 -triple=csky-unknown-linux < /dev/null | /home/gha/actions-runner/_work/llvm-project/llvm-project/build/bin/FileCheck -match-full-lines -check-prefixes=CSKY,CSKY-LINUX /home/gha/actions-runner/_work/llvm-project/llvm-project/clang/test/Preprocessor/init-csky.c
# executed command: /home/gha/actions-runner/_work/llvm-project/llvm-project/build/bin/clang -cc1 -internal-isystem /home/gha/actions-runner/_work/llvm-project/llvm-project/build/lib/clang/24/include -nostdsysteminc -E -dM -ffreestanding -fgnuc-version=4.2.1 -triple=csky-unknown-linux
# note: command had no output on stdout or stderr
# executed command: /home/gha/actions-runner/_work/llvm-project/llvm-project/build/bin/FileCheck -match-full-lines -check-prefixes=CSKY,CSKY-LINUX /home/gha/actions-runner/_work/llvm-project/llvm-project/clang/test/Preprocessor/init-csky.c
# .---command stderr------------
# | /home/gha/actions-runner/_work/llvm-project/llvm-project/clang/test/Preprocessor/init-csky.c:215:16: error: CSKY-LINUX: expected string not found in input
# | // CSKY-LINUX: #define __gnu_linux__ 1
# | ^
# | <stdin>:369:21: note: scanning from here
# | #define __cskyle__ 1
# | ^
# | <stdin>:371:1: note: possible intended match here
# | #define __linux__ 1
# | ^
# |
# | Input file: <stdin>
# | Check file: /home/gha/actions-runner/_work/llvm-project/llvm-project/clang/test/Preprocessor/init-csky.c
# |
# | -dump-input=help explains the following input dump.
# |
# | Input was:
# | <<<<<<
# | .
# | .
# | .
# | 364: #define __clang_version__ "24.0.0git (https://github.com/llvm/llvm-project 1e36267418e9d99c458d16594aae9b2ea77f98b7)"
# | 365: #define __clang_wide_literal_encoding__ "UTF-32"
# | 366: #define __cskyLE__ 1
# | 367: #define __csky__ 2
# | 368: #define __cskyabi__ 2
# | 369: #define __cskyle__ 1
# | check:215'0 { search range start (exclusive)
# | check:215'1 error: no match found in search range
# | 370: #define __linux 1
# | 371: #define __linux__ 1
# | check:215'2 ? possible intended match
# | 372: #define __llvm__ 1
# | 373: #define __unix 1
# | 374: #define __unix__ 1
# | 375: #define linux 1
# | 376: #define unix 1
# | check:215'3 } search range end (exclusive)
# | >>>>>>
# `-----------------------------
# error: command failed with exit status: 1
--
```
</details>
<details>
<summary>Clang.Preprocessor/init-loongarch.c</summary>
```
Exit Code: 1
Command Output (stdout):
--
# RUN: at line 1
/home/gha/actions-runner/_work/llvm-project/llvm-project/build/bin/clang -cc1 -internal-isystem /home/gha/actions-runner/_work/llvm-project/llvm-project/build/lib/clang/24/include -nostdsysteminc -E -dM -ffreestanding -fgnuc-version=4.2.1 -triple loongarch32 /dev/null | /home/gha/actions-runner/_work/llvm-project/llvm-project/build/bin/FileCheck --match-full-lines --check-prefix=LA32 /home/gha/actions-runner/_work/llvm-project/llvm-project/clang/test/Preprocessor/init-loongarch.c
# executed command: /home/gha/actions-runner/_work/llvm-project/llvm-project/build/bin/clang -cc1 -internal-isystem /home/gha/actions-runner/_work/llvm-project/llvm-project/build/lib/clang/24/include -nostdsysteminc -E -dM -ffreestanding -fgnuc-version=4.2.1 -triple loongarch32 /dev/null
# note: command had no output on stdout or stderr
# executed command: /home/gha/actions-runner/_work/llvm-project/llvm-project/build/bin/FileCheck --match-full-lines --check-prefix=LA32 /home/gha/actions-runner/_work/llvm-project/llvm-project/clang/test/Preprocessor/init-loongarch.c
# note: command had no output on stdout or stderr
# RUN: at line 3
/home/gha/actions-runner/_work/llvm-project/llvm-project/build/bin/clang -cc1 -internal-isystem /home/gha/actions-runner/_work/llvm-project/llvm-project/build/lib/clang/24/include -nostdsysteminc -E -dM -ffreestanding -fgnuc-version=4.2.1 -triple loongarch32-unknown-linux /dev/null | /home/gha/actions-runner/_work/llvm-project/llvm-project/build/bin/FileCheck --match-full-lines --check-prefixes=LA32,LA32-LINUX /home/gha/actions-runner/_work/llvm-project/llvm-project/clang/test/Preprocessor/init-loongarch.c
# executed command: /home/gha/actions-runner/_work/llvm-project/llvm-project/build/bin/clang -cc1 -internal-isystem /home/gha/actions-runner/_work/llvm-project/llvm-project/build/lib/clang/24/include -nostdsysteminc -E -dM -ffreestanding -fgnuc-version=4.2.1 -triple loongarch32-unknown-linux /dev/null
# note: command had no output on stdout or stderr
# executed command: /home/gha/actions-runner/_work/llvm-project/llvm-project/build/bin/FileCheck --match-full-lines --check-prefixes=LA32,LA32-LINUX /home/gha/actions-runner/_work/llvm-project/llvm-project/clang/test/Preprocessor/init-loongarch.c
# .---command stderr------------
# | /home/gha/actions-runner/_work/llvm-project/llvm-project/clang/test/Preprocessor/init-loongarch.c:341:16: error: LA32-LINUX: expected string not found in input
# | // LA32-LINUX: #define __gnu_linux__ 1
# | ^
# | <stdin>:369:26: note: scanning from here
# | #define __WINT_WIDTH__ 32
# | ^
# | <stdin>:378:1: note: possible intended match here
# | #define __linux__ 1
# | ^
# |
# | Input file: <stdin>
# | Check file: /home/gha/actions-runner/_work/llvm-project/llvm-project/clang/test/Preprocessor/init-loongarch.c
# |
# | -dump-input=help explains the following input dump.
# |
# | Input was:
# | <<<<<<
# | .
# | .
# | .
# | 364: #define __WCHAR_WIDTH__ 32
# | 365: #define __WINT_MAX__ 4294967295U
# | 366: #define __WINT_MIN__ 0U
# | 367: #define __WINT_TYPE__ unsigned int
# | 368: #define __WINT_UNSIGNED__ 1
# | 369: #define __WINT_WIDTH__ 32
# | check:341'0 { search range start (exclusive)
# | check:341'1 error: no match found in search range
# | 370: #define __clang__ 1
# | 371: #define __clang_literal_encoding__ "UTF-8"
# | 372: #define __clang_major__ 24
# | 373: #define __clang_minor__ 0
# | 374: #define __clang_patchlevel__ 0
# | 375: #define __clang_version__ "24.0.0git (https://github.com/llvm/llvm-project 1e36267418e9d99c458d16594aae9b2ea77f98b7)"
# | 376: #define __clang_wide_literal_encoding__ "UTF-32"
# | 377: #define __linux 1
# | 378: #define __linux__ 1
# | check:341'2 ? possible intended match
# | 379: #define __llvm__ 1
# | 380: #define __loongarch__ 1
# | 381: #define __loongarch_arch ""
# | 382: #define __loongarch_double_float 1
# | 383: #define __loongarch_frlen 0
# | 384: #define __loongarch_grlen 32
# | 385: #define __loongarch_hard_float 1
# | 386: #define __loongarch_ilp32 1
# | 387: #define __loongarch_tune ""
# | 388: #define __unix 1
# | 389: #define __unix__ 1
# | 390: #define linux 1
# | 391: #define unix 1
# | check:341'3 } search range end (exclusive)
# | >>>>>>
# `-----------------------------
# error: command failed with exit status: 1
--
```
</details>
<details>
<summary>Clang.Preprocessor/init.c</summary>
```
Exit Code: 1
Command Output (stdout):
--
# RUN: at line 1
/home/gha/actions-runner/_work/llvm-project/llvm-project/build/bin/clang -cc1 -internal-isystem /home/gha/actions-runner/_work/llvm-project/llvm-project/build/lib/clang/24/include -nostdsysteminc -E -dM < /dev/null | /home/gha/actions-runner/_work/llvm-project/llvm-project/build/bin/FileCheck -match-full-lines -check-prefix INTERFERENCE /home/gha/actions-runner/_work/llvm-project/llvm-project/clang/test/Preprocessor/init.c
# executed command: /home/gha/actions-runner/_work/llvm-project/llvm-project/build/bin/clang -cc1 -internal-isystem /home/gha/actions-runner/_work/llvm-project/llvm-project/build/lib/clang/24/include -nostdsysteminc -E -dM
# note: command had no output on stdout or stderr
# executed command: /home/gha/actions-runner/_work/llvm-project/llvm-project/build/bin/FileCheck -match-full-lines -check-prefix INTERFERENCE /home/gha/actions-runner/_work/llvm-project/llvm-project/clang/test/Preprocessor/init.c
# note: command had no output on stdout or stderr
# RUN: at line 8
/home/gha/actions-runner/_work/llvm-project/llvm-project/build/bin/clang -cc1 -internal-isystem /home/gha/actions-runner/_work/llvm-project/llvm-project/build/lib/clang/24/include -nostdsysteminc -E -dM -x assembler-with-cpp < /dev/null | /home/gha/actions-runner/_work/llvm-project/llvm-project/build/bin/FileCheck -match-full-lines -check-prefix ASM /home/gha/actions-runner/_work/llvm-project/llvm-project/clang/test/Preprocessor/init.c
# executed command: /home/gha/actions-runner/_work/llvm-project/llvm-project/build/bin/clang -cc1 -internal-isystem /home/gha/actions-runner/_work/llvm-project/llvm-project/build/lib/clang/24/include -nostdsysteminc -E -dM -x assembler-with-cpp
# note: command had no output on stdout or stderr
# executed command: /home/gha/actions-runner/_work/llvm-project/llvm-project/build/bin/FileCheck -match-full-lines -check-prefix ASM /home/gha/actions-runner/_work/llvm-project/llvm-project/clang/test/Preprocessor/init.c
# note: command had no output on stdout or stderr
# RUN: at line 13
/home/gha/actions-runner/_work/llvm-project/llvm-project/build/bin/clang -cc1 -internal-isystem /home/gha/actions-runner/_work/llvm-project/llvm-project/build/lib/clang/24/include -nostdsysteminc -fblocks -E -dM < /dev/null | /home/gha/actions-runner/_work/llvm-project/llvm-project/build/bin/FileCheck -match-full-lines -check-prefix BLOCKS /home/gha/actions-runner/_work/llvm-project/llvm-project/clang/test/Preprocessor/init.c
# executed command: /home/gha/actions-runner/_work/llvm-project/llvm-project/build/bin/clang -cc1 -internal-isystem /home/gha/actions-runner/_work/llvm-project/llvm-project/build/lib/clang/24/include -nostdsysteminc -fblocks -E -dM
# note: command had no output on stdout or stderr
# executed command: /home/gha/actions-runner/_work/llvm-project/llvm-project/build/bin/FileCheck -match-full-lines -check-prefix BLOCKS /home/gha/actions-runner/_work/llvm-project/llvm-project/clang/test/Preprocessor/init.c
# note: command had no output on stdout or stderr
# RUN: at line 18
/home/gha/actions-runner/_work/llvm-project/llvm-project/build/bin/clang -cc1 -internal-isystem /home/gha/actions-runner/_work/llvm-project/llvm-project/build/lib/clang/24/include -nostdsysteminc -x c++ -fgnuc-version=4.2.1 -std=c++2d -E -dM < /dev/null | /home/gha/actions-runner/_work/llvm-project/llvm-project/build/bin/FileCheck -match-full-lines -check-prefix CXX29 /home/gha/actions-runner/_work/llvm-project/llvm-project/clang/test/Preprocessor/init.c
# executed command: /home/gha/actions-runner/_work/llvm-project/llvm-project/build/bin/clang -cc1 -internal-isystem /home/gha/actions-runner/_work/llvm-project/llvm-project/build/lib/clang/24/include -nostdsysteminc -x c++ -fgnuc-version=4.2.1 -std=c++2d -E -dM
# note: command had no output on stdout or stderr
# executed command: /home/gha/actions-runner/_work/llvm-project/llvm-project/build/bin/FileCheck -match-full-lines -check-prefix CXX29 /home/gha/actions-runner/_work/llvm-project/llvm-project/clang/test/Preprocessor/init.c
# note: command had no output on stdout or stderr
# RUN: at line 27
/home/gha/actions-runner/_work/llvm-project/llvm-project/build/bin/clang -cc1 -internal-isystem /home/gha/actions-runner/_work/llvm-project/llvm-project/build/lib/clang/24/include -nostdsysteminc -x c++ -fgnuc-version=4.2.1 -std=c++26 -E -dM < /dev/null | /home/gha/actions-runner/_work/llvm-project/llvm-project/build/bin/FileCheck -match-full-lines -check-prefix CXX26 /home/gha/actions-runner/_work/llvm-project/llvm-project/clang/test/Preprocessor/init.c
# executed command: /home/gha/actions-runner/_work/llvm-project/llvm-project/build/bin/clang -cc1 -internal-isystem /home/gha/actions-runner/_work/llvm-project/llvm-project/build/lib/clang/24/include -nostdsysteminc -x c++ -fgnuc-version=4.2.1 -std=c++26 -E -dM
# note: command had no output on stdout or stderr
# executed command: /home/gha/actions-runner/_work/llvm-project/llvm-project/build/bin/FileCheck -match-full-lines -check-prefix CXX26 /home/gha/actions-runner/_work/llvm-project/llvm-project/clang/test/Preprocessor/init.c
# note: command had no output on stdout or stderr
# RUN: at line 28
/home/gha/actions-runner/_work/llvm-project/llvm-project/build/bin/clang -cc1 -internal-isystem /home/gha/actions-runner/_work/llvm-project/llvm-project/build/lib/clang/24/include -nostdsysteminc -x c++ -fgnuc-version=4.2.1 -std=c++2c -E -dM < /dev/null | /home/gha/actions-runner/_work/llvm-project/llvm-project/build/bin/FileCheck -match-full-lines -check-prefix CXX26 /home/gha/actions-runner/_work/llvm-project/llvm-project/clang/test/Preprocessor/init.c
# executed command: /home/gha/actions-runner/_work/llvm-project/llvm-project/build/bin/clang -cc1 -internal-isystem /home/gha/actions-runner/_work/llvm-project/llvm-project/build/lib/clang/24/include -nostdsysteminc -x c++ -fgnuc-version=4.2.1 -std=c++2c -E -dM
# note: command had no output on stdout or stderr
# executed command: /home/gha/actions-runner/_work/llvm-project/llvm-project/build/bin/FileCheck -match-full-lines -check-prefix CXX26 /home/gha/actions-runner/_work/llvm-project/llvm-project/clang/test/Preprocessor/init.c
# note: command had no output on stdout or stderr
# RUN: at line 37
/home/gha/actions-runner/_work/llvm-project/llvm-project/build/bin/clang -cc1 -internal-isystem /home/gha/actions-runner/_work/llvm-project/llvm-project/build/lib/clang/24/include -nostdsysteminc -x c++ -fgnuc-version=4.2.1 -std=c++23 -E -dM < /dev/null | /home/gha/actions-runner/_work/llvm-project/llvm-project/build/bin/FileCheck -match-full-lines -check-prefix CXX2B /home/gha/actions-runner/_work/llvm-project/llvm-project/clang/test/Preprocessor/init.c
# executed command: /home/gha/actions-runner/_work/llvm-project/llvm-project/build/bin/clang -cc1 -internal-isystem /home/gha/actions-runner/_work/llvm-project/llvm-project/build/lib/clang/24/include -nostdsysteminc -x c++ -fgnuc-version=4.2.1 -std=c++23 -E -dM
# note: command had no output on stdout or stderr
# executed command: /home/gha/actions-runner/_work/llvm-project/llvm-project/build/bin/FileCheck -match-full-lines -check-prefix CXX2B /home/gha/actions-runner/_work/llvm-project/llvm-project/clang/test/Preprocessor/init.c
# note: command had no output on stdout or stderr
# RUN: at line 38
/home/gha/actions-runner/_work/llvm-project/llvm-project/build/bin/clang -cc1 -internal-isystem /home/gha/actions-runner/_work/llvm-project/llvm-project/build/lib/clang/24/include -nostdsysteminc -x c++ -fgnuc-version=4.2.1 -std=c++2b -E -dM < /dev/null | /home/gha/actions-runner/_work/llvm-project/llvm-project/build/bin/FileCheck -match-full-lines -check-prefix CXX2B /home/gha/actions-runner/_work/llvm-project/llvm-project/clang/test/Preprocessor/init.c
# executed command: /home/gha/actions-runner/_work/llvm-project/llvm-project/build/bin/clang -cc1 -internal-isystem /home/gha/actions-runner/_work/llvm-project/llvm-project/build/lib/clang/24/include -nostdsysteminc -x c++ -fgnuc-version=4.2.1 -std=c++2b -E -dM
# note: command had no output on stdout or stderr
# executed command: /home/gha/actions-runner/_work/llvm-project/llvm-project/build/bin/FileCheck -match-full-lines -check-prefix CXX2B /home/gha/actions-runner/_work/llvm-project/llvm-project/clang/test/Preprocessor/init.c
# note: command had no output on stdout or stderr
# RUN: at line 47
/home/gha/actions-runner/_work/llvm-project/llvm-project/build/bin/clang -cc1 -internal-isystem /home/gha/actions-runner/_work/llvm-project/llvm-project/build/lib/clang/24/include -nostdsysteminc -x c++ -fgnuc-version=4.2.1 -std=c++20 -E -dM < /dev/null | /home/gha/actions-runner/_work/llvm-project/llvm-project/build/bin/FileCheck -match-full-lines -check-prefix CXX2A /home/gha/actions-runner/_work/llvm-project/llvm-project/clang/test/Preprocessor/init.c
# executed command: /home/gha/actions-runner/_work/llvm-project/llvm-project/build/bin/clang -cc1 -internal-isystem /home/gha/actions-runner/_work/llvm-project/llvm-project/build/lib/clang/24/include -nostdsysteminc -x c++ -fgnuc-version=4.2.1 -std=c++20 -E -dM
# note: command had no output on stdout or stderr
# executed command: /home/gha/actions-runner/_work/llvm-project/llvm-project/build/bin/FileCheck -match-full-lines -check-prefix CXX2A /home/gha/actions-runner/_work/llvm-project/llvm-project/clang/test/Preprocessor/init.c
# note: command had no output on stdout or stderr
# RUN: at line 48
/home/gha/actions-runner/_work/llvm-project/llvm-project/build/bin/clang -cc1 -internal-isystem /home/gha/actions-runner/_work/llvm-project/llvm-project/build/lib/clang/24/include -nostdsysteminc -x c++ -fgnuc-version=4.2.1 -std=c++2a -E -dM < /dev/null | /home/gha/actions-runner/_work/llvm-project/llvm-project/build/bin/FileCheck -match-full-lines -check-prefix CXX2A /home/gha/actions-runner/_work/llvm-project/llvm-project/clang/test/Preprocessor/init.c
# executed command: /home/gha/actions-runner/_work/llvm-project/llvm-project/build/bin/clang -cc1 -internal-isystem /home/gha/actions-runner/_work/llvm-project/llvm-project/build/lib/clang/24/include -nostdsysteminc -x c++ -fgnuc-version=4.2.1 -std=c++2a -E -dM
# note: command had no output on stdout or stderr
# executed command: /home/gha/actions-runner/_work/llvm-project/llvm-project/build/bin/FileCheck -match-full-lines -check-prefix CXX2A /home/gha/actions-runner/_work/llvm-project/llvm-project/clang/test/Preprocessor/init.c
# note: command had no output on stdout or stderr
# RUN: at line 57
/home/gha/actions-runner/_work/llvm-project/llvm-project/build/bin/clang -cc1 -internal-isystem /home/gha/actions-runner/_work/llvm-project/llvm-project/build/lib/clang/24/include -nostdsysteminc -x c++ -fgnuc-version=4.2.1 -std=c++17 -E -dM < /dev/null | /home/gha/actions-runner/_work/llvm-project/llvm-project/build/bin/FileCheck -match-full-lines -check-prefix CXX1Z /home/gha/actions-runner/_work/llvm-project/llvm-project/clang/test/Preprocessor/init.c
# executed command: /home/gha/actions-runner/_work/llvm-project/llvm-project/build/bin/clang -cc1 -internal-isystem /home/gha/actions-runner/_work/llvm-project/llvm-project/build/lib/clang/24/include -nostdsysteminc -x c++ -fgnuc-version=4.2.1 -std=c++17 -E -dM
# note: command had no output on stdout or stderr
# executed command: /home/gha/actions-runner/_work/llvm-project/llvm-project/build/bin/FileCheck -match-full-lines -check-prefix CXX1Z /home/gha/actions-runner/_work/llvm-project/llvm-project/clang/test/Preprocessor/init.c
# note: command had no output on stdout or stderr
# RUN: at line 58
/home/gha/actions-runner/_work/llvm-project/llvm-project/build/bin/clang -cc1 -internal-isystem /home/gha/actions-runner/_work/llvm-project/llvm-project/build/lib/clang/24/include -nostdsysteminc -x c++ -fgnuc-version=4.2.1 -std=c++1z -E -dM < /dev/null | /home/gha/actions-runner/_work/llvm-project/llvm-project/build/bin/FileCheck -match-full-lines -check-prefix CXX1Z /home/gha/actions-runner/_work/llvm-project/llvm-project/clang/test/Preprocessor/init.c
# executed command: /home/gha/actions-runner/_work/llvm-project/llvm-project/build/bin/clang -cc1 -internal-isystem /home/gha/actions-runner/_work/llvm-project/llvm-project/build/lib/clang/24/include -nostdsysteminc -x c++ -fgnuc-version=4.2.1 -std=c++1z -E -dM
# note: command had no output on stdout or stderr
# executed command: /home/gha/actions-runner/_work/llvm-project/llvm-project/build/bin/FileCheck -match-full-lines -check-prefix CXX1Z /home/gha/actions-runner/_work/llvm-project/llvm-project/clang/test/Preprocessor/init.c
# note: command had no output on stdout or stderr
# RUN: at line 68
/home/gha/actions-runner/_work/llvm-project/llvm-project/build/bin/clang -cc1 -internal-isystem /home/gha/actions-runner/_work/llvm-project/llvm-project/build/lib/clang/24/include -nostdsysteminc -x c++ -fgnuc-version=4.2.1 -std=c++14 -E -dM < /dev/null | /home/gha/actions-runner/_work/llvm-project/llvm-project/build/bin/FileCheck -match-full-lines -check-prefix CXX1Y /home/gha/actions-runner/_work/llvm-project/llvm-project/clang/test/Preprocessor/init.c
# executed command: /home/gha/actions-runner/_work/llvm-project/llvm-project/build/bin/clang -cc1 -internal-isystem /home/gha/actions-runner/_work/llvm-project/llvm-project/build/lib/clang/24/include -nostdsysteminc -x c++ -fgnuc-version=4.2.1 -std=c++14 -E -dM
# note: command had no output on stdout or stderr
# executed command: /home/gha/actions-runner/_work/llvm-project/llvm-project/build/bin/FileCheck -match-full-lines -check-prefix CXX1Y /home/gha/actions-runner/_work/llvm-project/llvm-project/clang/test/Preprocessor/init.c
# note: command had no output on stdout or stderr
# RUN: at line 69
/home/gha/actions-runner/_work/llvm-project/llvm-project/build/bin/clang -cc1 -internal-isystem /home/gha/actions-runner/_work/llvm-project/llvm-project/build/lib/clang/24/include -nostdsysteminc -x c++ -fgnuc-version=4.2.1 -std=c++1y -E -dM < /dev/null | /home/gha/actions-runner/_work/llvm-project/llvm-project/build/bin/FileCheck -match-full-lines -check-prefix CXX1Y /home/gha/actions-runner/_work/llvm-project/llvm-project/clang/test/Preprocessor/init.c
# executed command: /home/gha/actions-runner/_work/llvm-project/llvm-project/build/bin/clang -cc1 -internal-isystem /home/gha/actions-runner/_work/llvm-project/llvm-project/build/lib/clang/24/include -nostdsysteminc -x c++ -fgnuc-version=4.2.1 -std=c++1y -E -dM
# note: command had no output on stdout or stderr
# executed command: /home/gha/actions-runner/_work/llvm-project/llvm-project/build/bin/FileCheck -match-full-lines -check-prefix CXX1Y /home/gha/actions-runner/_work/llvm-project/llvm-project/clang/test/Preprocessor/init.c
# note: command had no output on stdout or stderr
# RUN: at line 79
/home/gha/actions-runner/_work/llvm-project/llvm-project/build/bin/clang -cc1 -internal-isystem /home/gha/actions-runner/_work/llvm-project/llvm-project/build/lib/clang/24/include -nostdsysteminc -x c++ -fgnuc-version=4.2.1 -std=c++11 -E -dM < /dev/null | /home/gha/actions-runner/_work/llvm-project/llvm-project/build/bin/FileCheck -match-full-lines -check-prefix CXX11 /home/gha/actions-runner/_work/llvm-project/llvm-project/clang/test/Preprocessor/init.c
# executed command: /home/gha/actions-runner/_work/llvm-project/llvm-project/build/bin/clang -cc1 -internal-isystem /home/gha/actions-runner/_work/llvm-project/llvm-project/build/lib/clang/24/include -nostdsysteminc -x c++ -fgnuc-version=4.2.1 -std=c++11 -E -dM
# note: command had no output on stdout or stderr
# executed command: /home/gha/actions-runner/_work/llvm-project/llvm-project/build/bin/FileCheck -match-full-lines -check-prefix CXX11 /home/gha/actions-runner/_work/llvm-project/llvm-project/clang/test/Preprocessor/init.c
# note: command had no output on stdout or stderr
# RUN: at line 89
/home/gha/actions-runner/_work/llvm-project/llvm-project/build/bin/clang -cc1 -internal-isystem /home/gha/actions-runner/_work/llvm-project/llvm-project/build/lib/clang/24/include -nostdsysteminc -x c++ -fgnuc-version=4.2.1 -std=c++98 -E -dM < /dev/null | /home/gha/actions-runner/_work/llvm-project/llvm-project/build/bin/FileCheck -match-full-lines -check-prefix CXX98 /home/gha/actions-runner/_work/llvm-project/llvm-project/clang/test/Preprocessor/init.c
# executed command: /home/gha/actions-runner/_work/llvm-project/llvm-project/build/bin/clang -cc1 -internal-isystem /home/gha/actions-runner/_work/llvm-project/llvm-project/build/lib/clang/24/include -nostdsysteminc -x c++ -fgnuc-version=4.2.1 -std=c++98 -E -dM
# note: command had no output on stdout or stderr
# executed command: /home/gha/actions-runner/_work/llvm-project/llvm-project/build/bin/FileCheck -match-full-lines -check-prefix CXX98 /home/gha/actions-runner/_work/llvm-project/llvm-project/clang/test/Preprocessor/init.c
# note: command had no output on stdout or stderr
# RUN: at line 98
/home/gha/actions-runner/_work/llvm-project/llvm-project/build/bin/clang -cc1 -internal-isystem /home/gha/actions-runner/_work/llvm-project/llvm-project/build/lib/clang/24/include -nostdsysteminc -fdeprecated-macro -E -dM < /dev/null | /home/gha/actions-runner/_work/llvm-project/llvm-project/build/bin/FileCheck -match-full-lines -check-prefix DEPRECATED /home/gha/actions-runner/_work/llvm-project/llvm-project/clang/test/Preprocessor/init.c
# executed command: /home/gha/actions-runner/_work/llvm-project/llvm-project/build/bin/clang -cc1 -internal-isystem /home/gha/actions-runner/_work/llvm-project/llvm-project/build/lib/clang/24/include -nostdsysteminc -fdeprecated-macro -E -dM
# note: command had no output on stdout or stderr
# executed command: /home/gha/actions-runner/_work/llvm-project/llvm-project/build/bin/FileCheck -match-full-lines -check-prefix DEPRECATED /home/gha/actions-runner/_work/llvm-project/llvm-project/clang/test/Preprocessor/init.c
# note: command had no output on stdout or stderr
# RUN: at line 103
/home/gha/actions-runner/_work/llvm-project/llvm-project/build/bin/clang -cc1 -internal-isystem /home/gha/actions-runner/_work/llvm-project/llvm-project/build/lib/clang/24/include -nostdsysteminc -std=c99 -E -dM < /dev/null | /home/gha/actions-runner/_work/llvm-project/llvm-project/build/bin/FileCheck -match-full-lines -check-prefix C99 /home/gha/actions-runner/_work/llvm-project/llvm-project/clang/test/Preprocessor/init.c
# executed command: /home/gha/actions-runner/_work/llvm-project/llvm-project/build/bin/clang -cc1 -internal-isystem /home/gha/actions-runner/_work/llvm-project/llvm-project/build/lib/clang/24/include -nostdsysteminc -std=c99 -E -dM
# note: command had no output on stdout or stderr
# executed command: /home/gha/actions-runner/_work/llvm-project/llvm-project/build/bin/FileCheck -match-full-lines -check-prefix C99 /home/gha/actions-runner/_work/llvm-project/llvm-project/clang/test/Preprocessor/init.c
# note: command had no output on stdout or stderr
# RUN: at line 112
/home/gha/actions-runner/_work/llvm-project/llvm-project/build/bin/clang -cc1 -internal-isystem /home/gha/actions-runner/_work/llvm-project/llvm-project/build/lib/clang/24/include -nostdsysteminc -std=c17 -triple=x86_64-pc-win32 -E -dM < /dev/null | /home/gha/actions-runner/_work/llvm-project/llvm-project/build/bin/FileCheck -match-full-lines -check-prefix C17-FMT /home/gha/actions-runner/_work/llvm-project/llvm-project/clang/test/Preprocessor/init.c
# executed command: /home/gha/actions-runner/_work/llvm-project/llvm-project/build/bin/clang -cc1 -internal-isystem /home/gha/actions-runner/_work/llvm-project/llvm-project/build/lib/clang/24/include -nostdsysteminc -std=c17 -triple=x86_64-pc-win32 -E -dM
# note: command had no output on stdout or stderr
# executed command: /home/gha/actions-runner/_work/llvm-project/llvm-project/build/bin/FileCheck -match-full-lines -check-prefix C17-FMT /home/gha/actions-runner/_work/llvm-project/llvm-project/clang/test/Preprocessor/init.c
# note: command had no output on stdout or stderr
# RUN: at line 113
/home/gha/actions-runner/_work/llvm-project/llvm-project/build/bin/clang -cc1 -internal-isystem /home/gha/actions-runner/_work/llvm-project/llvm-project/build/lib/clang/24/include -nostdsysteminc -std=c23 -triple=x86_64-pc-win32 -E -dM < /dev/null | /home/gha/actions-runner/_work/llvm-project/llvm-project/build/bin/FileCheck -match-full-lines -check-prefix C23-FMT /home/gha/actions-runner/_work/llvm-project/llvm-project/clang/test/Preprocessor/init.c
# executed command: /home/gha/actions-runner/_work/llvm-project/llvm-project/build/bin/clang -cc1 -internal-isystem /home/gha/actions-runner/_work/llvm-project/llvm-project/build/lib/clang/24/include -nostdsysteminc -std=c23 -triple=x86_64-pc-win32 -E -dM
# note: command had no output on stdout or stderr
# executed command: /home/gha/actions-runner/_work/llvm-project/llvm-project/build/bin/FileCheck -match-full-lines -check-prefix C23-FMT /home/gha/actions-runner/_work/llvm-project/llvm-project/clang/test/Preprocessor/init.c
# note: command had no output on stdout or stderr
# RUN: at line 177
/home/gha/actions-runner/_work/llvm-project/llvm-project/build/bin/clang -cc1 -internal-isystem /home/gha/actions-runner/_work/llvm-project/llvm-project/build/lib/clang/24/include -nostdsysteminc -std=c11 -E -dM < /dev/null | /home/gha/actions-runner/_work/llvm-project/llvm-project/build/bin/FileCheck -match-full-lines -check-prefix C11 /home/gha/actions-runner/_work/llvm-project/llvm-project/clang/test/Preprocessor/init.c
# executed command: /home/gha/actions-runner/_work/llvm-project/llvm-project/build/bin/clang -cc1 -internal-isystem /home/gha/actions-runner/_work/llvm-project/llvm-project/build/lib/clang/24/include -nostdsysteminc -std=c11 -E -dM
# note: command had no output on stdout or stderr
# executed command: /home/gha/actions-runner/_work/llvm-project/llvm-project/build/bin/FileCheck -match-full-lines -check-prefix C11 /home/gha/actions-runner/_work/llvm-project/llvm-project/clang/test/Preprocessor/init.c
# note: command had no output on stdout or stderr
# RUN: at line 178
/home/gha/actions-runner/_work/llvm-project/llvm-project/build/bin/clang -cc1 -internal-isystem /home/gha/actions-runner/_work/llvm-project/llvm-project/build/lib/clang/24/include -nostdsysteminc -std=c1x -E -dM < /dev/null | /home/gha/actions-runner/_work/llvm-project/llvm-project/build/bin/FileCheck -match-full-lines -check-prefix C11 /home/gha/actions-runner/_work/llvm-project/llvm-project/clang/test/Preprocessor/init.c
# executed command: /home/gha/actions-runner/_work/llvm-project/llvm-project/build/bin/clang -cc1 -internal-isystem /home/gha/actions-runner/_work/llvm-project/llvm-project/build/lib/clang/24/include -nostdsysteminc -std=c1x -E -dM
# note: command had no output on stdout or stderr
# executed command: /home/gha/actions-runner/_work/llvm-project/llvm-project/build/bin/FileCheck -match-full-lines -check-prefix C11 /home/gha/actions-runner/_work/llvm-project/llvm-project/clang/test/Preprocessor/init.c
# note: command had no output on stdout or stderr
# RUN: at line 179
/home/gha/actions-runner/_work/llvm-project/llvm-project/build/bin/clang -cc1 -internal-isystem /home/gha/actions-runner/_work/llvm-project/llvm-project/build/lib/clang/24/include -nostdsysteminc -std=iso9899:2011 -E -dM < /dev/null | /home/gha/actions-runner/_work/llvm-project/llvm-project/build/bin/FileCheck -match-full-lines -check-prefix C11 /home/gha/actions-runner/_work/llvm-project/llvm-project/clang/test/Preprocessor/init.c
# executed command: /home/gha/actions-runner/_work/llvm-project/llvm-project/build/bin/clang -cc1 -internal-isystem /home/gha/actions-runner/_work/llvm-project/llvm-project/build/lib/clang/24/include -nostdsysteminc -std=iso9899:2011 -E -dM
# note: command had no output on stdout or stderr
# executed command: /home/gha/actions-runner/_work/llvm-project/llvm-project/build/bin/FileCheck -match-full-lines -check-prefix C11 /home/gha/actions-runner/_work/llvm-project/llvm-project/clang/test/Preprocessor/init.c
# note: command had no output on stdout or stderr
# RUN: at line 180
/home/gha/actions-runner/_work/llvm-project/llvm-project/build/bin/clang -cc1 -internal-isystem /home/gha/actions-runner/_work/llvm-project/llvm-project/build/lib/clang/24/include -nostdsysteminc -std=iso9899:201x -E -dM < /dev/null | /home/gha/actions-runner/_work/llvm-project/llvm-project/build/bin/FileCheck -match-full-lines -check-prefix C11 /home/gha/actions-runner/_work/llvm-project/llvm-project/clang/test/Preprocessor/init.c
# executed command: /home/gha/actions-runner/_work/llvm-project/llvm-project/build/bin/clang -cc1 -internal-isystem /home/gha/actions-runner/_work/llvm-project/llvm-project/build/lib/clang/24/include -nostdsysteminc -std=iso9899:201x -E -dM
# note: command had no output on stdout or stderr
# executed command: /home/gha/actions-runner/_work/llvm-project/llvm-project/build/bin/FileCheck -match-full-lines -check-prefix C11 /home/gha/actions-runner/_work/llvm-project/llvm-project/clang/test/Preprocessor/init.c
# note: command had no output on stdout or stderr
# RUN: at line 192
/home/gha/actions-runner/_work/llvm-project/llvm-project/build/bin/clang -cc1 -internal-isystem /home/gha/actions-runner/_work/llvm-project/llvm-project/build/lib/clang/24/include -nostdsysteminc -fgnuc-version=4.2.1 -E -dM < /dev/null | /home/gha/actions-runner/_work/llvm-project/llvm-project/build/bin/FileCheck -match-full-lines -check-prefix COMMON /home/gha/actions-runner/_work/llvm-project/llvm-project/clang/test/Preprocessor/init.c
# executed command: /home/gha/actions-runner/_work/llvm-project/llvm-project/build/bin/clang -cc1 -internal-isystem /home/gha/actions-runner/_work/llvm-project/llvm-project/build/lib/clang/24/include -nostdsysteminc -fgnuc-version=4.2.1 -E -dM
# note: command had no output on stdout or stderr
# executed command: /home/gha/actions-runner/_work/llvm-project/llvm-project/build/bin/FileCheck -match-full-lines -check-prefix COMMON /home/gha/actions-runner/_work/llvm-project/llvm-project/clang/test/Preprocessor/init.c
# note: command had no output on stdout or stderr
# RUN: at line 216
/home/gha/actions-runner/_work/llvm-project/llvm-project/build/bin/clang -cc1 -internal-isystem /home/gha/actions-runner/_work/llvm-project/llvm-project/build/lib/clang/24/include -nostdsysteminc -E -dM -triple=x86_64-pc-win32 < /dev/null | /home/gha/actions-runner/_work/llvm-project/llvm-project/build/bin/FileCheck -match-full-lines -check-prefix C-DEFAULT /home/gha/actions-runner/_work/llvm-project/llvm-project/clang/test/Preprocessor/init.c
# executed command: /home/gha/actions-runner/_work/llvm-project/llvm-project/build/bin/clang -cc1 -internal-isystem /home/gha/actions-runner/_work/llvm-project/llvm-project/build/lib/clang/24/include -nostdsysteminc -E -dM -triple=x86_64-pc-win32
# note: command had no output on stdout or stderr
# executed command: /home/gha/actions-runner/_work/llvm-project/llvm-project/build/bin/FileCheck -match-full-lines -check-prefix C-DEFAULT /home/gha/actions-runner/_work/llvm-project/llvm-project/clang/test/Preprocessor/init.c
# note: command had no output on stdout or stderr
# RUN: at line 217
/home/gha/actions-runner/_work/llvm-project/llvm-project/build/bin/clang -cc1 -internal-isystem /home/gha/actions-runner/_work/llvm-project/llvm-project/build/lib/clang/24/include -nostdsysteminc -E -dM -triple=x86_64-pc-linux-gnu < /dev/null | /home/gha/actions-runner/_work/llvm-project/llvm-project/build/bin/FileCheck -match-full-lines -check-prefix C-DEFAULT /home/gha/actions-runner/_work/llvm-project/llvm-project/clang/test/Preprocessor/init.c
# executed command: /home/gha/actions-runner/_work/llvm-project/llvm-project/build/bin/clang -cc1 -internal-isystem /home/gha/actions-runner/_work/llvm-project/llvm-project/build/lib/clang/24/include -nostdsysteminc -E -dM -triple=x86_64-pc-linux-gnu
# note: command had no output on stdout or stderr
# executed command: /home/gha/actions-runner/_work/llvm-project/llvm-project/build/bin/FileCheck -match-full-lines -check-prefix C-DEFAULT /home/gha/actions-runner/_work/llvm-project/llvm-project/clang/test/Preprocessor/init.c
# note: command had no output on stdout or stderr
# RUN: at line 218
/home/gha/actions-runner/_work/llvm-project/llvm-project/build/bin/clang -cc1 -internal-isystem /home/gha/actions-runner/_work/llvm-project/llvm-project/build/lib/clang/24/include -nostdsysteminc -E -dM -triple=x86_64-apple-darwin < /dev/null | /home/gha/actions-runner/_work/llvm-project/llvm-project/build/bin/FileCheck -match-full-lines -check-prefix C-DEFAULT /home/gha/actions-runner/_work/llvm-project/llvm-project/clang/test/Preprocessor/init.c
# executed command: /home/gha/actions-runner/_work/llvm-project/llvm-project/build/bin/clang -cc1 -internal-isystem /home/gha/actions-runner/_work/llvm-project/llvm-project/build/lib/clang/24/include -nostdsysteminc -E -dM -triple=x86_64-apple-darwin
# note: command had no output on stdout or stderr
# executed command: /home/gha/actions-runner/_work/llvm-project/llvm-project/build/bin/FileCheck -match-full-lines -check-prefix C-DEFAULT /home/gha/actions-runner/_work/llvm-project/llvm-project/clang/test/Preprocessor/init.c
# note: command had no output on stdout or stderr
# RUN: at line 219
/home/gha/actions-runner/_work/llvm-project/llvm-project/build/bin/clang -cc1 -internal-isystem /home/gha/actions-runner/_work/llvm-project/llvm-project/build/lib/clang/24/include -nostdsysteminc -E -dM -triple=armv7a-apple-darwin < /dev/null | /home/gha/actions-runner/_work/llvm-project/llvm-project/build/bin/FileCheck -match-full-lines -check-prefix C-DEFAULT /home/gha/actions-runner/_work/llvm-project/llvm-project/clang/test/Preprocessor/init.c
# executed command: /home/gha/actions-runner/_work/llvm-project/llvm-project/build/bin/clang -cc1 -internal-isystem /home/gha/actions-runner/_work/llvm-project/llvm-project/build/lib/clang/24/include -nostdsysteminc -E -dM -triple=armv7a-apple-darwin
# note: command had no output on stdout or stderr
# executed command: /home/gha/actions-runner/_work/llvm-project/llvm-project/build/bin/FileCheck -match-full-lines -check-prefix C-DEFAULT /home/gha/actions-runner/_work/llvm-project/llvm-project/clang/test/Preprocessor/init.c
# note: command had no output on stdout or stderr
# RUN: at line 223
/home/gha/actions-runner/_work/llvm-project/llvm-project/build/bin/clang -cc1 -internal-isystem /home/gha/actions-runner/_work/llvm-project/llvm-project/build/lib/clang/24/include -nostdsysteminc -ffreestanding -E -dM < /dev/null | /home/gha/actions-runner/_work/llvm-project/llvm-project/build/bin/FileCheck -match-full-lines -check-prefix FREESTANDING /home/gha/actions-runner/_work/llvm-project/llvm-project/clang/test/Preprocessor/init.c
# executed command: /home/gha/actions-runner/_work/llvm-project/llvm-project/build/bin/clang -cc1 -internal-isystem /home/gha/actions-runner/_work/llvm-project/llvm-project/build/lib/clang/24/include -nostdsysteminc -ffreestanding -E -dM
# note: command had no output on stdout or stderr
# executed command: /home/gha/actions-runner/_work/llvm-project/llvm-project/build/bin/FileCheck -match-full-lines -check-prefix FREESTANDING /home/gha/actions-runner/_work/llvm-project/llvm-project/clang/test/Preprocessor/init.c
# note: command had no output on stdout or stderr
# RUN: at line 226
/home/gha/actions-runner/_work/llvm-project/llvm-project/build/bin/clang -cc1 -internal-isystem /home/gha/actions-runner/_work/llvm-project/llvm-project/build/lib/clang/24/include -nostdsysteminc -x c++ -fgnuc-version=4.2.1 -std=gnu++2d -E -dM < /dev/null | /home/gha/actions-runner/_work/llvm-project/llvm-project/build/bin/FileCheck -match-full-lines -check-prefix GXX29 /home/gha/actions-runner/_work/llvm-project/llvm-project/clang/test/Preprocessor/init.c
# executed command: /home/gha/actions-runner/_work/llvm-project/llvm-project/build/bin/clang -cc1 -internal-isystem /home/gha/actions-runner/_work/llvm-project/llvm-project/build/lib/clang/24/include -nostdsysteminc -x c++ -fgnuc-version=4.2.1 -std=gnu++2d -E -dM
# note: command had no output on stdout or stderr
# executed command: /home/gha/actions-runner/_work/llvm-project/llvm-project/build/bin/FileCheck -match-full-lines -check-prefix GXX29 /home/gha/actions-runner/_work/llvm-project/llvm-project/clang/test/Preprocessor/init.c
# note: command had no output on stdout or stderr
# RUN: at line 233
/home/gha/actions-runner/_work/llvm-project/llvm-project/build/bin/clang -cc1 -internal-isystem /home/gha/actions-runner/_work/llvm-project/llvm-project/build/lib/clang/24/include -nostdsysteminc -x c++ -fgnuc-version=4.2.1 -std=gnu++26 -E -dM < /dev/null | /home/gha/actions-runner/_work/llvm-project/llvm-project/build/bin/FileCheck -match-full-lines -check-prefix GXX26 /home/gha/actions-runner/_work/llvm-project/llvm-project/clang/test/Preprocessor/init.c
# executed command: /home/gha/actions-runner/_work/llvm-project/llvm-project/build/bin/clang -cc1 -internal-isystem /home/gha/actions-runner/_work/llvm-project/llvm-project/build/lib/clang/24/include -nostdsysteminc -x c++ -fgnuc-version=4.2.1 -std=gnu++26 -E -dM
# note: command had no output on stdout or stderr
# executed command: /home/gha/actions-runner/_work/llvm-project/llvm-project/build/bin/FileCheck -match-full-lines -check-prefix GXX26 /home/gha/actions-runner/_work/llvm-project/llvm-project/clang/test/Preprocessor/init.c
# note: command had no output on stdout or stderr
# RUN: at line 234
/home/gha/actions-runner/_work/llvm-project/llvm-project/build/bin/clang -cc1 -internal-isystem /home/gha/actions-runner/_work/llvm-project/llvm-project/build/lib/clang/24/include -nostdsysteminc -x c++ -fgnuc-version=4.2.1 -std=gnu++2c -E -dM < /dev/null | /home/gha/actions-runner/_work/llvm-project/llvm-project/build/bin/FileCheck -match-full-lines -check-prefix GXX26 /home/gha/actions-runner/_work/llvm-project/llvm-project/clang/test/Preprocessor/init.c
# executed command: /home/gha/actions-runner/_work/llvm-project/llvm-project/build/bin/clang -cc1 -internal-isystem /home/gha/actions-runner/_work/llvm-project/llvm-project/build/lib/clang/24/include -nostdsysteminc -x c++ -fgnuc-version=4.2.1 -std=gnu++2c -E -dM
# note: command had no output on stdout or stderr
# executed command: /home/gha/actions-runner/_work/llvm-project/llvm-project/build/bin/FileCheck -match-full-lines -check-prefix GXX26 /home/gha/actions-runner/_work/llvm-project/llvm-project/clang/test/Preprocessor/init.c
# note: command had no output on stdout or stderr
# RUN: at line 241
/home/gha/actions-runner/_work/llvm-project/llvm-project/build/bin/clang -cc1 -internal-isystem /home/gha/actions-runner/_work/llvm-project/llvm-project/build/lib/clang/24/include -nostdsysteminc -x c++ -fgnuc-version=4.2.1 -std=gnu++23 -E -dM < /dev/null | /home/gha/actions-runner/_work/llvm-project/llvm-project/build/bin/FileCheck -match-full-lines -check-prefix GXX2B /home/gha/actions-runner/_work/llvm-project/llvm-project/clang/test/Preprocessor/init.c
# executed command: /home/gha/actions-runner/_work/llvm-project/llvm-project/build/bin/clang -cc1 -internal-isystem /home/gha/actions-runner/_work/llvm-project/llvm-project/build/lib/clang/24/include -nostdsysteminc -x c++ -fgnuc-version=4.2.1 -std=gnu++23 -E -dM
# note: command had no output on stdout or stderr
# executed command: /home/gha/actions-runner/_work/llvm-project/llvm-project/build/bin/FileCheck -match-full-lines -check-prefix GXX2B /home/gha/actions-runner/_work/llvm-project/llvm-project/clang/test/Preprocessor/init.c
# note: command had no output on stdout or stderr
# RUN: at line 242
/home/gha/actions-runner/_work/llvm-project/llvm-project/build/bin/clang -cc1 -internal-isystem /home/gha/actions-runner/_work/llvm-project/llvm-project/build/lib/clang/24/include -nostdsysteminc -x c++ -fgnuc-version=4.2.1 -std=gnu++2b -E -dM < /dev/null | /home/gha/actions-runner/_work/llvm-project/llvm-project/build/bin/FileCheck -match-full-lines -check-prefix GXX2B /home/gha/actions-runner/_work/llvm-project/llvm-project/clang/test/Preprocessor/init.c
# executed command: /home/gha/actions-runner/_work/llvm-project/llvm-project/build/bin/clang -cc1 -internal-isystem /home/gha/actions-runner/_work/llvm-project/llvm-project/build/lib/clang/24/include -nostdsysteminc -x c++ -fgnuc-version=4.2.1 -std=gnu++2b -E -dM
# note: command had no output on stdout or stderr
# executed command: /home/gha/actions-runner/_work/llvm-project/llvm-project/build/bin/FileCheck -match-full-lines -check-prefix GXX2B /home/gha/actions-runner/_work/llvm-project/llvm-project/clang/test/Preprocessor/init.c
# note: command had no output on stdout or stderr
# RUN: at line 249
/home/gha/actions-runner/_work/llvm-project/llvm-project/build/bin/clang -cc1 -internal-isystem /home/gha/actions-runner/_work/llvm-project/llvm-project/build/lib/clang/24/include -nostdsysteminc -x c++ -fgnuc-version=4.2.1 -std=gnu++20 -E -dM < /dev/null | /home/gha/actions-runner/_work/llvm-project/llvm-project/build/bin/FileCheck -match-full-lines -check-prefix GXX2A /home/gha/actions-runner/_work/llvm-project/llvm-project/clang/test/Preprocessor/init.c
# executed command: /home/gha/actions-runner/_work/llvm-project/llvm-project/build/bin/clang -cc1 -internal-isystem /home/gha/actions-runner/_work/llvm-project/llvm-project/build/lib/clang/24/include -nostdsysteminc -x c++ -fgnuc-version=4.2.1 -std=gnu++20 -E -dM
# note: command had no output on stdout or stderr
# executed command: /home/gha/actions-runner/_work/llvm-project/llvm-project/build/bin/FileCheck -match-full-lines -check-prefix GXX2A /home/gha/actions-runner/_work/llvm-project/llvm-project/clang/test/Preprocessor/init.c
# note: command had no output on stdout or stderr
# RUN: at line 250
/home/gha/actions-runner/_work/llvm-project/llvm-project/build/bin/clang -cc1 -internal-isystem /home/gha/actions-runner/_work/llvm-project/llvm-project/build/lib/clang/24/include -nostdsysteminc -x c++ -fgnuc-version=4.2.1 -std=gnu++2a -E -dM < /dev/null | /home/gha/actions-runner/_work/llvm-project/llvm-project/build/bin/FileCheck -match-full-lines -check-prefix GXX2A /home/gha/actions-runner/_work/llvm-project/llvm-project/clang/test/Preprocessor/init.c
# executed command: /home/gha/actions-runner/_work/llvm-project/llvm-project/build/bin/clang -cc1 -internal-isystem /home/gha/actions-runner/_work/llvm-project/llvm-project/build/lib/clang/24/include -nostdsysteminc -x c++ -fgnuc-version=4.2.1 -std=gnu++2a -E -dM
# note: command had no output on stdout or stderr
# executed command: /home/gha/actions-runner/_work/llvm-project/llvm-project/build/bin/FileCheck -match-full-lines -check-prefix GXX2A /home/gha/actions-runner/_work/llvm-project/llvm-project/clang/test/Preprocessor/init.c
# note: command had no output on stdout or stderr
# RUN: at line 258
/home/gha/actions-runner/_work/llvm-project/llvm-project/build/bin/clang -cc1 -internal-isystem /home/gha/actions-runner/_work/llvm-project/llvm-project/build/lib/clang/24/include -nostdsysteminc -x c++ -fgnuc-version=4.2.1 -std=gnu++17 -E -dM < /dev/null | /home/gha/actions-runner/_work/llvm-project/llvm-project/build/bin/FileCheck -match-full-lines -check-prefix GXX1Z /home/gha/actions-runner/_work/llvm-project/llvm-project/clang/test/Preprocessor/init.c
# executed command: /home/gha/actions-runner/_work/llvm-project/llvm-project/build/bin/clang -cc1 -internal-isystem /home/gha/actions-runner/_work/llvm-project/llvm-project/build/lib/clang/24/include -nostdsysteminc -x c++ -fgnuc-version=4.2.1 -std=gnu++17 -E -dM
# note: command had no output on stdout or stderr
# executed command: /home/gha/actions-runner/_work/llvm-project/llvm-project/build/bin/FileCheck -match-full-lines -check-prefix GXX1Z /home/gha/actions-runner/_work/llvm-project/llvm-project/clang/test/Preprocessor/init.c
# note: command had no output on stdout or stderr
# RUN: at line 259
/home/gha/actions-runner/_work/llvm-project/llvm-project/build/bin/clang -cc1 -internal-isystem /home/gha/actions-runner/_work/llvm-project/llvm-project/build/lib/clang/24/include -nostdsysteminc -x c++ -fgnuc-version=4.2.1 -std=gnu++1z -E -dM < /dev/null | /home/gha/actions-runner/_work/llvm-project/llvm-project/build/bin/FileCheck -match-full-lines -check-prefix GXX1Z /home/gha/actions-runner/_work/llvm-project/llvm-project/clang/test/Preprocessor/init.c
# executed command: /home/gha/actions-runner/_work/llvm-project/llvm-project/build/bin/clang -cc1 -internal-isystem /home/gha/actions-runner/_work/llvm-project/llvm-project/build/lib/clang/24/include -nostdsysteminc -x c++ -fgnuc-version=4.2.1 -std=gnu++1z -E -dM
# note: command had no output on stdout or stderr
# executed command: /home/gha/actions-runner/_work/llvm-project/llvm-project/build/bin/FileCheck -match-full-lines -check-prefix GXX1Z /home/gha/actions-runner/_work/llvm-project/llvm-project/clang/test/Preprocessor/init.c
# note: command had no output on stdout or stderr
# RUN: at line 267
/home/gha/actions-runner/_work/llvm-project/llvm-project/build/bin/clang -cc1 -internal-isystem /home/gha/actions-runner/_work/llvm-project/llvm-project/build/lib/clang/24/include -nostdsysteminc -x c++ -fgnuc-version=4.2.1 -std=gnu++14 -E -dM < /dev/null | /home/gha/actions-runner/_work/llvm-project/llvm-project/build/bin/FileCheck -match-full-lines -check-prefix GXX1Y /home/gha/actions-runner/_work/llvm-project/llvm-project/clang/test/Preprocessor/init.c
# executed command: /home/gha/actions-runner/_work/llvm-project/llvm-project/build/bin/clang -cc1 -internal-isystem /home/gha/actions-runner/_work/llvm-project/llvm-project/build/lib/clang/24/include -nostdsysteminc -x c++ -fgnuc-version=4.2.1 -std=gnu++14 -E -dM
# note: command had no output on stdout or stderr
# executed command: /home/gha/actions-runner/_work/llvm-project/llvm-project/build/bin/FileCheck -match-full-lines -check-prefix GXX1Y /home/gha/actions-runner/_work/llvm-project/llvm-project/clang/test/Preprocessor/init.c
# note: command had no output on stdout or stderr
# RUN: at line 268
/home/gha/actions-runner/_work/llvm-project/llvm-project/build/bin/clang -cc1 -internal-isystem /home/gha/actions-runner/_work/llvm-project/llvm-project/build/lib/clang/24/include -nostdsysteminc -x c++ -fgnuc-version=4.2.1 -std=gnu++1y -E -dM < /dev/null | /home/gha/actions-runner/_work/llvm-project/llvm-project/build/bin/FileCheck -match-full-lines -check-prefix GXX1Y /home/gha/actions-runner/_work/llvm-project/llvm-project/clang/test/Preprocessor/init.c
# executed command: /home/gha/actions-runner/_work/llvm-project/llvm-project/build/bin/clang -cc1 -internal-isystem /home/gha/actions-runner/_work/llvm-project/llvm-project/build/lib/clang/24/include -nostdsysteminc -x c++ -fgnuc-version=4.2.1 -std=gnu++1y -E -dM
# note: command had no output on stdout or stderr
# executed command: /home/gha/actions-runner/_work/llvm-project/llvm-project/build/bin/FileCheck -match-full-lines -check-prefix GXX1Y /home/gha/actions-runner/_work/llvm-project/llvm-project/clang/test/Preprocessor/init.c
# note: command had no output on stdout or stderr
# RUN: at line 276
/home/gha/actions-runner/_work/llvm-project/llvm-project/build/bin/clang -cc1 -internal-isystem /home/gha/actions-runner/_work/llvm-project/llvm-project/build/lib/clang/24/include -nostdsysteminc -x c++ -fgnuc-version=4.2.1 -std=gnu++11 -E -dM < /dev/null | /home/gha/actions-runner/_work/llvm-project/llvm-project/build/bin/FileCheck -match-full-lines -check-prefix GXX11 /home/gha/actions-runner/_work/llvm-project/llvm-project/clang/test/Preprocessor/init.c
# executed command: /home/gha/actions-runner/_work/llvm-project/llvm-project/build/bin/clang -cc1 -internal-isystem /home/gha/actions-runner/_work/llvm-project/llvm-project/build/lib/clang/24/include -nostdsysteminc -x c++ -fgnuc-version=4.2.1 -std=gnu++11 -E -dM
# note: command had no output on stdout or stderr
# executed command: /home/gha/actions-runner/_work/llvm-project/llvm-project/build/bin/FileCheck -match-full-lines -check-prefix GXX11 /home/gha/actions-runner/_work/llvm-project/llvm-project/clang/test/Preprocessor/init.c
# note: command had no output on stdout or stderr
# RUN: at line 284
/home/gha/actions-runner/_work/llvm-project/llvm-project/build/bin/clang -cc1 -internal-isystem /home/gha/actions-runner/_work/llvm-project/llvm-project/build/lib/clang/24/include -nostdsysteminc -x c++ -fgnuc-version=4.2.1 -std=gnu++98 -E -dM < /dev/null | /home/gha/actions-runner/_work/llvm-project/llvm-project/build/bin/FileCheck -match-full-lines -check-prefix GXX98 /home/gha/actions-runner/_work/llvm-project/llvm-project/clang/test/Preprocessor/init.c
# executed command: /home/gha/actions-runner/_work/llvm-project/llvm-project/build/bin/clang -cc1 -internal-isystem /home/gha/actions-runner/_work/llvm-project/llvm-project/build/lib/clang/24/include -nostdsysteminc -x c++ -fgnuc-version=4.2.1 -std=gnu++98 -E -dM
# note: command had no output on stdout or stderr
# executed command: /home/gha/actions-runner/_work/llvm-project/llvm-project/build/bin/FileCheck -match-full-lines -check-prefix GXX98 /home/gha/actions-runner/_work/llvm-project/llvm-project/clang/test/Preprocessor/init.c
# note: command had no output on stdout or stderr
# RUN: at line 292
/home/gha/actions-runner/_work/llvm-project/llvm-project/build/bin/clang -cc1 -internal-isystem /home/gha/actions-runner/_work/llvm-project/llvm-project/build/lib/clang/24/include -nostdsysteminc -std=iso9899:199409 -E -dM < /dev/null | /home/gha/actions-runner/_work/llvm-project/llvm-project/build/bin/FileCheck -match-full-lines -check-prefix C94 /home/gha/actions-runner/_work/llvm-project/llvm-project/clang/test/Preprocessor/init.c
# executed command: /home/gha/actions-runner/_work/llvm-project/llvm-project/build/bin/clang -cc1 -internal-isystem /home/gha/actions-runner/_work/llvm-project/llvm-project/build/lib/clang/24/include -nostdsysteminc -std=iso9899:199409 -E -dM
# note: command had no output on stdout or stderr
# executed command: /home/gha/actions-runner/_work/llvm-project/llvm-project/build/bin/FileCheck -match-full-lines -check-prefix C94 /home/gha/actions-runner/_work/llvm-project/llvm-project/clang/test/Preprocessor/init.c
# note: command had no output on stdout or stderr
# RUN: at line 297
/home/gha/actions-runner/_work/llvm-project/llvm-project/build/bin/clang -cc1 -internal-isystem /home/gha/actions-runner/_work/llvm-project/llvm-project/build/lib/clang/24/include -nostdsysteminc -fms-extensions -triple i686-pc-win32 -E -dM < /dev/null | /home/gha/actions-runner/_work/llvm-project/llvm-project/build/bin/FileCheck -match-full-lines -check-prefix MSEXT /home/gha/actions-runner/_work/llvm-project/llvm-project/clang/test/Preprocessor/init.c
# executed command: /home/gha/actions-runner/_work/llvm-project/llvm-project/build/bin/clang -cc1 -internal-isystem /home/gha/actions-runner/_work/llvm-project/llvm-project/build/lib/clang/24/include -nostdsysteminc -fms-extensions -triple i686-pc-win32 -E -dM
# note: command had no output on stdout or stderr
# executed command: /home/gha/actions-runner/_work/llvm-project/llvm-project/build/bin/FileCheck -match-full-lines -check-prefix MSEXT /home/gha/actions-runner/_work/llvm-project/llvm-project/clang/test/Preprocessor/init.c
# note: command had no output on stdout or stderr
# RUN: at line 307
/home/gha/actions-runner/_work/llvm-project/llvm-project/build/bin/clang -cc1 -internal-isystem /home/gha/actions-runner/_work/llvm-project/llvm-project/build/lib/clang/24/include -nostdsysteminc -x c++ -fms-extensions -triple i686-pc-win32 -E -dM < /dev/null | /home/gha/actions-runner/_work/llvm-project/llvm-project/build/bin/FileCheck -match-full-lines -check-prefix MSEXT-CXX /home/gha/actions-runner/_work/llvm-project/llvm-project/clang/test/Preprocessor/init.c
# executed command: /home/gha/actions-runner/_work/llvm-project/llvm-project/build/bin/clang -cc1 -internal-isystem /home/gha/actions-runner/_work/llvm-project/llvm-project/build/lib/clang/24/include -nostdsysteminc -x c++ -fms-extensions -triple i686-pc-win32 -E -dM
# note: command had no output on stdout or stderr
# executed command: /home/gha/actions-runner/_work/llvm-project/llvm-project/build/bin/FileCheck -match-full-lines -check-prefix MSEXT-CXX /home/gha/actions-runner/_work/llvm-project/llvm-project/clang/test/Preprocessor/init.c
# note: command had no output on stdout or stderr
# RUN: at line 314
/home/gha/actions-runner/_work/llvm-project/llvm-project/build/bin/clang -cc1 -internal-isystem /home/gha/actions-runner/_work/llvm-project/llvm-project/build/lib/clang/24/include -nostdsysteminc -x c++ -fno-wchar -fms-extensions -triple i686-pc-win32 -E -dM < /dev/null | /home/gha/actions-runner/_work/llvm-project/llvm-project/build/bin/FileCheck -match-full-lines -check-prefix MSEXT-CXX-NOWCHAR /home/gha/actions-runner/_work/llvm-project/llvm-project/clang/test/Preprocessor/init.c
# executed command: /home/gha/actions-runner/_work/llvm-project/llvm-project/build/bin/clang -cc1 -internal-isystem /home/gha/actions-runner/_work/llvm-project/llvm-project/build/lib/clang/24/include -nostdsysteminc -x c++ -fno-wchar -fms-extensions -triple i686-pc-win32 -E -dM
# note: command had no output on stdout or stderr
# executed command: /home/gha/actions-runner/_work/llvm-project/llvm-project/build/bin/FileCheck -match-full-lines -check-prefix MSEXT-CXX-NOWCHAR /home/gha/actions-runner/_work/llvm-project/llvm-project/clang/test/Preprocessor/init.c
# note: command had no output on stdout or stderr
# RUN: at line 321
/home/gha/actions-runner/_work/llvm-project/llvm-project/build/bin/clang -cc1 -internal-isystem /home/gha/actions-runner/_work/llvm-project/llvm-project/build/lib/clang/24/include -nostdsysteminc -x objective-c -E -dM < /dev/null | /home/gha/actions-runner/_work/llvm-project/llvm-project/build/bin/FileCheck -match-full-lines -check-prefix OBJC /home/gha/actions-runner/_work/llvm-project/llvm-project/clang/test/Preprocessor/init.c
# executed command: /home/gha/actions-runner/_work/llvm-project/llvm-project/build/bin/clang -cc1 -internal-isystem /home/gha/actions-runner/_work/llvm-project/llvm-project/build/lib/clang/24/include -nostdsysteminc -x objective-c -E -dM
# note: command had no output on stdout or stderr
# executed command: /home/gha/actions-runner/_work/llvm-project/llvm-project/build/bin/FileCheck -match-full-lines -check-prefix OBJC /home/gha/actions-runner/_work/llvm-project/llvm-project/clang/test/Preprocessor/init.c
# note: command had no output on stdout or stderr
# RUN: at line 322
/home/gha/actions-runner/_work/llvm-project/llvm-project/build/bin/clang -cc1 -internal-isystem /home/gha/actions-runner/_work/llvm-project/llvm-project/build/lib/clang/24/include -nostdsysteminc -x objective-c++ -E -dM < /dev/null | /home/gha/actions-runner/_work/llvm-project/llvm-project/build/bin/FileCheck -match-full-lines -check-prefix OBJC /home/gha/actions-runner/_work/llvm-project/llvm-project/clang/test/Preprocessor/init.c
# executed command: /home/gha/actions-runner/_work/llvm-project/llvm-project/build/bin/clang -cc1 -internal-isystem /home/gha/actions-runner/_work/llvm-project/llvm-project/build/lib/clang/24/include -nostdsysteminc -x objective-c++ -E -dM
# note: command had no output on stdout or stderr
# executed command: /home/gha/actions-runner/_work/llvm-project/llvm-project/build/bin/FileCheck -match-full-lines -check-prefix OBJC /home/gha/actions-runner/_work/llvm-project/llvm-project/clang/test/Preprocessor/init.c
# note: command had no output on stdout or stderr
# RUN: at line 329
/home/gha/actions-runner/_work/llvm-project/llvm-project/build/bin/clang -cc1 -internal-isystem /home/gha/actions-runner/_work/llvm-project/llvm-project/build/lib/clang/24/include -nostdsysteminc -x objective-c -fobjc-gc -E -dM < /dev/null | /home/gha/actions-runner/_work/llvm-project/llvm-project/build/bin/FileCheck -match-full-lines -check-prefix OBJCGC /home/gha/actions-runner/_work/llvm-project/llvm-project/clang/test/Preprocessor/init.c
# executed command: /home/gha/actions-runner/_work/llvm-project/llvm-project/build/bin/clang -cc1 -internal-isystem /home/gha/actions-runner/_work/llvm-project/llvm-project/build/lib/clang/24/include -nostdsysteminc -x objective-c -fobjc-gc -E -dM
# note: command had no output on stdout or stderr
# executed command: /home/gha/actions-runner/_work/llvm-project/llvm-project/build/bin/FileCheck -match-full-lines -check-prefix OBJCGC /home/gha/actions-runner/_work/llvm-project/llvm-project/clang/test/Preprocessor/init.c
# note: command had no output on stdout or stderr
# RUN: at line 334
/home/gha/actions-runner/_work/llvm-project/llvm-project/build/bin/clang -cc1 -internal-isystem /home/gha/actions-runner/_work/llvm-project/llvm-project/build/lib/clang/24/include -nostdsysteminc -x objective-c -fobjc-exceptions -E -dM < /dev/null | /home/gha/actions-runner/_work/llvm-project/llvm-project/build/bin/FileCheck -match-full-lines -check-prefix NONFRAGILE /home/gha/actions-runner/_work/llvm-project/llvm-project/clang/test/Preprocessor/init.c
# executed command: /home/gha/actions-runner/_work/llvm-project/llvm-project/build/bin/clang -cc1 -internal-isystem /home/gha/actions-runner/_work/llvm-project/llvm-project/build/lib/clang/24/include -nostdsysteminc -x objective-c -fobjc-exceptions -E -dM
# note: command had no output on stdout or stderr
# executed command: /home/gha/actions-runner/_work/llvm-project/llvm-project/build/bin/FileCheck -match-full-lines -check-prefix NONFRAGILE /home/gha/actions-runner/_work/llvm-project/llvm-project/clang/test/Preprocessor/init.c
# note: command had no output on stdout or stderr
# RUN: at line 340
/home/gha/actions-runner/_work/llvm-project/llvm-project/build/bin/clang -cc1 -internal-isystem /home/gha/actions-runner/_work/llvm-project/llvm-project/build/lib/clang/24/include -nostdsysteminc -E -dM < /dev/null | /home/gha/actions-runner/_work/llvm-project/llvm-project/build/bin/FileCheck -match-full-lines -check-prefix O0 /home/gha/actions-runner/_work/llvm-project/llvm-project/clang/test/Preprocessor/init.c
# executed command: /home/gha/actions-runner/_work/llvm-project/llvm-project/build/bin/clang -cc1 -internal-isystem /home/gha/actions-runner/_work/llvm-project/llvm-project/build/lib/clang/24/include -nostdsysteminc -E -dM
# note: command had no output on stdout or stderr
# executed command: /home/gha/actions-runner/_work/llvm-project/llvm-project/build/bin/FileCheck -match-full-lines -check-prefix O0 /home/gha/actions-runner/_work/llvm-project/llvm-project/clang/test/Preprocessor/init.c
# note: command had no output on stdout or stderr
# RUN: at line 347
/home/gha/actions-runner/_work/llvm-project/llvm-project/build/bin/clang -cc1 -internal-isystem /home/gha/actions-runner/_work/llvm-project/llvm-project/build/lib/clang/24/include -nostdsysteminc -fno-inline -O3 -E -dM < /dev/null | /home/gha/actions-runner/_work/llvm-project/llvm-project/build/bin/FileCheck -match-full-lines -check-prefix NO_INLINE /home/gha/actions-runner/_work/llvm-project/llvm-project/clang/test/Preprocessor/init.c
# executed command: /home/gha/actions-runner/_work/llvm-project/llvm-project/build/bin/clang -cc1 -internal-isystem /home/gha/actions-runner/_work/llvm-project/llvm-project/build/lib/clang/24/include -nostdsysteminc -fno-inline -O3 -E -dM
# note: command had no output on stdout or stderr
# executed command: /home/gha/actions-runner/_work/llvm-project/llvm-project/build/bin/FileCheck -match-full-lines -check-prefix NO_INLINE /home/gha/actions-runner/_work/llvm-project/llvm-project/clang/test/Preprocessor/init.c
# note: command had no output on stdout or stderr
# RUN: at line 354
/home/gha/actions-runner/_work/llvm-project/llvm-project/build/bin/clang -cc1 -internal-isystem /home/gha/actions-runner/_work/llvm-project/llvm-project/build/lib/clang/24/include -nostdsysteminc -O1 -E -dM < /dev/null | /home/gha/actions-runner/_work/llvm-project/llvm-project/build/bin/FileCheck -match-full-lines -check-prefix O1 /home/gha/actions-runner/_work/llvm-project/llvm-project/clang/test/Preprocessor/init.c
# executed command: /home/gha/actions-runner/_work/llvm-project/llvm-project/build/bin/clang -cc1 -internal-isystem /home/gha/actions-runner/_work/llvm-project/llvm-project/build/lib/clang/24/include -nostdsysteminc -O1 -E -dM
# note: command had no output on stdout or stderr
# executed command: /home/gha/actions-runner/_work/llvm-project/llvm-project/build/bin/FileCheck -match-full-lines -check-prefix O1 /home/gha/actions-runner/_work/llvm-project/llvm-project/clang/test/Preprocessor/init.c
# note: command had no output on stdout or stderr
# RUN: at line 360
/home/gha/actions-runner/_work/llvm-project/llvm-project/build/bin/clang -cc1 -internal-isystem /home/gha/actions-runner/_work/llvm-project/llvm-project/build/lib/clang/24/include -nostdsysteminc -Og -E -dM < /dev/null | /home/gha/actions-runner/_work/llvm-project/llvm-project/build/bin/FileCheck -match-full-lines -check-prefix Og /home/gha/actions-runner/_work/llvm-project/llvm-project/clang/test/Preprocessor/init.c
# executed command: /home/gha/actions-runner/_work/llvm-project/llvm-project/build/bin/clang -cc1 -internal-isystem /home/gha/actions-runner/_work/llvm-project/llvm-project/build/lib/clang/24/include -nostdsysteminc -Og -E -dM
# note: command had no output on stdout or stderr
# executed command: /home/gha/actions-runner/_work/llvm-project/llvm-project/build/bin/FileCheck -match-full-lines -check-prefix Og /home/gha/actions-runner/_work/llvm-project/llvm-project/clang/test/Preprocessor/init.c
# note: command had no output on stdout or stderr
# RUN: at line 366
/home/gha/actions-runner/_work/llvm-project/llvm-project/build/bin/clang -cc1 -internal-isystem /home/gha/actions-runner/_work/llvm-project/llvm-project/build/lib/clang/24/include -nostdsysteminc -Os -E -dM < /dev/null | /home/gha/actions-runner/_work/llvm-project/llvm-project/build/bin/FileCheck -match-full-lines -check-prefix Os /home/gha/actions-runner/_work/llvm-project/llvm-project/clang/test/Preprocessor/init.c
# executed command: /home/gha/actions-runner/_work/llvm-project/llvm-project/build/bin/clang -cc1 -internal-isystem /home/gha/actions-runner/_work/llvm-project/llvm-project/build/lib/clang/24/include -nostdsysteminc -Os -E -dM
# note: command had no output on stdout or stderr
# executed command: /home/gha/actions-runner/_work/llvm-project/llvm-project/build/bin/FileCheck -match-full-lines -check-prefix Os /home/gha/actions-runner/_work/llvm-project/llvm-project/clang/test/Preprocessor/init.c
# note: command had no output on stdout or stderr
# RUN: at line 372
/home/gha/actions-runner/_work/llvm-project/llvm-project/build/bin/clang -cc1 -internal-isystem /home/gha/actions-runner/_work/llvm-project/llvm-project/build/lib/clang/24/include -nostdsysteminc -Oz -E -dM < /dev/null | /home/gha/actions-runner/_work/llvm-project/llvm-project/build/bin/FileCheck -match-full-lines -check-prefix Oz /home/gha/actions-runner/_work/llvm-project/llvm-project/clang/test/Preprocessor/init.c
# executed command: /home/gha/actions-runner/_work/llvm-project/llvm-project/build/bin/clang -cc1 -internal-isystem /home/gha/actions-runner/_work/llvm-project/llvm-project/build/lib/clang/24/include -nostdsysteminc -Oz -E -dM
# note: command had no output on stdout or stderr
# executed command: /home/gha/actions-runner/_work/llvm-project/llvm-project/build/bin/FileCheck -match-full-lines -check-prefix Oz /home/gha/actions-runner/_work/llvm-project/llvm-project/clang/test/Preprocessor/init.c
# note: command had no output on stdout or stderr
# RUN: at line 378
/home/gha/actions-runner/_work/llvm-project/llvm-project/build/bin/clang -cc1 -internal-isystem /home/gha/actions-runner/_work/llvm-project/llvm-project/build/lib/clang/24/include -nostdsysteminc -fpascal-strings -E -dM < /dev/null | /home/gha/actions-runner/_work/llvm-project/llvm-project/build/bin/FileCheck -match-full-lines -check-prefix PASCAL /home/gha/actions-runner/_work/llvm-project/llvm-project/clang/test/Preprocessor/init.c
# executed command: /home/gha/actions-runner/_work/llvm-project/llvm-project/build/bin/clang -cc1 -internal-isystem /home/gha/actions-runner/_work/llvm-project/llvm-project/build/lib/clang/24/include -nostdsysteminc -fpascal-strings -E -dM
# note: command had no output on stdout or stderr
# executed command: /home/gha/actions-runner/_work/llvm-project/llvm-project/build/bin/FileCheck -match-full-lines -check-prefix PASCAL /home/gha/actions-runner/_work/llvm-project/llvm-project/clang/test/Preprocessor/init.c
# note: command had no output on stdout or stderr
# RUN: at line 383
/home/gha/actions-runner/_work/llvm-project/llvm-project/build/bin/clang -cc1 -internal-isystem /home/gha/actions-runner/_work/llvm-project/llvm-project/build/lib/clang/24/include -nostdsysteminc -E -dM < /dev/null | /home/gha/actions-runner/_work/llvm-project/llvm-project/build/bin/FileCheck -match-full-lines -check-prefix SCHAR /home/gha/actions-runner/_work/llvm-project/llvm-project/clang/test/Preprocessor/init.c
# executed command: /home/gha/actions-runner/_work/llvm-project/llvm-project/build/bin/clang -cc1 -internal-isystem /home/gha/actions-runner/_work/llvm-project/llvm-project/build/lib/clang/24/include -nostdsysteminc -E -dM
# note: command had no output on stdout or stderr
# executed command: /home/gha/actions-runner/_work/llvm-project/llvm-project/build/bin/FileCheck -match-full-lines -check-prefix SCHAR /home/gha/actions-runner/_work/llvm-project/llvm-project/clang/test/Preprocessor/init.c
# note: command had no output on stdout or stderr
# RUN: at line 389
/home/gha/actions-runner/_work/llvm-project/llvm-project/build/bin/clang -cc1 -internal-isystem /home/gha/actions-runner/_work/llvm-project/llvm-project/build/lib/clang/24/include -nostdsysteminc -E -dM -fwchar-type=short -fno-signed-wchar < /dev/null | /home/gha/actions-runner/_work/llvm-project/llvm-project/build/bin/FileCheck -match-full-lines -check-prefix SHORTWCHAR /home/gha/actions-runner/_work/llvm-project/llvm-project/clang/test/Preprocessor/init.c
# executed command: /home/gha/actions-runner/_work/llvm-project/llvm-project/build/bin/clang -cc1 -internal-isystem /home/gha/actions-runner/_work/llvm-project/llvm-project/build/lib/clang/24/include -nostdsysteminc -E -dM -fwchar-type=short -fno-signed-wchar
# note: command had no output on stdout or stderr
# executed command: /home/gha/actions-runner/_work/llvm-project/llvm-project/build/bin/FileCheck -match-full-lines -check-prefix SHORTWCHAR /home/gha/actions-runner/_work/llvm-project/llvm-project/clang/test/Preprocessor/init.c
# note: command had no output on stdout or stderr
# RUN: at line 391
/home/gha/actions-runner/_work/llvm-project/llvm-project/build/bin/clang -cc1 -internal-isystem /home/gha/actions-runner/_work/llvm-project/llvm-project/build/lib/clang/24/include -nostdsysteminc -E -dM -fwchar-type=short -fno-signed-wchar -triple=x86_64-w64-mingw32 < /dev/null | /home/gha/actions-runner/_work/llvm-project/llvm-project/build/bin/FileCheck -match-full-lines -check-prefix SHORTWCHAR /home/gha/actions-runner/_work/llvm-project/llvm-project/clang/test/Preprocessor/init.c
# executed command: /home/gha/actions-runner/_work/llvm-project/llvm-project/build/bin/clang -cc1 -internal-isystem /home/gha/actions-runner/_work/llvm-project/llvm-project/build/lib/clang/24/include -nostdsysteminc -E -dM -fwchar-type=short -fno-signed-wchar -triple=x86_64-w64-mingw32
# note: command had no output on stdout or stderr
# executed command: /home/gha/actions-runner/_work/llvm-project/llvm-project/build/bin/FileCheck -match-full-lines -check-prefix SHORTWCHAR /home/gha/actions-runner/_work/llvm-project/llvm-project/clang/test/Preprocessor/init.c
# note: command had no output on stdout or stderr
# RUN: at line 392
/home/gha/actions-runner/_work/llvm-project/llvm-project/build/bin/clang -cc1 -internal-isystem /home/gha/actions-runner/_work/llvm-project/llvm-project/build/lib/clang/24/include -nostdsysteminc -dM -fwchar-type=short -fno-signed-wchar -triple=x86_64-unknown-windows-cygnus -E /dev/null | /home/gha/actions-runner/_work/llvm-project/llvm-project/build/bin/FileCheck -match-full-lines -check-prefix SHORTWCHAR /home/gha/actions-runner/_work/llvm-project/llvm-project/clang/test/Preprocessor/init.c
# executed command: /home/gha/actions-runner/_work/llvm-project/llvm-project/build/bin/clang -cc1 -internal-isystem /home/gha/actions-runner/_work/llvm-project/llvm-project/build/lib/clang/24/include -nostdsysteminc -dM -fwchar-type=short -fno-signed-wchar -triple=x86_64-unknown-windows-cygnus -E /dev/null
# note: command had no output on stdout or stderr
# executed command: /home/gha/actions-runner/_work/llvm-project/llvm-project/build/bin/FileCheck -match-full-lines -check-prefix SHORTWCHAR /home/gha/actions-runner/_work/llvm-project/llvm-project/clang/test/Preprocessor/init.c
# note: command had no output on stdout or stderr
# RUN: at line 399
/home/gha/actions-runner/_work/llvm-project/llvm-project/build/bin/clang -cc1 -internal-isystem /home/gha/actions-runner/_work/llvm-project/llvm-project/build/lib/clang/24/include -nostdsysteminc -E -dM -fwchar-type=int -triple=i686-unknown-unknown < /dev/null | /home/gha/actions-runner/_work/llvm-project/llvm-project/build/bin/FileCheck -match-full-lines -check-prefix SHORTWCHAR2 /home/gha/actions-runner/_work/llvm-project/llvm-project/clang/test/Preprocessor/init.c
# executed command: /home/gha/actions-runner/_work/llvm-project/llvm-project/build/bin/clang -cc1 -internal-isystem /home/gha/actions-runner/_work/llvm-project/llvm-project/build/lib/clang/24/include -nostdsysteminc -E -dM -fwchar-type=int -triple=i686-unknown-unknown
# note: command had no output on stdout or stderr
# executed command: /home/gha/actions-runner/_work/llvm-project/llvm-project/build/bin/FileCheck -match-full-lines -check-prefix SHORTWCHAR2 /home/gha/actions-runner/_work/llvm-project/llvm-project/clang/test/Preprocessor/init.c
# note: command had no output on stdout or stderr
# RUN: at line 400
/home/gha/actions-runner/_work/llvm-project/llvm-project/build/bin/clang -cc1 -internal-isystem /home/gha/actions-runner/_work/llvm-project/llvm-project/build/lib/clang/24/include -nostdsysteminc -E -dM -fwchar-type=int -triple=x86_64-unknown-unknown < /dev/null | /home/gha/actions-runner/_work/llvm-project/llvm-project/build/bin/FileCheck -match-full-lines -check-prefix SHORTWCHAR2 /home/gha/actions-runner/_work/llvm-project/llvm-project/clang/test/Preprocessor/init.c
# executed command: /home/gha/actions-runner/_work/llvm-project/llvm-project/build/bin/clang -cc1 -internal-isystem /home/gha/actions-runner/_work/llvm-project/llvm-project/build/lib/clang/24/include -nostdsysteminc -E -dM -fwchar-type=int -triple=x86_64-unknown-unknown
# note: command had no output on stdout or stderr
# executed command: /home/gha/actions-runner/_work/llvm-project/llvm-project/build/bin/FileCheck -match-full-lines -check-prefix SHORTWCHAR2 /home/gha/actions-runner/_work/llvm-project/llvm-project/clang/test/Preprocessor/init.c
# note: command had no output on stdout or stderr
# RUN: at line 407
/home/gha/actions-runner/_work/llvm-project/llvm-project/build/bin/clang -cc1 -internal-isystem /home/gha/actions-runner/_work/llvm-project/llvm-project/build/lib/clang/24/include -nostdsysteminc -E -dM -ffreestanding -triple=msp430-none-none < /dev/null | /home/gha/actions-runner/_work/llvm-project/llvm-project/build/bin/FileCheck -match-full-lines -check-prefix MSP430 /home/gha/actions-runner/_work/llvm-project/llvm-project/clang/test/Preprocessor/init.c
# executed command: /home/gha/actions-runner/_work/llvm-project/llvm-project/build/bin/clang -cc1 -internal-isystem /home/gha/actions-runner/_work/llvm-project/llvm-project/build/lib/clang/24/include -nostdsysteminc -E -dM -ffreestanding -triple=msp430-none-none
# note: command had no output on stdout or stderr
# executed command: /home/gha/actions-runner/_work/llvm-project/llvm-project/build/bin/FileCheck -match-full-lines -check-prefix MSP430 /home/gha/actions-runner/_work/llvm-project/llvm-project/clang/test/Preprocessor/init.c
# note: command had no output on stdout or stderr
# RUN: at line 408
/home/gha/actions-runner/_work/llvm-project/llvm-project/build/bin/clang -cc1 -internal-isystem /home/gha/actions-runner/_work/llvm-project/llvm-project/build/lib/clang/24/include -nostdsysteminc -x c++ -E -dM -ffreestanding -triple=msp430-none-none < /dev/null | /home/gha/actions-runner/_work/llvm-project/llvm-project/build/bin/FileCheck -match-full-lines -check-prefix MSP430 -check-prefix MSP430-CXX /home/gha/actions-runner/_work/llvm-project/llvm-project/clang/test/Preprocessor/init.c
# executed command: /home/gha/actions-runner/_work/llvm-project/llvm-project/build/bin/clang -cc1 -internal-isystem /home/gha/actions-runner/_work/llvm-project/llvm-project/build/lib/clang/24/include -nostdsysteminc -x c++ -E -dM -ffreestanding -triple=msp430-none-none
# note: command had no output on stdout or stderr
# executed command: /home/gha/actions-runner/_work/llvm-project/llvm-project/build/bin/FileCheck -match-full-lines -check-prefix MSP430 -check-prefix MSP430-CXX /home/gha/actions-runner/_work/llvm-project/llvm-project/clang/test/Preprocessor/init.c
# note: command had no output on stdout or stderr
# RUN: at line 603
/home/gha/actions-runner/_work/llvm-project/llvm-project/build/bin/clang -cc1 -internal-isystem /home/gha/actions-runner/_work/llvm-project/llvm-project/build/lib/clang/24/include -nostdsysteminc -E -dM -ffreestanding -triple=nvptx-none-none < /dev/null | /home/gha/actions-runner/_work/llvm-project/llvm-project/build/bin/FileCheck -match-full-lines -check-prefix NVPTX32 /home/gha/actions-runner/_work/llvm-project/llvm-project/clang/test/Preprocessor/init.c
# executed command: /home/gha/actions-runner/_work/llvm-project/llvm-project/build/bin/clang -cc1 -internal-isystem /home/gha/actions-runner/_work/llvm-project/llvm-project/build/lib/clang/24/include -nostdsysteminc -E -dM -ffreestanding -triple=nvptx-none-none
# note: command had no output on stdout or stderr
# executed command: /home/gha/actions-runner/_work/llvm-project/llvm-project/build/bin/FileCheck -match-full-lines -check-prefix NVPTX32 /home/gha/actions-runner/_work/llvm-project/llvm-project/clang/test/Preprocessor/init.c
# note: command had no output on stdout or stderr
# RUN: at line 604
/home/gha/actions-runner/_work/llvm-project/llvm-project/build/bin/clang -cc1 -internal-isystem /home/gha/actions-runner/_work/llvm-project/llvm-project/build/lib/clang/24/include -nostdsysteminc -x c++ -E -dM -ffreestanding -triple=nvptx-none-none < /dev/null | /home/gha/actions-runner/_work/llvm-project/llvm-project/build/bin/FileCheck -match-full-lines -check-prefix NVPTX32 -check-prefix NVPTX32-CXX /home/gha/actions-runner/_work/llvm-project/llvm-project/clang/test/Preprocessor/init.c
# executed command: /home/gha/actions-runner/_work/llvm-project/llvm-project/build/bin/clang -cc1 -internal-isystem /home/gha/actions-runner/_work/llvm-project/llvm-project/build/lib/clang/24/include -nostdsysteminc -x c++ -E -dM -ffreestanding -triple=nvptx-none-none
# note: command had no output on stdout or stderr
# executed command: /home/gha/actions-runner/_work/llvm-project/llvm-project/build/bin/FileCheck -match-full-lines -check-prefix NVPTX32 -check-prefix NVPTX32-CXX /home/gha/actions-runner/_work/llvm-project/llvm-project/clang/test/Preprocessor/init.c
# note: command had no output on stdout or stderr
# RUN: at line 801
/home/gha/actions-runner/_work/llvm-project/llvm-project/build/bin/clang -cc1 -internal-isystem /home/gha/actions-runner/_work/llvm-project/llvm-project/build/lib/clang/24/include -nostdsysteminc -E -dM -ffreestanding -triple=nvptx64-none-none < /dev/null | /home/gha/actions-runner/_work/llvm-project/llvm-project/build/bin/FileCheck -match-full-lines -check-prefix NVPTX64 /home/gha/actions-runner/_work/llvm-project/llvm-project/clang/test/Preprocessor/init.c
# executed command: /home/gha/actions-runner/_work/llvm-project/llvm-project/build/bin/clang -cc1 -internal-isystem /home/gha/actions-runner/_work/llvm-project/llvm-project/build/lib/clang/24/include -nostdsysteminc -E -dM -ffreestanding -triple=nvptx64-none-none
# note: command had no output on stdout or stderr
# executed command: /home/gha/actions-runner/_work/llvm-project/llvm-project/build/bin/FileCheck -match-full-lines -check-prefix NVPTX64 /home/gha/actions-runner/_work/llvm-project/llvm-project/clang/test/Preprocessor/init.c
# note: command had no output on stdout or stderr
# RUN: at line 802
/home/gha/actions-runner/_work/llvm-project/llvm-project/build/bin/clang -cc1 -internal-isystem /home/gha/actions-runner/_work/llvm-project/llvm-project/build/lib/clang/24/include -nostdsysteminc -x c++ -E -dM -ffreestanding -triple=nvptx64-none-none < /dev/null | /home/gha/actions-runner/_work/llvm-project/llvm-project/build/bin/FileCheck -match-full-lines -check-prefix NVPTX64 -check-prefix NVPTX64-CXX /home/gha/actions-runner/_work/llvm-project/llvm-project/clang/test/Preprocessor/init.c
# executed command: /home/gha/actions-runner/_work/llvm-project/llvm-project/build/bin/clang -cc1 -internal-isystem /home/gha/actions-runner/_work/llvm-project/llvm-project/build/lib/clang/24/include -nostdsysteminc -x c++ -E -dM -ffreestanding -triple=nvptx64-none-none
# note: command had no output on stdout or stderr
# executed command: /home/gha/actions-runner/_work/llvm-project/llvm-project/build/bin/FileCheck -match-full-lines -check-prefix NVPTX64 -check-prefix NVPTX64-CXX /home/gha/actions-runner/_work/llvm-project/llvm-project/clang/test/Preprocessor/init.c
# note: command had no output on stdout or stderr
# RUN: at line 1000
/home/gha/actions-runner/_work/llvm-project/llvm-project/build/bin/clang -cc1 -internal-isystem /home/gha/actions-runner/_work/llvm-project/llvm-project/build/lib/clang/24/include -nostdsysteminc -x cl -E -dM -ffreestanding -triple=amdgpu < /dev/null | /home/gha/actions-runner/_work/llvm-project/llvm-project/build/bin/FileCheck -match-full-lines -check-prefix AMDGCN --check-prefix AMDGPU /home/gha/actions-runner/_work/llvm-project/llvm-project/clang/test/Preprocessor/init.c
# executed command: /home/gha/actions-runner/_work/llvm-project/llvm-project/build/bin/clang -cc1 -internal-isystem /home/gha/actions-runner/_work/llvm-project/llvm-project/build/lib/clang/24/include -nostdsysteminc -x cl -E -dM -ffreestanding -triple=amdgpu
# note: command had no output on stdout or stderr
# executed command: /home/gha/actions-runner/_work/llvm-project/llvm-project/build/bin/FileCheck -match-full-lines -check-prefix AMDGCN --check-prefix AMDGPU /home/gha/actions-runner/_work/llvm-project/llvm-project/clang/test/Preprocessor/init.c
# note: command had no output on stdout or stderr
# RUN: at line 1001
/home/gha/actions-runner/_work/llvm-project/llvm-project/build/bin/clang -cc1 -internal-isystem /home/gha/actions-runner/_work/llvm-project/llvm-project/build/lib/clang/24/include -nostdsysteminc -x cl -E -dM -ffreestanding -triple=r600 -target-cpu caicos < /dev/null | /home/gha/actions-runner/_work/llvm-project/llvm-project/build/bin/FileCheck -match-full-lines --check-prefix AMDGPU /home/gha/actions-runner/_work/llvm-project/llvm-project/clang/test/Preprocessor/init.c
# executed command: /home/gha/actions-runner/_work/llvm-project/llvm-project/build/bin/clang -cc1 -internal-isystem /home/gha/actions-runner/_work/llvm-project/llvm-project/build/lib/clang/24/include -nostdsysteminc -x cl -E -dM -ffreestanding -triple=r600 -target-cpu caicos
# note: command had no output on stdout or stderr
# executed command: /home/gha/actions-runner/_work/llvm-project/llvm-project/build/bin/FileCheck -match-full-lines --check-prefix AMDGPU /home/gha/actions-runner/_work/llvm-project/llvm-project/clang/test/Preprocessor/init.c
# note: command had no output on stdout or stderr
# RUN: at line 1011
/home/gha/actions-runner/_work/llvm-project/llvm-project/build/bin/clang -cc1 -internal-isystem /home/gha/actions-runner/_work/llvm-project/llvm-project/build/lib/clang/24/include -nostdsysteminc -E -dM -ffreestanding -fgnuc-version=4.2.1 -triple=sparc-none-none < /dev/null | /home/gha/actions-runner/_work/llvm-project/llvm-project/build/bin/FileCheck -match-full-lines -check-prefix SPARC -check-prefix SPARC-DEFAULT -check-prefix SPARC-LDBL64 /home/gha/actions-runner/_work/llvm-project/llvm-project/clang/test/Preprocessor/init.c
# executed command: /home/gha/actions-runner/_work/llvm-project/llvm-project/build/bin/clang -cc1 -internal-isystem /home/gha/actions-runner/_work/llvm-project/llvm-project/build/lib/clang/24/include -nostdsysteminc -E -dM -ffreestanding -fgnuc-version=4.2.1 -triple=sparc-none-none
# note: command had no output on stdout or stderr
# executed command: /home/gha/actions-runner/_work/llvm-project/llvm-project/build/bin/FileCheck -match-full-lines -check-prefix SPARC -check-prefix SPARC-DEFAULT -check-prefix SPARC-LDBL64 /home/gha/actions-runner/_work/llvm-project/llvm-project/clang/test/Preprocessor/init.c
# note: command had no output on stdout or stderr
# RUN: at line 1012
/home/gha/actions-runner/_work/llvm-project/llvm-project/build/bin/clang -cc1 -internal-isystem /home/gha/actions-runner/_work/llvm-project/llvm-project/build/lib/clang/24/include -nostdsysteminc -E -dM -ffreestanding -fgnuc-version=4.2.1 -triple=sparc-rtems-elf < /dev/null | /home/gha/actions-runner/_work/llvm-project/llvm-project/build/bin/FileCheck -match-full-lines -check-prefix SPARC -check-prefix SPARC-DEFAULT -check-prefix SPARC-LDBL64 /home/gha/actions-runner/_work/llvm-project/llvm-project/clang/test/Preprocessor/init.c
# executed command: /home/gha/actions-runner/_work/llvm-project/llvm-project/build/bin/clang -cc1 -internal-isystem /home/gha/actions-runner/_work/llvm-project/llvm-project/build/lib/clang/24/include -nostdsysteminc -E -dM -ffreestanding -fgnuc-version=4.2.1 -triple=sparc-rtems-elf
# note: command had no output on stdout or stderr
# executed command: /home/gha/actions-runner/_work/llvm-project/llvm-project/build/bin/FileCheck -match-full-lines -check-prefix SPARC -check-prefix SPARC-DEFAULT -check-prefix SPARC-LDBL64 /home/gha/actions-runner/_work/llvm-project/llvm-project/clang/test/Preprocessor/init.c
# note: command had no output on stdout or stderr
# RUN: at line 1013
/home/gha/actions-runner/_work/llvm-project/llvm-project/build/bin/clang -cc1 -internal-isystem /home/gha/actions-runner/_work/llvm-project/llvm-project/build/lib/clang/24/include -nostdsysteminc -E -dM -ffreestanding -fgnuc-version=4.2.1 -triple=sparc-none-netbsd < /dev/null | /home/gha/actions-runner/_work/llvm-project/llvm-project/build/bin/FileCheck -match-full-lines -check-prefix SPARC -check-prefix SPARC-NETOPENBSD -check-prefix SPARC-LDBL128 /home/gha/actions-runner/_work/llvm-project/llvm-project/clang/test/Preprocessor/init.c
# executed command: /home/gha/actions-runner/_work/llvm-project/llvm-project/build/bin/clang -cc1 -internal-isystem /home/gha/actions-runner/_work/llvm-project/llvm-project/build/lib/clang/24/include -nostdsysteminc -E -dM -ffreestanding -fgnuc-version=4.2.1 -triple=sparc-none-netbsd
# note: command had no output on stdout or stderr
# executed command: /home/gha/actions-runner/_work/llvm-project/llvm-project/build/bin/FileCheck -match-full-lines -check-prefix SPARC -check-prefix SPARC-NETOPENBSD -check-prefix SPARC-LDBL128 /home/gha/actions-runner/_work/llvm-project/llvm-project/clang/test/Preprocessor/init.c
# note: command had no output on stdout or stderr
# RUN: at line 1014
/home/gha/actions-runner/_work/llvm-project/llvm-project/build/bin/clang -cc1 -internal-isystem /home/gha/actions-runner/_work/llvm-project/llvm-project/build/lib/clang/24/include -nostdsysteminc -E -dM -ffreestanding -fgnuc-version=4.2.1 -triple=sparc-unknown-linux-gnu < /dev/null | /home/gha/actions-runner/_work/llvm-project/llvm-project/build/bin/FileCheck -match-full-lines -check-prefix SPARC-LDBL128 /home/gha/actions-runner/_work/llvm-project/llvm-project/clang/test/Preprocessor/init.c
# executed command: /home/gha/actions-runner/_work/llvm-project/llvm-project/build/bin/clang -cc1 -internal-isystem /home/gha/actions-runner/_work/llvm-project/llvm-project/build/lib/clang/24/include -nostdsysteminc -E -dM -ffreestanding -fgnuc-version=4.2.1 -triple=sparc-unknown-linux-gnu
# note: command had no output on stdout or stderr
# executed command: /home/gha/actions-runner/_work/llvm-project/llvm-project/build/bin/FileCheck -match-full-lines -check-prefix SPARC-LDBL128 /home/gha/actions-runner/_work/llvm-project/llvm-project/clang/test/Preprocessor/init.c
# note: command had no output on stdout or stderr
# RUN: at line 1015
/home/gha/actions-runner/_work/llvm-project/llvm-project/build/bin/clang -cc1 -internal-isystem /home/gha/actions-runner/_work/llvm-project/llvm-project/build/lib/clang/24/include -nostdsysteminc -E -dM -ffreestanding -fgnuc-version=4.2.1 -triple=sparc-sun-solaris < /dev/null | /home/gha/actions-runner/_work/llvm-project/llvm-project/build/bin/FileCheck -match-full-lines -check-prefix SPARC-LDBL128 /home/gha/actions-runner/_work/llvm-project/llvm-project/clang/test/Preprocessor/init.c
# executed command: /home/gha/actions-runner/_work/llvm-project/llvm-project/build/bin/clang -cc1 -internal-isystem /home/gha/actions-runner/_work/llvm-project/llvm-project/build/lib/clang/24/include -nostdsysteminc -E -dM -ffreestanding -fgnuc-version=4.2.1 -triple=sparc-sun-solaris
# note: command had no output on stdout or stderr
# executed command: /home/gha/actions-runner/_work/llvm-project/llvm-project/build/bin/FileCheck -match-full-lines -check-prefix SPARC-LDBL128 /home/gha/actions-runner/_work/llvm-project/llvm-project/clang/test/Preprocessor/init.c
# note: command had no output on stdout or stderr
# RUN: at line 1016
/home/gha/actions-runner/_work/llvm-project/llvm-project/build/bin/clang -cc1 -internal-isystem /home/gha/actions-runner/_work/llvm-project/llvm-project/build/lib/clang/24/include -nostdsysteminc -x c++ -E -dM -ffreestanding -fgnuc-version=4.2.1 -triple=sparc-none-none < /dev/null | /home/gha/actions-runner/_work/llvm-project/llvm-project/build/bin/FileCheck -match-full-lines -check-prefix SPARC -check-prefix SPARC-DEFAULT -check-prefix SPARC-LDBL64 -check-prefix SPARC-DEFAULT-CXX /home/gha/actions-runner/_work/llvm-project/llvm-project/clang/test/Preprocessor/init.c
# executed command: /home/gha/actions-runner/_work/llvm-project/llvm-project/build/bin/clang -cc1 -internal-isystem /home/gha/actions-runner/_work/llvm-project/llvm-project/build/lib/clang/24/include -nostdsysteminc -x c++ -E -dM -ffreestanding -fgnuc-version=4.2.1 -triple=sparc-none-none
# note: command had no output on stdout or stderr
# executed command: /home/gha/actions-runner/_work/llvm-project/llvm-project/build/bin/FileCheck -match-full-lines -check-prefix SPARC -check-prefix SPARC-DEFAULT -check-prefix SPARC-LDBL64 -check-prefix SPARC-DEFAULT-CXX /home/gha/actions-runner/_work/llvm-project/llvm-project/clang/test/Preprocessor/init.c
# note: command had no output on stdout or stderr
# RUN: at line 1235
/home/gha/actions-runner/_work/llvm-project/llvm-project/build/bin/clang -cc1 -internal-isystem /home/gha/actions-runner/_work/llvm-project/llvm-project/build/lib/clang/24/include -nostdsysteminc -E -dM -ffreestanding -fgnuc-version=4.2.1 -triple=tce-none-none < /dev/null | /home/gha/actions-runner/_work/llvm-project/llvm-project/build/bin/FileCheck -match-full-lines -check-prefix TCE /home/gha/actions-runner/_work/llvm-project/llvm-project/clang/test/Preprocessor/init.c
# executed command: /home/gha/actions-runner/_work/llvm-project/llvm-project/build/bin/clang -cc1 -internal-isystem /home/gha/actions-runner/_work/llvm-project/llvm-project/build/lib/clang/24/include -nostdsysteminc -E -dM -ffreestanding -fgnuc-version=4.2.1 -triple=tce-none-none
# note: command had no output on stdout or stderr
# executed command: /home/gha/actions-runner/_work/llvm-project/llvm-project/build/bin/FileCheck -match-full-lines -check-prefix TCE /home/gha/actions-runner/_work/llvm-project/llvm-project/clang/test/Preprocessor/init.c
# note: command had no output on stdout or stderr
# RUN: at line 1236
/home/gha/actions-runner/_work/llvm-project/llvm-project/build/bin/clang -cc1 -internal-isystem /home/gha/actions-runner/_work/llvm-project/llvm-project/build/lib/clang/24/include -nostdsysteminc -x c++ -E -dM -ffreestanding -fgnuc-version=4.2.1 -triple=tce-none-none < /dev/null | /home/gha/actions-runner/_work/llvm-project/llvm-project/build/bin/FileCheck -match-full-lines -check-prefix TCE -check-prefix TCE-CXX /home/gha/actions-runner/_work/llvm-project/llvm-project/clang/test/Preprocessor/init.c
# executed command: /home/gha/actions-runner/_work/llvm-project/llvm-project/build/bin/clang -cc1 -internal-isystem /home/gha/actions-runner/_work/llvm-project/llvm-project/build/lib/clang/24/include -nostdsysteminc -x c++ -E -dM -ffreestanding -fgnuc-version=4.2.1 -triple=tce-none-none
# note: command had no output on stdout or stderr
# executed command: /home/gha/actions-runner/_work/llvm-project/llvm-project/build/bin/FileCheck -match-full-lines -check-prefix TCE -check-prefix TCE-CXX /home/gha/actions-runner/_work/llvm-project/llvm-project/clang/test/Preprocessor/init.c
# note: command had no output on stdout or stderr
# RUN: at line 1411
/home/gha/actions-runner/_work/llvm-project/llvm-project/build/bin/clang -cc1 -internal-isystem /home/gha/actions-runner/_work/llvm-project/llvm-project/build/lib/clang/24/include -nostdsysteminc -E -dM -ffreestanding -triple=x86_64-scei-ps4 < /dev/null | /home/gha/actions-runner/_work/llvm-project/llvm-project/build/bin/FileCheck --match-full-lines --check-prefixes=PS4,PS4ONLY /home/gha/actions-runner/_work/llvm-project/llvm-project/clang/test/Preprocessor/init.c
# executed command: /home/gha/actions-runner/_work/llvm-project/llvm-project/build/bin/clang -cc1 -internal-isystem /home/gha/actions-runner/_work/llvm-project/llvm-project/build/lib/clang/24/include -nostdsysteminc -E -dM -ffreestanding -triple=x86_64-scei-ps4
# note: command had no output on stdout or stderr
# executed command: /home/gha/actions-runner/_work/llvm-project/llvm-project/build/bin/FileCheck --match-full-lines --check-prefixes=PS4,PS4ONLY /home/gha/actions-runner/_work/llvm-project/llvm-project/clang/test/Preprocessor/init.c
# note: command had no output on stdout or stderr
# RUN: at line 1412
/home/gha/actions-runner/_work/llvm-project/llvm-project/build/bin/clang -cc1 -internal-isystem /home/gha/actions-runner/_work/llvm-project/llvm-project/build/lib/clang/24/include -nostdsysteminc -E -dM -ffreestanding -triple=x86_64-sie-ps5 < /dev/null | /home/gha/actions-runner/_work/llvm-project/llvm-project/build/bin/FileCheck --match-full-lines --check-prefixes=PS4,PS5ONLY /home/gha/actions-runner/_work/llvm-project/llvm-project/clang/test/Preprocessor/init.c
# executed command: /home/gha/actions-runner/_work/llvm-project/llvm-project/build/bin/clang -cc1 -internal-isystem /home/gha/actions-runner/_work/llvm-project/llvm-project/build/lib/clang/24/include -nostdsysteminc -E -dM -ffreestanding -triple=x86_64-sie-ps5
# note: command had no output on stdout or stderr
# executed command: /home/gha/actions-runner/_work/llvm-project/llvm-project/build/bin/FileCheck --match-full-lines --check-prefixes=PS4,PS5ONLY /home/gha/actions-runner/_work/llvm-project/llvm-project/clang/test/Preprocessor/init.c
# note: command had no output on stdout or stderr
# RUN: at line 1531
/home/gha/actions-runner/_work/llvm-project/llvm-project/build/bin/clang -cc1 -internal-isystem /home/gha/actions-runner/_work/llvm-project/llvm-project/build/lib/clang/24/include -nostdsysteminc -x c++ -E -dM -ffreestanding -triple=x86_64-scei-ps4 < /dev/null | /home/gha/actions-runner/_work/llvm-project/llvm-project/build/bin/FileCheck --match-full-lines --check-prefix PS4-CXX /home/gha/actions-runner/_work/llvm-project/llvm-project/clang/test/Preprocessor/init.c
# executed command: /home/gha/actions-runner/_work/llvm-project/llvm-project/build/bin/clang -cc1 -internal-isystem /home/gha/actions-runner/_work/llvm-project/llvm-project/build/lib/clang/24/include -nostdsysteminc -x c++ -E -dM -ffreestanding -triple=x86_64-scei-ps4
# note: command had no output on stdout or stderr
# executed command: /home/gha/actions-runner/_work/llvm-project/llvm-project/build/bin/FileCheck --match-full-lines --check-prefix PS4-CXX /home/gha/actions-runner/_work/llvm-project/llvm-project/clang/test/Preprocessor/init.c
# note: command had no output on stdout or stderr
# RUN: at line 1532
/home/gha/actions-runner/_work/llvm-project/llvm-project/build/bin/clang -cc1 -internal-isystem /home/gha/actions-runner/_work/llvm-project/llvm-project/build/lib/clang/24/include -nostdsysteminc -x c++ -E -dM -ffreestanding -triple=x86_64-sie-ps5 < /dev/null | /home/gha/actions-runner/_work/llvm-project/llvm-project/build/bin/FileCheck --match-full-lines --check-prefix PS4-CXX /home/gha/actions-runner/_work/llvm-project/llvm-project/clang/test/Preprocessor/init.c
# executed command: /home/gha/actions-runner/_work/llvm-project/llvm-project/build/bin/clang -cc1 -internal-isystem /home/gha/actions-runner/_work/llvm-project/llvm-project/build/lib/clang/24/include -nostdsysteminc -x c++ -E -dM -ffreestanding -triple=x86_64-sie-ps5
# note: command had no output on stdout or stderr
# executed command: /home/gha/actions-runner/_work/llvm-project/llvm-project/build/bin/FileCheck --match-full-lines --check-prefix PS4-CXX /home/gha/actions-runner/_work/llvm-project/llvm-project/clang/test/Preprocessor/init.c
# note: command had no output on stdout or stderr
# RUN: at line 1535
/home/gha/actions-runner/_work/llvm-project/llvm-project/build/bin/clang -cc1 -internal-isystem /home/gha/actions-runner/_work/llvm-project/llvm-project/build/lib/clang/24/include -nostdsysteminc -E -dM -triple=x86_64-pc-mingw32 < /dev/null | /home/gha/actions-runner/_work/llvm-project/llvm-project/build/bin/FileCheck -match-full-lines -check-prefix X86-64-DECLSPEC-GNU /home/gha/actions-runner/_work/llvm-project/llvm-project/clang/test/Preprocessor/init.c
# executed command: /home/gha/actions-runner/_work/llvm-project/llvm-project/build/bin/clang -cc1 -internal-isystem /home/gha/actions-runner/_work/llvm-project/llvm-project/build/lib/clang/24/include -nostdsysteminc -E -dM -triple=x86_64-pc-mingw32
# note: command had no output on stdout or stderr
# executed command: /home/gha/actions-runner/_work/llvm-project/llvm-project/build/bin/FileCheck -match-full-lines -check-prefix X86-64-DECLSPEC-GNU /home/gha/actions-runner/_work/llvm-project/llvm-project/clang/test/Preprocessor/init.c
# note: command had no output on stdout or stderr
# RUN: at line 1538
/home/gha/actions-runner/_work/llvm-project/llvm-project/build/bin/clang -cc1 -internal-isystem /home/gha/actions-runner/_work/llvm-project/llvm-project/build/lib/clang/24/include -nostdsysteminc -E -dM -fms-extensions -triple=x86_64-unknown-mingw32 < /dev/null | /home/gha/actions-runner/_work/llvm-project/llvm-project/build/bin/FileCheck -match-full-lines -check-prefix X86-64-DECLSPEC-MS /home/gha/actions-runner/_work/llvm-project/llvm-project/clang/test/Preprocessor/init.c
# executed command: /home/gha/actions-runner/_work/llvm-project/llvm-project/build/bin/clang -cc1 -internal-isystem /home/gha/actions-runner/_work/llvm-project/llvm-project/build/lib/clang/24/include -nostdsysteminc -E -dM -fms-extensions -triple=x86_64-unknown-mingw32
# note: command had no output on stdout or stderr
# executed command: /home/gha/actions-runner/_work/llvm-project/llvm-project/build/bin/FileCheck -match-full-lines -check-prefix X86-64-DECLSPEC-MS /home/gha/actions-runner/_work/llvm-project/llvm-project/clang/test/Preprocessor/init.c
# note: command had no output on stdout or stderr
# RUN: at line 1539
/home/gha/actions-runner/_work/llvm-project/llvm-project/build/bin/clang -cc1 -internal-isystem /home/gha/actions-runner/_work/llvm-project/llvm-project/build/lib/clang/24/include -nostdsysteminc -E -dM -fdeclspec -triple=x86_64-unknown-mingw32 < /dev/null | /home/gha/actions-runner/_work/llvm-project/llvm-project/build/bin/FileCheck -match-full-lines -check-prefix X86-64-DECLSPEC-MS /home/gha/actions-runner/_work/llvm-project/llvm-project/clang/test/Preprocessor/init.c
# executed command: /home/gha/actions-runner/_work/llvm-project/llvm-project/build/bin/clang -cc1 -internal-isystem /home/gha/actions-runner/_work/llvm-project/llvm-project/build/lib/clang/24/include -nostdsysteminc -E -dM -fdeclspec -triple=x86_64-unknown-mingw32
# note: command had no output on stdout or stderr
# executed command: /home/gha/actions-runner/_work/llvm-project/llvm-project/build/bin/FileCheck -match-full-lines -check-prefix X86-64-DECLSPEC-MS /home/gha/actions-runner/_work/llvm-project/llvm-project/clang/test/Preprocessor/init.c
# note: command had no output on stdout or stderr
# RUN: at line 1542
/home/gha/actions-runner/_work/llvm-project/llvm-project/build/bin/clang -cc1 -internal-isystem /home/gha/actions-runner/_work/llvm-project/llvm-project/build/lib/clang/24/include -nostdsysteminc -E -dM -ffreestanding -triple=sparc64-none-none < /dev/null | /home/gha/actions-runner/_work/llvm-project/llvm-project/build/bin/FileCheck -match-full-lines -check-prefix SPARCV9 /home/gha/actions-runner/_work/llvm-project/llvm-project/clang/test/Preprocessor/init.c
# executed command: /home/gha/actions-runner/_work/llvm-project/llvm-project/build/bin/clang -cc1 -internal-isystem /home/gha/actions-runner/_work/llvm-project/llvm-project/build/lib/clang/24/include -nostdsysteminc -E -dM -ffreestanding -triple=sparc64-none-none
# note: command had no output on stdout or stderr
# executed command: /home/gha/actions-runner/_work/llvm-project/llvm-project/build/bin/FileCheck -match-full-lines -check-prefix SPARCV9 /home/gha/actions-runner/_work/llvm-project/llvm-project/clang/test/Preprocessor/init.c
# note: command had no output on stdout or stderr
# RUN: at line 1555
/home/gha/actions-runner/_work/llvm-project/llvm-project/build/bin/clang -cc1 -internal-isystem /home/gha/actions-runner/_work/llvm-project/llvm-project/build/lib/clang/24/include -nostdsysteminc -E -dM -ffreestanding -triple=sparc64-none-openbsd < /dev/null | /home/gha/actions-runner/_work/llvm-project/llvm-project/build/bin/FileCheck -match-full-lines -check-prefix SPARC64-OBSD /home/gha/actions-runner/_work/llvm-project/llvm-project/clang/test/Preprocessor/init.c
# executed command: /home/gha/actions-runner/_work/llvm-project/llvm-project/build/bin/clang -cc1 -internal-isystem /home/gha/actions-runner/_work/llvm-project/llvm-project/build/lib/clang/24/include -nostdsysteminc -E -dM -ffreestanding -triple=sparc64-none-openbsd
# note: command had no output on stdout or stderr
# executed command: /home/gha/actions-runner/_work/llvm-project/llvm-project/build/bin/FileCheck -match-full-lines -check-prefix SPARC64-OBSD /home/gha/actions-runner/_work/llvm-project/llvm-project/clang/test/Preprocessor/init.c
# note: command had no output on stdout or stderr
# RUN: at line 1564
/home/gha/actions-runner/_work/llvm-project/llvm-project/build/bin/clang -cc1 -internal-isystem /home/gha/actions-runner/_work/llvm-project/llvm-project/build/lib/clang/24/include -nostdsysteminc -E -dM -ffreestanding -triple=x86_64-pc-kfreebsd-gnu < /dev/null | /home/gha/actions-runner/_work/llvm-project/llvm-project/build/bin/FileCheck -match-full-lines -check-prefix KFREEBSD-DEF /home/gha/actions-runner/_work/llvm-project/llvm-project/clang/test/Preprocessor/init.c
# executed command: /home/gha/actions-runner/_work/llvm-project/llvm-project/build/bin/clang -cc1 -internal-isystem /home/gha/actions-runner/_work/llvm-project/llvm-project/build/lib/clang/24/include -nostdsysteminc -E -dM -ffreestanding -triple=x86_64-pc-kfreebsd-gnu
# note: command had no output on stdout or stderr
# executed command: /home/gha/actions-runner/_work/llvm-project/llvm-project/build/bin/FileCheck -match-full-lines -check-prefix KFREEBSD-DEF /home/gha/actions-runner/_work/llvm-project/llvm-project/clang/test/Preprocessor/init.c
# note: command had no output on stdout or stderr
# RUN: at line 1568
/home/gha/actions-runner/_work/llvm-project/llvm-project/build/bin/clang -cc1 -internal-isystem /home/gha/actions-runner/_work/llvm-project/llvm-project/build/lib/clang/24/include -nostdsysteminc -E -dM -ffreestanding -triple=i686-pc-kfreebsd-gnu < /dev/null | /home/gha/actions-runner/_work/llvm-project/llvm-project/build/bin/FileCheck -match-full-lines -check-prefix KFREEBSDI686-DEF /home/gha/actions-runner/_work/llvm-project/llvm-project/clang/test/Preprocessor/init.c
# executed command: /home/gha/actions-runner/_work/llvm-project/llvm-project/build/bin/clang -cc1 -internal-isystem /home/gha/actions-runner/_work/llvm-project/llvm-project/build/lib/clang/24/include -nostdsysteminc -E -dM -ffreestanding -triple=i686-pc-kfreebsd-gnu
# note: command had no output on stdout or stderr
# executed command: /home/gha/actions-runner/_work/llvm-project/llvm-project/build/bin/FileCheck -match-full-lines -check-prefix KFREEBSDI686-DEF /home/gha/actions-runner/_work/llvm-project/llvm-project/clang/test/Preprocessor/init.c
# note: command had no output on stdout or stderr
# RUN: at line 1572
/home/gha/actions-runner/_work/llvm-project/llvm-project/build/bin/clang -cc1 -internal-isystem /home/gha/actions-runner/_work/llvm-project/llvm-project/build/lib/clang/24/include -nostdsysteminc -x c++ -triple i686-pc-linux-gnu -fobjc-runtime=gcc -E -dM < /dev/null | /home/gha/actions-runner/_work/llvm-project/llvm-project/build/bin/FileCheck -match-full-lines -check-prefix GNUSOURCE /home/gha/actions-runner/_work/llvm-project/llvm-project/clang/test/Preprocessor/init.c
# executed command: /home/gha/actions-runner/_work/llvm-project/llvm-project/build/bin/clang -cc1 -internal-isystem /home/gha/actions-runner/_work/llvm-project/llvm-project/build/lib/clang/24/include -nostdsysteminc -x c++ -triple i686-pc-linux-gnu -fobjc-runtime=gcc -E -dM
# note: command had no output on stdout or stderr
# executed command: /home/gha/actions-runner/_work/llvm-project/llvm-project/build/bin/FileCheck -match-full-lines -check-prefix GNUSOURCE /home/gha/actions-runner/_work/llvm-project/llvm-project/clang/test/Preprocessor/init.c
# note: command had no output on stdout or stderr
# RUN: at line 1573
/home/gha/actions-runner/_work/llvm-project/llvm-project/build/bin/clang -cc1 -internal-isystem /home/gha/actions-runner/_work/llvm-project/llvm-project/build/lib/clang/24/include -nostdsysteminc -x c++ -triple sparc-rtems-elf -E -dM < /dev/null | /home/gha/actions-runner/_work/llvm-project/llvm-project/build/bin/FileCheck -match-full-lines -check-prefix GNUSOURCE /home/gha/actions-runner/_work/llvm-project/llvm-project/clang/test/Preprocessor/init.c
# executed command: /home/gha/actions-runner/_work/llvm-project/llvm-project/build/bin/clang -cc1 -internal-isystem /home/gha/actions-runner/_work/llvm-project/llvm-project/build/lib/clang/24/include -nostdsysteminc -x c++ -triple sparc-rtems-elf -E -dM
# note: command had no output on stdout or stderr
# executed command: /home/gha/actions-runner/_work/llvm-project/llvm-project/build/bin/FileCheck -match-full-lines -check-prefix GNUSOURCE /home/gha/actions-runner/_work/llvm-project/llvm-project/clang/test/Preprocessor/init.c
# note: command had no output on stdout or stderr
# RUN: at line 1578
/home/gha/actions-runner/_work/llvm-project/llvm-project/build/bin/clang -cc1 -internal-isystem /home/gha/actions-runner/_work/llvm-project/llvm-project/build/lib/clang/24/include -nostdsysteminc -x objective-c -triple i386-unknown-freebsd -fobjc-runtime=gnustep-1.9 -E -dM < /dev/null | /home/gha/actions-runner/_work/llvm-project/llvm-project/build/bin/FileCheck -match-full-lines -check-prefix GNUSTEP1 /home/gha/actions-runner/_work/llvm-project/llvm-project/clang/test/Preprocessor/init.c
# executed command: /home/gha/actions-runner/_work/llvm-project/llvm-project/build/bin/clang -cc1 -internal-isystem /home/gha/actions-runner/_work/llvm-project/llvm-project/build/lib/clang/24/include -nostdsysteminc -x objective-c -triple i386-unknown-freebsd -fobjc-runtime=gnustep-1.9 -E -dM
# note: command had no output on stdout or stderr
# executed command: /home/gha/actions-runner/_work/llvm-project/llvm-project/build/bin/FileCheck -match-full-lines -check-prefix GNUSTEP1 /home/gha/actions-runner/_work/llvm-project/llvm-project/clang/test/Preprocessor/init.c
# note: command had no output on stdout or stderr
# RUN: at line 1580
/home/gha/actions-runner/_work/llvm-project/llvm-project/build/bin/clang -cc1 -internal-isystem /home/gha/actions-runner/_work/llvm-project/llvm-project/build/lib/clang/24/include -nostdsysteminc -x objective-c -triple i386-unknown-freebsd -fobjc-runtime=gnustep-2.5 -E -dM < /dev/null | /home/gha/actions-runner/_work/llvm-project/llvm-project/build/bin/FileCheck -match-full-lines -check-prefix GNUSTEP2 /home/gha/actions-runner/_work/llvm-project/llvm-project/clang/test/Preprocessor/init.c
# executed command: /home/gha/actions-runner/_work/llvm-project/llvm-project/build/bin/clang -cc1 -internal-isystem /home/gha/actions-runner/_work/llvm-project/llvm-project/build/lib/clang/24/include -nostdsysteminc -x objective-c -triple i386-unknown-freebsd -fobjc-runtime=gnustep-2.5 -E -dM
# note: command had no output on stdout or stderr
# executed command: /home/gha/actions-runner/_work/llvm-project/llvm-project/build/bin/FileCheck -match-full-lines -check-prefix GNUSTEP2 /home/gha/actions-runner/_work/llvm-project/llvm-project/clang/test/Preprocessor/init.c
# note: command had no output on stdout or stderr
# RUN: at line 1583
/home/gha/actions-runner/_work/llvm-project/llvm-project/build/bin/clang -cc1 -internal-isystem /home/gha/actions-runner/_work/llvm-project/llvm-project/build/lib/clang/24/include -nostdsysteminc -x c++ -fgnuc-version=4.2.1 -std=c++98 -fno-rtti -E -dM < /dev/null | /home/gha/actions-runner/_work/llvm-project/llvm-project/build/bin/FileCheck -match-full-lines -check-prefix NORTTI /home/gha/actions-runner/_work/llvm-project/llvm-project/clang/test/Preprocessor/init.c
# executed command: /home/gha/actions-runner/_work/llvm-project/llvm-project/build/bin/clang -cc1 -internal-isystem /home/gha/actions-runner/_work/llvm-project/llvm-project/build/lib/clang/24/include -nostdsysteminc -x c++ -fgnuc-version=4.2.1 -std=c++98 -fno-rtti -E -dM
# note: command had no output on stdout or stderr
# executed command: /home/gha/actions-runner/_work/llvm-project/llvm-project/build/bin/FileCheck -match-full-lines -check-prefix NORTTI /home/gha/actions-runner/_work/llvm-project/llvm-project/clang/test/Preprocessor/init.c
# note: command had no output on stdout or stderr
# RUN: at line 1588
/home/gha/actions-runner/_work/llvm-project/llvm-project/build/bin/clang -cc1 -internal-isystem /home/gha/actions-runner/_work/llvm-project/llvm-project/build/lib/clang/24/include -nostdsysteminc -triple arm-linux-androideabi -E -dM < /dev/null | /home/gha/actions-runner/_work/llvm-project/llvm-project/build/bin/FileCheck -match-full-lines -check-prefix ANDROID /home/gha/actions-runner/_work/llvm-project/llvm-project/clang/test/Preprocessor/init.c
# executed command: /home/gha/actions-runner/_work/llvm-project/llvm-project/build/bin/clang -cc1 -internal-isystem /home/gha/actions-runner/_work/llvm-project/llvm-project/build/lib/clang/24/include -nostdsysteminc -triple arm-linux-androideabi -E -dM
# note: command had no output on stdout or stderr
# executed command: /home/gha/actions-runner/_work/llvm-project/llvm-project/build/bin/FileCheck -match-full-lines -check-prefix ANDROID /home/gha/actions-runner/_work/llvm-project/llvm-project/clang/test/Preprocessor/init.c
# note: command had no output on stdout or stderr
# RUN: at line 1594
/home/gha/actions-runner/_work/llvm-project/llvm-project/build/bin/clang -cc1 -internal-isystem /home/gha/actions-runner/_work/llvm-project/llvm-project/build/lib/clang/24/include -nostdsysteminc -x c++ -triple i686-linux-android -E -dM < /dev/null | /home/gha/actions-runner/_work/llvm-project/llvm-project/build/bin/FileCheck -match-full-lines -check-prefix I386-ANDROID-CXX /home/gha/actions-runner/_work/llvm-project/llvm-project/clang/test/Preprocessor/init.c
# executed command: /home/gha/actions-runner/_work/llvm-project/llvm-project/build/bin/clang -cc1 -internal-isystem /home/gha/actions-runner/_work/llvm-project/llvm-project/build/lib/clang/24/include -nostdsysteminc -x c++ -triple i686-linux-android -E -dM
# note: command had no output on stdout or stderr
# executed command: /home/gha/actions-runner/_work/llvm-project/llvm-project/build/bin/FileCheck -match-full-lines -check-prefix I386-ANDROID-CXX /home/gha/actions-runner/_work/llvm-project/llvm-project/clang/test/Preprocessor/init.c
# note: command had no output on stdout or stderr
# RUN: at line 1597
/home/gha/actions-runner/_work/llvm-project/llvm-project/build/bin/clang -cc1 -internal-isystem /home/gha/actions-runner/_work/llvm-project/llvm-project/build/lib/clang/24/include -nostdsysteminc -x c++ -triple x86_64-linux-android -E -dM < /dev/null | /home/gha/actions-runner/_work/llvm-project/llvm-project/build/bin/FileCheck -match-full-lines -check-prefix X86_64-ANDROID-CXX /home/gha/actions-runner/_work/llvm-project/llvm-project/clang/test/Preprocessor/init.c
# executed command: /home/gha/actions-runner/_work/llvm-project/llvm-project/build/bin/clang -cc1 -internal-isystem /home/gha/actions-runner/_work/llvm-project/llvm-project/build/lib/clang/24/include -nostdsysteminc -x c++ -triple x86_64-linux-android -E -dM
# note: command had no output on stdout or stderr
# executed command: /home/gha/actions-runner/_work/llvm-project/llvm-project/build/bin/FileCheck -match-full-lines -check-prefix X86_64-ANDROID-CXX /home/gha/actions-runner/_work/llvm-project/llvm-project/clang/test/Preprocessor/init.c
# note: command had no output on stdout or stderr
# RUN: at line 1600
/home/gha/actions-runner/_work/llvm-project/llvm-project/build/bin/clang -cc1 -internal-isystem /home/gha/actions-runner/_work/llvm-project/llvm-project/build/lib/clang/24/include -nostdsysteminc -triple arm-linux-androideabi20 -E -dM < /dev/null | /home/gha/actions-runner/_work/llvm-project/llvm-project/build/bin/FileCheck -match-full-lines -check-prefix ANDROID20 /home/gha/actions-runner/_work/llvm-project/llvm-project/clang/test/Preprocessor/init.c
# executed command: /home/gha/actions-runner/_work/llvm-project/llvm-project/build/bin/clang -cc1 -internal-isystem /home/gha/actions-runner/_work/llvm-project/llvm-project/build/lib/clang/24/include -nostdsysteminc -triple arm-linux-androideabi20 -E -dM
# note: command had no output on stdout or stderr
# executed command: /home/gha/actions-runner/_work/llvm-project/llvm-project/build/bin/FileCheck -match-full-lines -check-prefix ANDROID20 /home/gha/actions-runner/_work/llvm-project/llvm-project/clang/test/Preprocessor/init.c
# note: command had no output on stdout or stderr
# RUN: at line 1606
/home/gha/actions-runner/_work/llvm-project/llvm-project/build/bin/clang -cc1 -internal-isystem /home/gha/actions-runner/_work/llvm-project/llvm-project/build/lib/clang/24/include -nostdsysteminc -triple lanai-unknown-unknown -E -dM < /dev/null | /home/gha/actions-runner/_work/llvm-project/llvm-project/build/bin/FileCheck -match-full-lines -check-prefix LANAI /home/gha/actions-runner/_work/llvm-project/llvm-project/clang/test/Preprocessor/init.c
# executed command: /home/gha/actions-runner/_work/llvm-project/llvm-project/build/bin/clang -cc1 -internal-isystem /home/gha/actions-runner/_work/llvm-project/llvm-project/build/lib/clang/24/include -nostdsysteminc -triple lanai-unknown-unknown -E -dM
# note: command had no output on stdout or stderr
# executed command: /home/gha/actions-runner/_work/llvm-project/llvm-project/build/bin/FileCheck -match-full-lines -check-prefix LANAI /home/gha/actions-runner/_work/llvm-project/llvm-project/clang/test/Preprocessor/init.c
# note: command had no output on stdout or stderr
# RUN: at line 1609
/home/gha/actions-runner/_work/llvm-project/llvm-project/build/bin/clang -cc1 -internal-isystem /home/gha/actions-runner/_work/llvm-project/llvm-project/build/lib/clang/24/include -nostdsysteminc -triple=aarch64-unknown-haiku -E -dM < /dev/null | /home/gha/actions-runner/_work/llvm-project/llvm-project/build/bin/FileCheck -match-full-lines -check-prefix HAIKU /home/gha/actions-runner/_work/llvm-project/llvm-project/clang/test/Preprocessor/init.c
# executed command: /home/gha/actions-runner/_work/llvm-project/llvm-project/build/bin/clang -cc1 -internal-isystem /home/gha/actions-runner/_work/llvm-project/llvm-project/build/lib/clang/24/include -nostdsysteminc -triple=aarch64-unknown-haiku -E -dM
# note: command had no output on stdout or stderr
# executed command: /home/gha/actions-runner/_work/llvm-project/llvm-project/build/bin/FileCheck -match-full-lines -check-prefix HAIKU /home/gha/actions-runner/_work/llvm-project/llvm-project/clang/test/Preprocessor/init.c
# note: command had no output on stdout or stderr
# RUN: at line 1610
/home/gha/actions-runner/_work/llvm-project/llvm-project/build/bin/clang -cc1 -internal-isystem /home/gha/actions-runner/_work/llvm-project/llvm-project/build/lib/clang/24/include -nostdsysteminc -triple=arm-unknown-haiku -E -dM < /dev/null | /home/gha/actions-runner/_work/llvm-project/llvm-project/build/bin/FileCheck -match-full-lines -check-prefix HAIKU /home/gha/actions-runner/_work/llvm-project/llvm-project/clang/test/Preprocessor/init.c
# executed command: /home/gha/actions-runner/_work/llvm-project/llvm-project/build/bin/clang -cc1 -internal-isystem /home/gha/actions-runner/_work/llvm-project/llvm-project/build/lib/clang/24/include -nostdsysteminc -triple=arm-unknown-haiku -E -dM
# note: command had no output on stdout or stderr
# executed command: /home/gha/actions-runner/_work/llvm-project/llvm-project/build/bin/FileCheck -match-full-lines -check-prefix HAIKU /home/gha/actions-runner/_work/llvm-project/llvm-project/clang/test/Preprocessor/init.c
# note: command had no output on stdout or stderr
# RUN: at line 1611
/home/gha/actions-runner/_work/llvm-project/llvm-project/build/bin/clang -cc1 -internal-isystem /home/gha/actions-runner/_work/llvm-project/llvm-project/build/lib/clang/24/include -nostdsysteminc -triple=riscv64-unknown-haiku -E -dM < /dev/null | /home/gha/actions-runner/_work/llvm-project/llvm-project/build/bin/FileCheck -match-full-lines -check-prefix HAIKU /home/gha/actions-runner/_work/llvm-project/llvm-project/clang/test/Preprocessor/init.c
# executed command: /home/gha/actions-runner/_work/llvm-project/llvm-project/build/bin/clang -cc1 -internal-isystem /home/gha/actions-runner/_work/llvm-project/llvm-project/build/lib/clang/24/include -nostdsysteminc -triple=riscv64-unknown-haiku -E -dM
# note: command had no output on stdout or stderr
# executed command: /home/gha/actions-runner/_work/llvm-project/llvm-project/build/bin/FileCheck -match-full-lines -check-prefix HAIKU /home/gha/actions-runner/_work/llvm-project/llvm-project/clang/test/Preprocessor/init.c
# note: command had no output on stdout or stderr
# RUN: at line 1612
/home/gha/actions-runner/_work/llvm-project/llvm-project/build/bin/clang -cc1 -internal-isystem /home/gha/actions-runner/_work/llvm-project/llvm-project/build/lib/clang/24/include -nostdsysteminc -triple=x86_64-unknown-haiku -E -dM < /dev/null | /home/gha/actions-runner/_work/llvm-project/llvm-project/build/bin/FileCheck -match-full-lines -check-prefix HAIKU /home/gha/actions-runner/_work/llvm-project/llvm-project/clang/test/Preprocessor/init.c
# executed command: /home/gha/actions-runner/_work/llvm-project/llvm-project/build/bin/clang -cc1 -internal-isystem /home/gha/actions-runner/_work/llvm-project/llvm-project/build/lib/clang/24/include -nostdsysteminc -triple=x86_64-unknown-haiku -E -dM
# note: command had no output on stdout or stderr
# executed command: /home/gha/actions-runner/_work/llvm-project/llvm-project/build/bin/FileCheck -match-full-lines -check-prefix HAIKU /home/gha/actions-runner/_work/llvm-project/llvm-project/clang/test/Preprocessor/init.c
# note: command had no output on stdout or stderr
# RUN: at line 1613
/home/gha/actions-runner/_work/llvm-project/llvm-project/build/bin/clang -cc1 -internal-isystem /home/gha/actions-runner/_work/llvm-project/llvm-project/build/lib/clang/24/include -nostdsysteminc -triple=i386-unknown-haiku -E -dM < /dev/null | /home/gha/actions-runner/_work/llvm-project/llvm-project/build/bin/FileCheck -match-full-lines -check-prefix HAIKU /home/gha/actions-runner/_work/llvm-project/llvm-project/clang/test/Preprocessor/init.c
# executed command: /home/gha/actions-runner/_work/llvm-project/llvm-project/build/bin/clang -cc1 -internal-isystem /home/gha/actions-runner/_work/llvm-project/llvm-project/build/lib/clang/24/include -nostdsysteminc -triple=i386-unknown-haiku -E -dM
# note: command had no output on stdout or stderr
# executed command: /home/gha/actions-runner/_work/llvm-project/llvm-project/build/bin/FileCheck -match-full-lines -check-prefix HAIKU /home/gha/actions-runner/_work/llvm-project/llvm-project/clang/test/Preprocessor/init.c
# note: command had no output on stdout or stderr
# RUN: at line 1616
/home/gha/actions-runner/_work/llvm-project/llvm-project/build/bin/clang -cc1 -internal-isystem /home/gha/actions-runner/_work/llvm-project/llvm-project/build/lib/clang/24/include -nostdsysteminc -E -dM -ffreestanding -triple=amd64-unknown-openbsd6.1 < /dev/null | /home/gha/actions-runner/_work/llvm-project/llvm-project/build/bin/FileCheck -match-full-lines -check-prefix OPENBSD /home/gha/actions-runner/_work/llvm-project/llvm-project/clang/test/Preprocessor/init.c
# executed command: /home/gha/actions-runner/_work/llvm-project/llvm-project/build/bin/clang -cc1 -internal-isystem /home/gha/actions-runner/_work/llvm-project/llvm-project/build/lib/clang/24/include -nostdsysteminc -E -dM -ffreestanding -triple=amd64-unknown-openbsd6.1
# note: command had no output on stdout or stderr
# executed command: /home/gha/actions-runner/_work/llvm-project/llvm-project/build/bin/FileCheck -match-full-lines -check-prefix OPENBSD /home/gha/actions-runner/_work/llvm-project/llvm-project/clang/test/Preprocessor/init.c
# note: command had no output on stdout or stderr
# RUN: at line 1617
/home/gha/actions-runner/_work/llvm-project/llvm-project/build/bin/clang -cc1 -internal-isystem /home/gha/actions-runner/_work/llvm-project/llvm-project/build/lib/clang/24/include -nostdsysteminc -E -dM -ffreestanding -triple=aarch64-unknown-openbsd6.1 < /dev/null | /home/gha/actions-runner/_work/llvm-project/llvm-project/build/bin/FileCheck -match-full-lines -check-prefix OPENBSD /home/gha/actions-runner/_work/llvm-project/llvm-project/clang/test/Preprocessor/init.c
# executed command: /home/gha/actions-runner/_work/llvm-project/llvm-project/build/bin/clang -cc1 -internal-isystem /home/gha/actions-runner/_work/llvm-project/llvm-project/build/lib/clang/24/include -nostdsysteminc -E -dM -ffreestanding -triple=aarch64-unknown-openbsd6.1
# note: command had no output on stdout or stderr
# executed command: /home/gha/actions-runner/_work/llvm-project/llvm-project/build/bin/FileCheck -match-full-lines -check-prefix OPENBSD /home/gha/actions-runner/_work/llvm-project/llvm-project/clang/test/Preprocessor/init.c
# note: command had no output on stdout or stderr
# RUN: at line 1618
/home/gha/actions-runner/_work/llvm-project/llvm-project/build/bin/clang -cc1 -internal-isystem /home/gha/actions-runner/_work/llvm-project/llvm-project/build/lib/clang/24/include -nostdsysteminc -E -dM -ffreestanding -triple=arm-unknown-openbsd6.1-gnueabi < /dev/null | /home/gha/actions-runner/_work/llvm-project/llvm-project/build/bin/FileCheck -match-full-lines -check-prefix OPENBSD /home/gha/actions-runner/_work/llvm-project/llvm-project/clang/test/Preprocessor/init.c
# executed command: /home/gha/actions-runner/_work/llvm-project/llvm-project/build/bin/clang -cc1 -internal-isystem /home/gha/actions-runner/_work/llvm-project/llvm-project/build/lib/clang/24/include -nostdsysteminc -E -dM -ffreestanding -triple=arm-unknown-openbsd6.1-gnueabi
# note: command had no output on stdout or stderr
# executed command: /home/gha/actions-runner/_work/llvm-project/llvm-project/build/bin/FileCheck -match-full-lines -check-prefix OPENBSD /home/gha/actions-runner/_work/llvm-project/llvm-project/clang/test/Preprocessor/init.c
# note: command had no output on stdout or stderr
# RUN: at line 1619
/home/gha/actions-runner/_work/llvm-project/llvm-project/build/bin/clang -cc1 -internal-isystem /home/gha/actions-runner/_work/llvm-project/llvm-project/build/lib/clang/24/include -nostdsysteminc -E -dM -ffreestanding -triple=i386-unknown-openbsd6.1 < /dev/null | /home/gha/actions-runner/_work/llvm-project/llvm-project/build/bin/FileCheck -match-full-lines -check-prefix OPENBSD /home/gha/actions-runner/_work/llvm-project/llvm-project/clang/test/Preprocessor/init.c
# executed command: /home/gha/actions-runner/_work/llvm-project/llvm-project/build/bin/clang -cc1 -internal-isystem /home/gha/actions-runner/_work/llvm-project/llvm-project/build/lib/clang/24/include -nostdsysteminc -E -dM -ffreestanding -triple=i386-unknown-openbsd6.1
# note: command had no output on stdout or stderr
# executed command: /home/gha/actions-runner/_work/llvm-project/llvm-project/build/bin/FileCheck -match-full-lines -check-prefix OPENBSD /home/gha/actions-runner/_work/llvm-project/llvm-project/clang/test/Preprocessor/init.c
# note: command had no output on stdout or stderr
# RUN: at line 1620
/home/gha/actions-runner/_work/llvm-project/llvm-project/build/bin/clang -cc1 -internal-isystem /home/gha/actions-runner/_work/llvm-project/llvm-project/build/lib/clang/24/include -nostdsysteminc -E -dM -ffreestanding -triple=powerpc-unknown-openbsd6.1 < /dev/null | /home/gha/actions-runner/_work/llvm-project/llvm-project/build/bin/FileCheck -match-full-lines -check-prefix OPENBSD /home/gha/actions-runner/_work/llvm-project/llvm-project/clang/test/Preprocessor/init.c
# executed command: /home/gha/actions-runner/_work/llvm-project/llvm-project/build/bin/clang -cc1 -internal-isystem /home/gha/actions-runner/_work/llvm-project/llvm-project/build/lib/clang/24/include -nostdsysteminc -E -dM -ffreestanding -triple=powerpc-unknown-openbsd6.1
# note: command had no output on stdout or stderr
# executed command: /home/gha/actions-runner/_work/llvm-project/llvm-project/build/bin/FileCheck -match-full-lines -check-prefix OPENBSD /home/gha/actions-runner/_work/llvm-project/llvm-project/clang/test/Preprocessor/init.c
# note: command had no output on stdout or stderr
# RUN: at line 1621
/home/gha/actions-runner/_work/llvm-project/llvm-project/build/bin/clang -cc1 -internal-isystem /home/gha/actions-runner/_work/llvm-project/llvm-project/build/lib/clang/24/include -nostdsysteminc -E -dM -ffreestanding -triple=powerpc64-unknown-openbsd6.1 < /dev/null | /home/gha/actions-runner/_work/llvm-project/llvm-project/build/bin/FileCheck -match-full-lines -check-prefix OPENBSD /home/gha/actions-runner/_work/llvm-project/llvm-project/clang/test/Preprocessor/init.c
# executed command: /home/gha/actions-runner/_work/llvm-project/llvm-project/build/bin/clang -cc1 -internal-isystem /home/gha/actions-runner/_work/llvm-project/llvm-project/build/lib/clang/24/include -nostdsysteminc -E -dM -ffreestanding -triple=powerpc64-unknown-openbsd6.1
# note: command had no output on stdout or stderr
# executed command: /home/gha/actions-runner/_work/llvm-project/llvm-project/build/bin/FileCheck -match-full-lines -check-prefix OPENBSD /home/gha/actions-runner/_work/llvm-project/llvm-project/clang/test/Preprocessor/init.c
# note: command had no output on stdout or stderr
# RUN: at line 1622
/home/gha/actions-runner/_work/llvm-project/llvm-project/build/bin/clang -cc1 -internal-isystem /home/gha/actions-runner/_work/llvm-project/llvm-project/build/lib/clang/24/include -nostdsysteminc -E -dM -ffreestanding -triple=powerpc64le-unknown-openbsd6.1 < /dev/null | /home/gha/actions-runner/_work/llvm-project/llvm-project/build/bin/FileCheck -match-full-lines -check-prefix OPENBSD /home/gha/actions-runner/_work/llvm-project/llvm-project/clang/test/Preprocessor/init.c
# executed command: /home/gha/actions-runner/_work/llvm-project/llvm-project/build/bin/clang -cc1 -internal-isystem /home/gha/actions-runner/_work/llvm-project/llvm-project/build/lib/clang/24/include -nostdsysteminc -E -dM -ffreestanding -triple=powerpc64le-unknown-openbsd6.1
# note: command had no output on stdout or stderr
# executed command: /home/gha/actions-runner/_work/llvm-project/llvm-project/build/bin/FileCheck -match-full-lines -check-prefix OPENBSD /home/gha/actions-runner/_work/llvm-project/llvm-project/clang/test/Preprocessor/init.c
# note: command had no output on stdout or stderr
# RUN: at line 1623
/home/gha/actions-runner/_work/llvm-project/llvm-project/build/bin/clang -cc1 -internal-isystem /home/gha/actions-runner/_work/llvm-project/llvm-project/build/lib/clang/24/include -nostdsysteminc -E -dM -ffreestanding -triple=mips64-unknown-openbsd6.1 < /dev/null | /home/gha/actions-runner/_work/llvm-project/llvm-project/build/bin/FileCheck -match-full-lines -check-prefix OPENBSD /home/gha/actions-runner/_work/llvm-project/llvm-project/clang/test/Preprocessor/init.c
# executed command: /home/gha/actions-runner/_work/llvm-project/llvm-project/build/bin/clang -cc1 -internal-isystem /home/gha/actions-runner/_work/llvm-project/llvm-project/build/lib/clang/24/include -nostdsysteminc -E -dM -ffreestanding -triple=mips64-unknown-openbsd6.1
# note: command had no output on stdout or stderr
# executed command: /home/gha/actions-runner/_work/llvm-project/llvm-project/build/bin/FileCheck -match-full-lines -check-prefix OPENBSD /home/gha/actions-runner/_work/llvm-project/llvm-project/clang/test/Preprocessor/init.c
# note: command had no output on stdout or stderr
# RUN: at line 1624
/home/gha/actions-runner/_work/llvm-project/llvm-project/build/bin/clang -cc1 -internal-isystem /home/gha/actions-runner/_work/llvm-project/llvm-project/build/lib/clang/24/include -nostdsysteminc -E -dM -ffreestanding -triple=mips64el-unknown-openbsd6.1 < /dev/null | /home/gha/actions-runner/_work/llvm-project/llvm-project/build/bin/FileCheck -match-full-lines -check-prefix OPENBSD /home/gha/actions-runner/_work/llvm-project/llvm-project/clang/test/Preprocessor/init.c
# executed command: /home/gha/actions-runner/_work/llvm-project/llvm-project/build/bin/clang -cc1 -internal-isystem /home/gha/actions-runner/_work/llvm-project/llvm-project/build/lib/clang/24/include -nostdsysteminc -E -dM -ffreestanding -triple=mips64el-unknown-openbsd6.1
# note: command had no output on stdout or stderr
# executed command: /home/gha/actions-runner/_work/llvm-project/llvm-project/build/bin/FileCheck -match-full-lines -check-prefix OPENBSD /home/gha/actions-runner/_work/llvm-project/llvm-project/clang/test/Preprocessor/init.c
# note: command had no output on stdout or stderr
# RUN: at line 1625
/home/gha/actions-runner/_work/llvm-project/llvm-project/build/bin/clang -cc1 -internal-isystem /home/gha/actions-runner/_work/llvm-project/llvm-project/build/lib/clang/24/include -nostdsysteminc -E -dM -ffreestanding -triple=sparc64-unknown-openbsd6.1 < /dev/null | /home/gha/actions-runner/_work/llvm-project/llvm-project/build/bin/FileCheck -match-full-lines -check-prefix OPENBSD /home/gha/actions-runner/_work/llvm-project/llvm-project/clang/test/Preprocessor/init.c
# executed command: /home/gha/actions-runner/_work/llvm-project/llvm-project/build/bin/clang -cc1 -internal-isystem /home/gha/actions-runner/_work/llvm-project/llvm-project/build/lib/clang/24/include -nostdsysteminc -E -dM -ffreestanding -triple=sparc64-unknown-openbsd6.1
# note: command had no output on stdout or stderr
# executed command: /home/gha/actions-runner/_work/llvm-project/llvm-project/build/bin/FileCheck -match-full-lines -check-prefix OPENBSD /home/gha/actions-runner/_work/llvm-project/llvm-project/clang/test/Preprocessor/init.c
# note: command had no output on stdout or stderr
# RUN: at line 1626
/home/gha/actions-runner/_work/llvm-project/llvm-project/build/bin/clang -cc1 -internal-isystem /home/gha/actions-runner/_work/llvm-project/llvm-project/build/lib/clang/24/include -nostdsysteminc -E -dM -ffreestanding -triple=riscv64-unknown-openbsd6.1 < /dev/null | /home/gha/actions-runner/_work/llvm-project/llvm-project/build/bin/FileCheck -match-full-lines -check-prefix OPENBSD /home/gha/actions-runner/_work/llvm-project/llvm-project/clang/test/Preprocessor/init.c
# executed command: /home/gha/actions-runner/_work/llvm-project/llvm-project/build/bin/clang -cc1 -internal-isystem /home/gha/actions-runner/_work/llvm-project/llvm-project/build/lib/clang/24/include -nostdsysteminc -E -dM -ffreestanding -triple=riscv64-unknown-openbsd6.1
# note: command had no output on stdout or stderr
# executed command: /home/gha/actions-runner/_work/llvm-project/llvm-project/build/bin/FileCheck -match-full-lines -check-prefix OPENBSD /home/gha/actions-runner/_work/llvm-project/llvm-project/clang/test/Preprocessor/init.c
# note: command had no output on stdout or stderr
# RUN: at line 1646
/home/gha/actions-runner/_work/llvm-project/llvm-project/build/bin/clang -cc1 -internal-isystem /home/gha/actions-runner/_work/llvm-project/llvm-project/build/lib/clang/24/include -nostdsysteminc -x c -std=c11 -E -dM -ffreestanding -triple=amd64-unknown-openbsd < /dev/null | /home/gha/actions-runner/_work/llvm-project/llvm-project/build/bin/FileCheck -match-full-lines -check-prefix OPENBSD-STDC /home/gha/actions-runner/_work/llvm-project/llvm-project/clang/test/Preprocessor/init.c
# executed command: /home/gha/actions-runner/_work/llvm-project/llvm-project/build/bin/clang -cc1 -internal-isystem /home/gha/actions-runner/_work/llvm-project/llvm-project/build/lib/clang/24/include -nostdsysteminc -x c -std=c11 -E -dM -ffreestanding -triple=amd64-unknown-openbsd
# note: command had no output on stdout or stderr
# executed command: /home/gha/actions-runner/_work/llvm-project/llvm-project/build/bin/FileCheck -match-full-lines -check-prefix OPENBSD-STDC /home/gha/actions-runner/_work/llvm-project/llvm-project/clang/test/Preprocessor/init.c
# note: command had no output on stdout or stderr
# RUN: at line 1647
/home/gha/actions-runner/_work/llvm-project/llvm-project/build/bin/clang -cc1 -internal-isystem /home/gha/actions-runner/_work/llvm-project/llvm-project/build/lib/clang/24/include -nostdsysteminc -x c -std=gnu11 -E -dM -ffreestanding -triple=amd64-unknown-openbsd < /dev/null | /home/gha/actions-runner/_work/llvm-project/llvm-project/build/bin/FileCheck -match-full-lines -check-prefix OPENBSD-STDC /home/gha/actions-runner/_work/llvm-project/llvm-project/clang/test/Preprocessor/init.c
# executed command: /home/gha/actions-runner/_work/llvm-project/llvm-project/build/bin/clang -cc1 -internal-isystem /home/gha/actions-runner/_work/llvm-project/llvm-project/build/lib/clang/24/include -nostdsysteminc -x c -std=gnu11 -E -dM -ffreestanding -triple=amd64-unknown-openbsd
# note: command had no output on stdout or stderr
# executed command: /home/gha/actions-runner/_work/llvm-project/llvm-project/build/bin/FileCheck -match-full-lines -check-prefix OPENBSD-STDC /home/gha/actions-runner/_work/llvm-project/llvm-project/clang/test/Preprocessor/init.c
# note: command had no output on stdout or stderr
# RUN: at line 1648
/home/gha/actions-runner/_work/llvm-project/llvm-project/build/bin/clang -cc1 -internal-isystem /home/gha/actions-runner/_work/llvm-project/llvm-project/build/lib/clang/24/include -nostdsysteminc -x c -std=c17 -E -dM -ffreestanding -triple=amd64-unknown-openbsd < /dev/null | /home/gha/actions-runner/_work/llvm-project/llvm-project/build/bin/FileCheck -match-full-lines -check-prefix OPENBSD-STDC /home/gha/actions-runner/_work/llvm-project/llvm-project/clang/test/Preprocessor/init.c
# executed command: /home/gha/actions-runner/_work/llvm-project/llvm-project/build/bin/clang -cc1 -internal-isystem /home/gha/actions-runner/_work/llvm-project/llvm-project/build/lib/clang/24/include -nostdsysteminc -x c -std=c17 -E -dM -ffreestanding -triple=amd64-unknown-openbsd
# note: command had no output on stdout or stderr
# executed command: /home/gha/actions-runner/_work/llvm-project/llvm-project/build/bin/FileCheck -match-full-lines -check-prefix OPENBSD-STDC /home/gha/actions-runner/_work/llvm-project/llvm-project/clang/test/Preprocessor/init.c
# note: command had no output on stdout or stderr
# RUN: at line 1651
/home/gha/actions-runner/_work/llvm-project/llvm-project/build/bin/clang -cc1 -internal-isystem /home/gha/actions-runner/_work/llvm-project/llvm-project/build/lib/clang/24/include -nostdsysteminc -x c -std=c99 -E -dM -ffreestanding -triple=amd64-unknown-openbsd < /dev/null | /home/gha/actions-runner/_work/llvm-project/llvm-project/build/bin/FileCheck -match-full-lines -check-prefix OPENBSD-STDC-N /home/gha/actions-runner/_work/llvm-project/llvm-project/clang/test/Preprocessor/init.c
# executed command: /home/gha/actions-runner/_work/llvm-project/llvm-project/build/bin/clang -cc1 -internal-isystem /home/gha/actions-runner/_work/llvm-project/llvm-project/build/lib/clang/24/include -nostdsysteminc -x c -std=c99 -E -dM -ffreestanding -triple=amd64-unknown-openbsd
# note: command had no output on stdout or stderr
# executed command: /home/gha/actions-runner/_work/llvm-project/llvm-project/build/bin/FileCheck -match-full-lines -check-prefix OPENBSD-STDC-N /home/gha/actions-runner/_work/llvm-project/llvm-project/clang/test/Preprocessor/init.c
# note: command had no output on stdout or stderr
# RUN: at line 1654
/home/gha/actions-runner/_work/llvm-project/llvm-project/build/bin/clang -cc1 -internal-isystem /home/gha/actions-runner/_work/llvm-project/llvm-project/build/lib/clang/24/include -nostdsysteminc -x c -std=c11 -E -dM -ffreestanding -triple=x86_64-unknown-dragonfly < /dev/null | /home/gha/actions-runner/_work/llvm-project/llvm-project/build/bin/FileCheck -match-full-lines -check-prefix DRAGONFLY-STDC /home/gha/actions-runner/_work/llvm-project/llvm-project/clang/test/Preprocessor/init.c
# executed command: /home/gha/actions-runner/_work/llvm-project/llvm-project/build/bin/clang -cc1 -internal-isystem /home/gha/actions-runner/_work/llvm-project/llvm-project/build/lib/clang/24/include -nostdsysteminc -x c -std=c11 -E -dM -ffreestanding -triple=x86_64-unknown-dragonfly
# note: command had no output on stdout or stderr
# executed command: /home/gha/actions-runner/_work/llvm-project/llvm-project/build/bin/FileCheck -match-full-lines -check-prefix DRAGONFLY-STDC /home/gha/actions-runner/_work/llvm-project/llvm-project/clang/test/Preprocessor/init.c
# note: command had no output on stdout or stderr
# RUN: at line 1655
/home/gha/actions-runner/_work/llvm-project/llvm-project/build/bin/clang -cc1 -internal-isystem /home/gha/actions-runner/_work/llvm-project/llvm-project/build/lib/clang/24/include -nostdsysteminc -x c -std=gnu11 -E -dM -ffreestanding -triple=x86_64-unknown-dragonfly < /dev/null | /home/gha/actions-runner/_work/llvm-project/llvm-project/build/bin/FileCheck -match-full-lines -check-prefix DRAGONFLY-STDC /home/gha/actions-runner/_work/llvm-project/llvm-project/clang/test/Preprocessor/init.c
# executed command: /home/gha/actions-runner/_work/llvm-project/llvm-project/build/bin/clang -cc1 -internal-isystem /home/gha/actions-runner/_work/llvm-project/llvm-project/build/lib/clang/24/include -nostdsysteminc -x c -std=gnu11 -E -dM -ffreestanding -triple=x86_64-unknown-dragonfly
# note: command had no output on stdout or stderr
# executed command: /home/gha/actions-runner/_work/llvm-project/llvm-project/build/bin/FileCheck -match-full-lines -check-prefix DRAGONFLY-STDC /home/gha/actions-runner/_work/llvm-project/llvm-project/clang/test/Preprocessor/init.c
# note: command had no output on stdout or stderr
# RUN: at line 1656
/home/gha/actions-runner/_work/llvm-project/llvm-project/build/bin/clang -cc1 -internal-isystem /home/gha/actions-runner/_work/llvm-project/llvm-project/build/lib/clang/24/include -nostdsysteminc -x c -std=c17 -E -dM -ffreestanding -triple=x86_64-unknown-dragonfly < /dev/null | /home/gha/actions-runner/_work/llvm-project/llvm-project/build/bin/FileCheck -match-full-lines -check-prefix DRAGONFLY-STDC /home/gha/actions-runner/_work/llvm-project/llvm-project/clang/test/Preprocessor/init.c
# executed command: /home/gha/actions-runner/_work/llvm-project/llvm-project/build/bin/clang -cc1 -internal-isystem /home/gha/actions-runner/_work/llvm-project/llvm-project/build/lib/clang/24/include -nostdsysteminc -x c -std=c17 -E -dM -ffreestanding -triple=x86_64-unknown-dragonfly
# note: command had no output on stdout or stderr
# executed command: /home/gha/actions-runner/_work/llvm-project/llvm-project/build/bin/FileCheck -match-full-lines -check-prefix DRAGONFLY-STDC /home/gha/actions-runner/_work/llvm-project/llvm-project/clang/test/Preprocessor/init.c
# note: command had no output on stdout or stderr
# RUN: at line 1659
/home/gha/actions-runner/_work/llvm-project/llvm-project/build/bin/clang -cc1 -internal-isystem /home/gha/actions-runner/_work/llvm-project/llvm-project/build/lib/clang/24/include -nostdsysteminc -x c -std=c99 -E -dM -ffreestanding -triple=x86_64-unknown-dragonfly < /dev/null | /home/gha/actions-runner/_work/llvm-project/llvm-project/build/bin/FileCheck -match-full-lines -check-prefix DRAGONFLY-STDC-N /home/gha/actions-runner/_work/llvm-project/llvm-project/clang/test/Preprocessor/init.c
# executed command: /home/gha/actions-runner/_work/llvm-project/llvm-project/build/bin/clang -cc1 -internal-isystem /home/gha/actions-runner/_work/llvm-project/llvm-project/build/lib/clang/24/include -nostdsysteminc -x c -std=c99 -E -dM -ffreestanding -triple=x86_64-unknown-dragonfly
# note: command had no output on stdout or stderr
# executed command: /home/gha/actions-runner/_work/llvm-project/llvm-project/build/bin/FileCheck -match-full-lines -check-prefix DRAGONFLY-STDC-N /home/gha/actions-runner/_work/llvm-project/llvm-project/clang/test/Preprocessor/init.c
# note: command had no output on stdout or stderr
# RUN: at line 1662
/home/gha/actions-runner/_work/llvm-project/llvm-project/build/bin/clang -cc1 -internal-isystem /home/gha/actions-runner/_work/llvm-project/llvm-project/build/lib/clang/24/include -nostdsysteminc -triple=aarch64-unknown-managarm-mlibc -E -dM < /dev/null | /home/gha/actions-runner/_work/llvm-project/llvm-project/build/bin/FileCheck -match-full-lines -check-prefix MANAGARM /home/gha/actions-runner/_work/llvm-project/llvm-project/clang/test/Preprocessor/init.c
# executed command: /home/gha/actions-runner/_work/llvm-project/llvm-project/build/bin/clang -cc1 -internal-isystem /home/gha/actions-runner/_work/llvm-project/llvm-project/build/lib/clang/24/include -nostdsysteminc -triple=aarch64-unknown-managarm-mlibc -E -dM
# note: command had no output on stdout or stderr
# executed command: /home/gha/actions-runner/_work/llvm-project/llvm-project/build/bin/FileCheck -match-full-lines -check-prefix MANAGARM /home/gha/actions-runner/_work/llvm-project/llvm-project/clang/test/Preprocessor/init.c
# note: command had no output on stdout or stderr
# RUN: at line 1663
/home/gha/actions-runner/_work/llvm-project/llvm-project/build/bin/clang -cc1 -internal-isystem /home/gha/actions-runner/_work/llvm-project/llvm-project/build/lib/clang/24/include -nostdsysteminc -triple=riscv64-unknown-managarm-mlibc -E -dM < /dev/null | /home/gha/actions-runner/_work/llvm-project/llvm-project/build/bin/FileCheck -match-full-lines -check-prefix MANAGARM /home/gha/actions-runner/_work/llvm-project/llvm-project/clang/test/Preprocessor/init.c
# executed command: /home/gha/actions-runner/_work/llvm-project/llvm-project/build/bin/clang -cc1 -internal-isystem /home/gha/actions-runner/_work/llvm-project/llvm-project/build/lib/clang/24/include -nostdsysteminc -triple=riscv64-unknown-managarm-mlibc -E -dM
# note: command had no output on stdout or stderr
# executed command: /home/gha/actions-runner/_work/llvm-project/llvm-project/build/bin/FileCheck -match-full-lines -check-prefix MANAGARM /home/gha/actions-runner/_work/llvm-project/llvm-project/clang/test/Preprocessor/init.c
# note: command had no output on stdout or stderr
# RUN: at line 1664
/home/gha/actions-runner/_work/llvm-project/llvm-project/build/bin/clang -cc1 -internal-isystem /home/gha/actions-runner/_work/llvm-project/llvm-project/build/lib/clang/24/include -nostdsysteminc -triple=x86_64-unknown-managarm-mlibc -E -dM < /dev/null | /home/gha/actions-runner/_work/llvm-project/llvm-project/build/bin/FileCheck -match-full-lines -check-prefix MANAGARM /home/gha/actions-runner/_work/llvm-project/llvm-project/clang/test/Preprocessor/init.c
# executed command: /home/gha/actions-runner/_work/llvm-project/llvm-project/build/bin/clang -cc1 -internal-isystem /home/gha/actions-runner/_work/llvm-project/llvm-project/build/lib/clang/24/include -nostdsysteminc -triple=x86_64-unknown-managarm-mlibc -E -dM
# note: command had no output on stdout or stderr
# executed command: /home/gha/actions-runner/_work/llvm-project/llvm-project/build/bin/FileCheck -match-full-lines -check-prefix MANAGARM /home/gha/actions-runner/_work/llvm-project/llvm-project/clang/test/Preprocessor/init.c
# note: command had no output on stdout or stderr
# RUN: at line 1668
/home/gha/actions-runner/_work/llvm-project/llvm-project/build/bin/clang -cc1 -internal-isystem /home/gha/actions-runner/_work/llvm-project/llvm-project/build/lib/clang/24/include -nostdsysteminc -E -dM -ffreestanding -triple=xcore-none-none < /dev/null | /home/gha/actions-runner/_work/llvm-project/llvm-project/build/bin/FileCheck -match-full-lines -check-prefix XCORE /home/gha/actions-runner/_work/llvm-project/llvm-project/clang/test/Preprocessor/init.c
# executed command: /home/gha/actions-runner/_work/llvm-project/llvm-project/build/bin/clang -cc1 -internal-isystem /home/gha/actions-runner/_work/llvm-project/llvm-project/build/lib/clang/24/include -nostdsysteminc -E -dM -ffreestanding -triple=xcore-none-none
# note: command had no output on stdout or stderr
# executed command: /home/gha/actions-runner/_work/llvm-project/llvm-project/build/bin/FileCheck -match-full-lines -check-prefix XCORE /home/gha/actions-runner/_work/llvm-project/llvm-project/clang/test/Preprocessor/init.c
# note: command had no output on stdout or stderr
# RUN: at line 1674
/home/gha/actions-runner/_work/llvm-project/llvm-project/build/bin/clang -cc1 -internal-isystem /home/gha/actions-runner/_work/llvm-project/llvm-project/build/lib/clang/24/include -nostdsysteminc -E -dM -ffreestanding -fgnuc-version=4.2.1 -triple=wasm32-unknown-unknown < /dev/null | /home/gha/actions-runner/_work/llvm-project/llvm-project/build/bin/FileCheck -match-full-lines -check-prefixes=WEBASSEMBLY,WEBASSEMBLY32 /home/gha/actions-runner/_work/llvm-project/llvm-project/clang/test/Preprocessor/init.c
# executed command: /home/gha/actions-runner/_work/llvm-project/llvm-project/build/bin/clang -cc1 -internal-isystem /home/gha/actions-runner/_work/llvm-project/llvm-project/build/lib/clang/24/include -nostdsysteminc -E -dM -ffreestanding -fgnuc-version=4.2.1 -triple=wasm32-unknown-unknown
# note: command had no output on stdout or stderr
# executed command: /home/gha/actions-runner/_work/llvm-project/llvm-project/build/bin/FileCheck -match-full-lines -check-prefixes=WEBASSEMBLY,WEBASSEMBLY32 /home/gha/actions-runner/_work/llvm-project/llvm-project/clang/test/Preprocessor/init.c
# note: command had no output on stdout or stderr
# RUN: at line 1677
/home/gha/actions-runner/_work/llvm-project/llvm-project/build/bin/clang -cc1 -internal-isystem /home/gha/actions-runner/_work/llvm-project/llvm-project/build/lib/clang/24/include -nostdsysteminc -E -dM -ffreestanding -fgnuc-version=4.2.1 -triple=wasm64-unknown-unknown < /dev/null | /home/gha/actions-runner/_work/llvm-project/llvm-project/build/bin/FileCheck -match-full-lines -check-prefixes=WEBASSEMBLY,WEBASSEMBLY64 /home/gha/actions-runner/_work/llvm-project/llvm-project/clang/test/Preprocessor/init.c
# executed command: /home/gha/actions-runner/_work/llvm-project/llvm-project/build/bin/clang -cc1 -internal-isystem /home/gha/actions-runner/_work/llvm-project/llvm-project/build/lib/clang/24/include -nostdsysteminc -E -dM -ffreestanding -fgnuc-version=4.2.1 -triple=wasm64-unknown-unknown
# note: command had no output on stdout or stderr
# executed command: /home/gha/actions-runner/_work/llvm-project/llvm-project/build/bin/FileCheck -match-full-lines -check-prefixes=WEBASSEMBLY,WEBASSEMBLY64 /home/gha/actions-runner/_work/llvm-project/llvm-project/clang/test/Preprocessor/init.c
# note: command had no output on stdout or stderr
# RUN: at line 1680
/home/gha/actions-runner/_work/llvm-project/llvm-project/build/bin/clang -cc1 -internal-isystem /home/gha/actions-runner/_work/llvm-project/llvm-project/build/lib/clang/24/include -nostdsysteminc -E -dM -ffreestanding -fgnuc-version=4.2.1 -triple=wasm32-emscripten < /dev/null | /home/gha/actions-runner/_work/llvm-project/llvm-project/build/bin/FileCheck -match-full-lines -check-prefixes=WEBASSEMBLY,WEBASSEMBLY32,EMSCRIPTEN /home/gha/actions-runner/_work/llvm-project/llvm-project/clang/test/Preprocessor/init.c
# executed command: /home/gha/actions-runner/_work/llvm-project/llvm-project/build/bin/clang -cc1 -internal-isystem /home/gha/actions-runner/_work/llvm-project/llvm-project/build/lib/clang/24/include -nostdsysteminc -E -dM -ffreestanding -fgnuc-version=4.2.1 -triple=wasm32-emscripten
# note: command had no output on stdout or stderr
# executed command: /home/gha/actions-runner/_work/llvm-project/llvm-project/build/bin/FileCheck -match-full-lines -check-prefixes=WEBASSEMBLY,WEBASSEMBLY32,EMSCRIPTEN /home/gha/actions-runner/_work/llvm-project/llvm-project/clang/test/Preprocessor/init.c
# note: command had no output on stdout or stderr
# RUN: at line 1683
/home/gha/actions-runner/_work/llvm-project/llvm-project/build/bin/clang -cc1 -internal-isystem /home/gha/actions-runner/_work/llvm-project/llvm-project/build/lib/clang/24/include -nostdsysteminc -E -dM -ffreestanding -fgnuc-version=4.2.1 -triple=wasm32-emscripten -pthread -target-feature +atomics -target-feature +bulk-memory < /dev/null | /home/gha/actions-runner/_work/llvm-project/llvm-project/build/bin/FileCheck -match-full-lines -check-prefixes=WEBASSEMBLY,WEBASSEMBLY32,EMSCRIPTEN,EMSCRIPTEN-THREADS /home/gha/actions-runner/_work/llvm-project/llvm-project/clang/test/Preprocessor/init.c
# executed command: /home/gha/actions-runner/_work/llvm-project/llvm-project/build/bin/clang -cc1 -internal-isystem /home/gha/actions-runner/_work/llvm-project/llvm-project/build/lib/clang/24/include -nostdsysteminc -E -dM -ffreestanding -fgnuc-version=4.2.1 -triple=wasm32-emscripten -pthread -target-feature +atomics -target-feature +bulk-memory
# note: command had no output on stdout or stderr
# executed command: /home/gha/actions-runner/_work/llvm-project/llvm-project/build/bin/FileCheck -match-full-lines -check-prefixes=WEBASSEMBLY,WEBASSEMBLY32,EMSCRIPTEN,EMSCRIPTEN-THREADS /home/gha/actions-runner/_work/llvm-project/llvm-project/clang/test/Preprocessor/init.c
# note: command had no output on stdout or stderr
# RUN: at line 1686
/home/gha/actions-runner/_work/llvm-project/llvm-project/build/bin/clang -cc1 -internal-isystem /home/gha/actions-runner/_work/llvm-project/llvm-project/build/lib/clang/24/include -nostdsysteminc -E -dM -ffreestanding -fgnuc-version=4.2.1 -triple=wasm64-emscripten < /dev/null | /home/gha/actions-runner/_work/llvm-project/llvm-project/build/bin/FileCheck -match-full-lines -check-prefixes=WEBASSEMBLY,WEBASSEMBLY64,EMSCRIPTEN /home/gha/actions-runner/_work/llvm-project/llvm-project/clang/test/Preprocessor/init.c
# executed command: /home/gha/actions-runner/_work/llvm-project/llvm-project/build/bin/clang -cc1 -internal-isystem /home/gha/actions-runner/_work/llvm-project/llvm-project/build/lib/clang/24/include -nostdsysteminc -E -dM -ffreestanding -fgnuc-version=4.2.1 -triple=wasm64-emscripten
# note: command had no output on stdout or stderr
# executed command: /home/gha/actions-runner/_work/llvm-project/llvm-project/build/bin/FileCheck -match-full-lines -check-prefixes=WEBASSEMBLY,WEBASSEMBLY64,EMSCRIPTEN /home/gha/actions-runner/_work/llvm-project/llvm-project/clang/test/Preprocessor/init.c
# note: command had no output on stdout or stderr
# RUN: at line 1689
/home/gha/actions-runner/_work/llvm-project/llvm-project/build/bin/clang -cc1 -internal-isystem /home/gha/actions-runner/_work/llvm-project/llvm-project/build/lib/clang/24/include -nostdsysteminc -E -dM -ffreestanding -fgnuc-version=4.2.1 -triple=wasm32-wasip1 < /dev/null | /home/gha/actions-runner/_work/llvm-project/llvm-project/build/bin/FileCheck -match-full-lines -check-prefixes=WEBASSEMBLY,WEBASSEMBLY32,WASI,WASIP1 /home/gha/actions-runner/_work/llvm-project/llvm-project/clang/test/Preprocessor/init.c
# executed command: /home/gha/actions-runner/_work/llvm-project/llvm-project/build/bin/clang -cc1 -internal-isystem /home/gha/actions-runner/_work/llvm-project/llvm-project/build/lib/clang/24/include -nostdsysteminc -E -dM -ffreestanding -fgnuc-version=4.2.1 -triple=wasm32-wasip1
# note: command had no output on stdout or stderr
# executed command: /home/gha/actions-runner/_work/llvm-project/llvm-project/build/bin/FileCheck -match-full-lines -check-prefixes=WEBASSEMBLY,WEBASSEMBLY32,WASI,WASIP1 /home/gha/actions-runner/_work/llvm-project/llvm-project/clang/test/Preprocessor/init.c
# note: command had no output on stdout or stderr
# RUN: at line 1692
/home/gha/actions-runner/_work/llvm-project/llvm-project/build/bin/clang -cc1 -internal-isystem /home/gha/actions-runner/_work/llvm-project/llvm-project/build/lib/clang/24/include -nostdsysteminc -E -dM -ffreestanding -fgnuc-version=4.2.1 -triple=wasm64-wasip1 < /dev/null | /home/gha/actions-runner/_work/llvm-project/llvm-project/build/bin/FileCheck -match-full-lines -check-prefixes=WEBASSEMBLY,WEBASSEMBLY64,WASI,WASIP1 /home/gha/actions-runner/_work/llvm-project/llvm-project/clang/test/Preprocessor/init.c
# executed command: /home/gha/actions-runner/_work/llvm-project/llvm-project/build/bin/clang -cc1 -internal-isystem /home/gha/actions-runner/_work/llvm-project/llvm-project/build/lib/clang/24/include -nostdsysteminc -E -dM -ffreestanding -fgnuc-version=4.2.1 -triple=wasm64-wasip1
# note: command had no output on stdout or stderr
# executed command: /home/gha/actions-runner/_work/llvm-project/llvm-project/build/bin/FileCheck -match-full-lines -check-prefixes=WEBASSEMBLY,WEBASSEMBLY64,WASI,WASIP1 /home/gha/actions-runner/_work/llvm-project/llvm-project/clang/test/Preprocessor/init.c
# note: command had no output on stdout or stderr
# RUN: at line 1695
/home/gha/actions-runner/_work/llvm-project/llvm-project/build/bin/clang -cc1 -internal-isystem /home/gha/actions-runner/_work/llvm-project/llvm-project/build/lib/clang/24/include -nostdsysteminc -E -dM -ffreestanding -fgnuc-version=4.2.1 -triple=wasm32-wasip2 < /dev/null | /home/gha/actions-runner/_work/llvm-project/llvm-project/build/bin/FileCheck -match-full-lines -check-prefixes=WEBASSEMBLY,WEBASSEMBLY32,WASI,WASIP2 /home/gha/actions-runner/_work/llvm-project/llvm-project/clang/test/Preprocessor/init.c
# executed command: /home/gha/actions-runner/_work/llvm-project/llvm-project/build/bin/clang -cc1 -internal-isystem /home/gha/actions-runner/_work/llvm-project/llvm-project/build/lib/clang/24/include -nostdsysteminc -E -dM -ffreestanding -fgnuc-version=4.2.1 -triple=wasm32-wasip2
# note: command had no output on stdout or stderr
# executed command: /home/gha/actions-runner/_work/llvm-project/llvm-project/build/bin/FileCheck -match-full-lines -check-prefixes=WEBASSEMBLY,WEBASSEMBLY32,WASI,WASIP2 /home/gha/actions-runner/_work/llvm-project/llvm-project/clang/test/Preprocessor/init.c
# note: command had no output on stdout or stderr
# RUN: at line 1698
/home/gha/actions-runner/_work/llvm-project/llvm-project/build/bin/clang -cc1 -internal-isystem /home/gha/actions-runner/_work/llvm-project/llvm-project/build/lib/clang/24/include -nostdsysteminc -E -dM -ffreestanding -fgnuc-version=4.2.1 -triple=wasm64-wasip2 < /dev/null | /home/gha/actions-runner/_work/llvm-project/llvm-project/build/bin/FileCheck -match-full-lines -check-prefixes=WEBASSEMBLY,WEBASSEMBLY64,WASI,WASIP2 /home/gha/actions-runner/_work/llvm-project/llvm-project/clang/test/Preprocessor/init.c
# executed command: /home/gha/actions-runner/_work/llvm-project/llvm-project/build/bin/clang -cc1 -internal-isystem /home/gha/actions-runner/_work/llvm-project/llvm-project/build/lib/clang/24/include -nostdsysteminc -E -dM -ffreestanding -fgnuc-version=4.2.1 -triple=wasm64-wasip2
# note: command had no output on stdout or stderr
# executed command: /home/gha/actions-runner/_work/llvm-project/llvm-project/build/bin/FileCheck -match-full-lines -check-prefixes=WEBASSEMBLY,WEBASSEMBLY64,WASI,WASIP2 /home/gha/actions-runner/_work/llvm-project/llvm-project/clang/test/Preprocessor/init.c
# note: command had no output on stdout or stderr
# RUN: at line 1701
/home/gha/actions-runner/_work/llvm-project/llvm-project/build/bin/clang -cc1 -internal-isystem /home/gha/actions-runner/_work/llvm-project/llvm-project/build/lib/clang/24/include -nostdsysteminc -E -dM -ffreestanding -fgnuc-version=4.2.1 -triple=wasm32-wasip3 < /dev/null | /home/gha/actions-runner/_work/llvm-project/llvm-project/build/bin/FileCheck -match-full-lines -check-prefixes=WEBASSEMBLY,WEBASSEMBLY32,WASI,WASIP3 /home/gha/actions-runner/_work/llvm-project/llvm-project/clang/test/Preprocessor/init.c
# executed command: /home/gha/actions-runner/_work/llvm-project/llvm-project/build/bin/clang -cc1 -internal-isystem /home/gha/actions-runner/_work/llvm-project/llvm-project/build/lib/clang/24/include -nostdsysteminc -E -dM -ffreestanding -fgnuc-version=4.2.1 -triple=wasm32-wasip3
# note: command had no output on stdout or stderr
# executed command: /home/gha/actions-runner/_work/llvm-project/llvm-project/build/bin/FileCheck -match-full-lines -check-prefixes=WEBASSEMBLY,WEBASSEMBLY32,WASI,WASIP3 /home/gha/actions-runner/_work/llvm-project/llvm-project/clang/test/Preprocessor/init.c
# note: command had no output on stdout or stderr
# RUN: at line 1704
/home/gha/actions-runner/_work/llvm-project/llvm-project/build/bin/clang -cc1 -internal-isystem /home/gha/actions-runner/_work/llvm-project/llvm-project/build/lib/clang/24/include -nostdsysteminc -E -dM -ffreestanding -fgnuc-version=4.2.1 -triple=wasm64-wasip3 < /dev/null | /home/gha/actions-runner/_work/llvm-project/llvm-project/build/bin/FileCheck -match-full-lines -check-prefixes=WEBASSEMBLY,WEBASSEMBLY64,WASI,WASIP3 /home/gha/actions-runner/_work/llvm-project/llvm-project/clang/test/Preprocessor/init.c
# executed command: /home/gha/actions-runner/_work/llvm-project/llvm-project/build/bin/clang -cc1 -internal-isystem /home/gha/actions-runner/_work/llvm-project/llvm-project/build/lib/clang/24/include -nostdsysteminc -E -dM -ffreestanding -fgnuc-version=4.2.1 -triple=wasm64-wasip3
# note: command had no output on stdout or stderr
# executed command: /home/gha/actions-runner/_work/llvm-project/llvm-project/build/bin/FileCheck -match-full-lines -check-prefixes=WEBASSEMBLY,WEBASSEMBLY64,WASI,WASIP3 /home/gha/actions-runner/_work/llvm-project/llvm-project/clang/test/Preprocessor/init.c
# note: command had no output on stdout or stderr
# RUN: at line 1707
/home/gha/actions-runner/_work/llvm-project/llvm-project/build/bin/clang -cc1 -internal-isystem /home/gha/actions-runner/_work/llvm-project/llvm-project/build/lib/clang/24/include -nostdsysteminc -E -dM -ffreestanding -fgnuc-version=4.2.1 -triple=wasm32-unknown-unknown -x c++ < /dev/null | /home/gha/actions-runner/_work/llvm-project/llvm-project/build/bin/FileCheck -match-full-lines -check-prefixes=WEBASSEMBLY-CXX /home/gha/actions-runner/_work/llvm-project/llvm-project/clang/test/Preprocessor/init.c
# executed command: /home/gha/actions-runner/_work/llvm-project/llvm-project/build/bin/clang -cc1 -internal-isystem /home/gha/actions-runner/_work/llvm-project/llvm-project/build/lib/clang/24/include -nostdsysteminc -E -dM -ffreestanding -fgnuc-version=4.2.1 -triple=wasm32-unknown-unknown -x c++
# note: command had no output on stdout or stderr
# executed command: /home/gha/actions-runner/_work/llvm-project/llvm-project/build/bin/FileCheck -match-full-lines -check-prefixes=WEBASSEMBLY-CXX /home/gha/actions-runner/_work/llvm-project/llvm-project/clang/test/Preprocessor/init.c
# note: command had no output on stdout or stderr
# RUN: at line 1710
/home/gha/actions-runner/_work/llvm-project/llvm-project/build/bin/clang -cc1 -internal-isystem /home/gha/actions-runner/_work/llvm-project/llvm-project/build/lib/clang/24/include -nostdsysteminc -E -dM -ffreestanding -fgnuc-version=4.2.1 -triple=wasm32-unknown-unknown -x c++ -pthread -target-feature +atomics -target-feature +bulk-memory < /dev/null | /home/gha/actions-runner/_work/llvm-project/llvm-project/build/bin/FileCheck -match-full-lines -check-prefixes=WEBASSEMBLY-CXX-ATOMICS /home/gha/actions-runner/_work/llvm-project/llvm-project/clang/test/Preprocessor/init.c
# executed command: /home/gha/actions-runner/_work/llvm-project/llvm-project/build/bin/clang -cc1 -internal-isystem /home/gha/actions-runner/_work/llvm-project/llvm-project/build/lib/clang/24/include -nostdsysteminc -E -dM -ffreestanding -fgnuc-version=4.2.1 -triple=wasm32-unknown-unknown -x c++ -pthread -target-feature +atomics -target-feature +bulk-memory
# note: command had no output on stdout or stderr
# executed command: /home/gha/actions-runner/_work/llvm-project/llvm-project/build/bin/FileCheck -match-full-lines -check-prefixes=WEBASSEMBLY-CXX-ATOMICS /home/gha/actions-runner/_work/llvm-project/llvm-project/clang/test/Preprocessor/init.c
# note: command had no output on stdout or stderr
# RUN: at line 2158
/home/gha/actions-runner/_work/llvm-project/llvm-project/build/bin/clang -cc1 -internal-isystem /home/gha/actions-runner/_work/llvm-project/llvm-project/build/lib/clang/24/include -nostdsysteminc -E -dM -ffreestanding -fgnuc-version=4.2.1 -triple=avr < /dev/null | /home/gha/actions-runner/_work/llvm-project/llvm-project/build/bin/FileCheck -match-full-lines -check-prefix=AVR /home/gha/actions-runner/_work/llvm-project/llvm-project/clang/test/Preprocessor/init.c
# executed command: /home/gha/actions-runner/_work/llvm-project/llvm-project/build/bin/clang -cc1 -internal-isystem /home/gha/actions-runner/_work/llvm-project/llvm-project/build/lib/clang/24/include -nostdsysteminc -E -dM -ffreestanding -fgnuc-version=4.2.1 -triple=avr
# note: command had no output on stdout or stderr
# executed command: /home/gha/actions-runner/_work/llvm-project/llvm-project/build/bin/FileCheck -match-full-lines -check-prefix=AVR /home/gha/actions-runner/_work/llvm-project/llvm-project/clang/test/Preprocessor/init.c
# note: command had no output on stdout or stderr
# RUN: at line 2344
/home/gha/actions-runner/_work/llvm-project/llvm-project/build/bin/clang -cc1 -internal-isystem /home/gha/actions-runner/_work/llvm-project/llvm-project/build/lib/clang/24/include -nostdsysteminc -E -dM -ffreestanding -triple i686-windows-msvc -fms-compatibility -x c++ < /dev/null | /home/gha/actions-runner/_work/llvm-project/llvm-project/build/bin/FileCheck -match-full-lines -check-prefix MSVC-X32 /home/gha/actions-runner/_work/llvm-project/llvm-project/clang/test/Preprocessor/init.c
# executed command: /home/gha/actions-runner/_work/llvm-project/llvm-project/build/bin/clang -cc1 -internal-isystem /home/gha/actions-runner/_work/llvm-project/llvm-project/build/lib/clang/24/include -nostdsysteminc -E -dM -ffreestanding -triple i686-windows-msvc -fms-compatibility -x c++
# note: command had no output on stdout or stderr
# executed command: /home/gha/actions-runner/_work/llvm-project/llvm-project/build/bin/FileCheck -match-full-lines -check-prefix MSVC-X32 /home/gha/actions-runner/_work/llvm-project/llvm-project/clang/test/Preprocessor/init.c
# note: command had no output on stdout or stderr
# RUN: at line 2348
/home/gha/actions-runner/_work/llvm-project/llvm-project/build/bin/clang -cc1 -internal-isystem /home/gha/actions-runner/_work/llvm-project/llvm-project/build/lib/clang/24/include -nostdsysteminc -E -dM -ffreestanding -triple x86_64-windows-msvc -fms-compatibility -x c++ < /dev/null | /home/gha/actions-runner/_work/llvm-project/llvm-project/build/bin/FileCheck -match-full-lines -check-prefix MSVC-X64 /home/gha/actions-runner/_work/llvm-project/llvm-project/clang/test/Preprocessor/init.c
# executed command: /home/gha/actions-runner/_work/llvm-project/llvm-project/build/bin/clang -cc1 -internal-isystem /home/gha/actions-runner/_work/llvm-project/llvm-project/build/lib/clang/24/include -nostdsysteminc -E -dM -ffreestanding -triple x86_64-windows-msvc -fms-compatibility -x c++
# note: command had no output on stdout or stderr
# executed command: /home/gha/actions-runner/_work/llvm-project/llvm-project/build/bin/FileCheck -match-full-lines -check-prefix MSVC-X64 /home/gha/actions-runner/_work/llvm-project/llvm-project/clang/test/Preprocessor/init.c
# note: command had no output on stdout or stderr
# RUN: at line 2378
/home/gha/actions-runner/_work/llvm-project/llvm-project/build/bin/clang -cc1 -internal-isystem /home/gha/actions-runner/_work/llvm-project/llvm-project/build/lib/clang/24/include -nostdsysteminc -E -dM -ffreestanding -fgnuc-version=4.2.1 -triple=aarch64-apple-ios9 < /dev/null | /home/gha/actions-runner/_work/llvm-project/llvm-project/build/bin/FileCheck -check-prefix=DARWIN /home/gha/actions-runner/_work/llvm-project/llvm-project/clang/test/Preprocessor/init.c
# executed command: /home/gha/actions-runner/_work/llvm-project/llvm-project/build/bin/clang -cc1 -internal-isystem /home/gha/actions-runner/_work/llvm-project/llvm-project/build/lib/clang/24/include -nostdsysteminc -E -dM -ffreestanding -fgnuc-version=4.2.1 -triple=aarch64-apple-ios9
# note: command had no output on stdout or stderr
# executed command: /home/gha/actions-runner/_work/llvm-project/llvm-project/build/bin/FileCheck -check-prefix=DARWIN /home/gha/actions-runner/_work/llvm-project/llvm-project/clang/test/Preprocessor/init.c
# note: command had no output on stdout or stderr
# RUN: at line 2381
/home/gha/actions-runner/_work/llvm-project/llvm-project/build/bin/clang -cc1 -internal-isystem /home/gha/actions-runner/_work/llvm-project/llvm-project/build/lib/clang/24/include -nostdsysteminc -E -dM -ffreestanding -fgnuc-version=4.2.1 -triple=aarch64-apple-macosx10.12 < /dev/null | /home/gha/actions-runner/_work/llvm-project/llvm-project/build/bin/FileCheck -check-prefix=DARWIN /home/gha/actions-runner/_work/llvm-project/llvm-project/clang/test/Preprocessor/init.c
# executed command: /home/gha/actions-runner/_work/llvm-project/llvm-project/build/bin/clang -cc1 -internal-isystem /home/gha/actions-runner/_work/llvm-project/llvm-project/build/lib/clang/24/include -nostdsysteminc -E -dM -ffreestanding -fgnuc-version=4.2.1 -triple=aarch64-apple-macosx10.12
# note: command had no output on stdout or stderr
# executed command: /home/gha/actions-runner/_work/llvm-project/llvm-project/build/bin/FileCheck -check-prefix=DARWIN /home/gha/actions-runner/_work/llvm-project/llvm-project/clang/test/Preprocessor/init.c
# note: command had no output on stdout or stderr
# RUN: at line 2388
/home/gha/actions-runner/_work/llvm-project/llvm-project/build/bin/clang -cc1 -internal-isystem /home/gha/actions-runner/_work/llvm-project/llvm-project/build/lib/clang/24/include -nostdsysteminc -triple i386-apple-macosx -ffreestanding -dM -E /dev/null -o - | /home/gha/actions-runner/_work/llvm-project/llvm-project/build/bin/FileCheck -match-full-lines -check-prefix MACOS-32 /home/gha/actions-runner/_work/llvm-project/llvm-project/clang/test/Preprocessor/init.c
# executed command: /home/gha/actions-runner/_work/llvm-project/llvm-project/build/bin/clang -cc1 -internal-isystem /home/gha/actions-runner/_work/llvm-project/llvm-project/build/lib/clang/24/include -nostdsysteminc -triple i386-apple-macosx -ffreestanding -dM -E /dev/null -o -
# note: command had no output on stdout or stderr
# executed command: /home/gha/actions-runner/_work/llvm-project/llvm-project/build/bin/FileCheck -match-full-lines -check-prefix MACOS-32 /home/gha/actions-runner/_work/llvm-project/llvm-project/clang/test/Preprocessor/init.c
# note: command had no output on stdout or stderr
# RUN: at line 2389
/home/gha/actions-runner/_work/llvm-project/llvm-project/build/bin/clang -cc1 -internal-isystem /home/gha/actions-runner/_work/llvm-project/llvm-project/build/lib/clang/24/include -nostdsysteminc -triple x86_64-apple-macosx -ffreestanding -dM -E /dev/null -o - | /home/gha/actions-runner/_work/llvm-project/llvm-project/build/bin/FileCheck -match-full-lines -check-prefix MACOS-64 /home/gha/actions-runner/_work/llvm-project/llvm-project/clang/test/Preprocessor/init.c
# executed command: /home/gha/actions-runner/_work/llvm-project/llvm-project/build/bin/clang -cc1 -internal-isystem /home/gha/actions-runner/_work/llvm-project/llvm-project/build/lib/clang/24/include -nostdsysteminc -triple x86_64-apple-macosx -ffreestanding -dM -E /dev/null -o -
# note: command had no output on stdout or stderr
# executed command: /home/gha/actions-runner/_work/llvm-project/llvm-project/build/bin/FileCheck -match-full-lines -check-prefix MACOS-64 /home/gha/actions-runner/_work/llvm-project/llvm-project/clang/test/Preprocessor/init.c
# note: command had no output on stdout or stderr
# RUN: at line 2399
/home/gha/actions-runner/_work/llvm-project/llvm-project/build/bin/clang -cc1 -internal-isystem /home/gha/actions-runner/_work/llvm-project/llvm-project/build/lib/clang/24/include -nostdsysteminc -triple i386-apple-ios-simulator -ffreestanding -dM -E /dev/null -o - | /home/gha/actions-runner/_work/llvm-project/llvm-project/build/bin/FileCheck -match-full-lines -check-prefix IOS-32 /home/gha/actions-runner/_work/llvm-project/llvm-project/clang/test/Preprocessor/init.c
# executed command: /home/gha/actions-runner/_work/llvm-project/llvm-project/build/bin/clang -cc1 -internal-isystem /home/gha/actions-runner/_work/llvm-project/llvm-project/build/lib/clang/24/include -nostdsysteminc -triple i386-apple-ios-simulator -ffreestanding -dM -E /dev/null -o -
# note: command had no output on stdout or stderr
# executed command: /home/gha/actions-runner/_work/llvm-project/llvm-project/build/bin/FileCheck -match-full-lines -check-prefix IOS-32 /home/gha/actions-runner/_work/llvm-project/llvm-project/clang/test/Preprocessor/init.c
# note: command had no output on stdout or stderr
# RUN: at line 2400
/home/gha/actions-runner/_work/llvm-project/llvm-project/build/bin/clang -cc1 -internal-isystem /home/gha/actions-runner/_work/llvm-project/llvm-project/build/lib/clang/24/include -nostdsysteminc -triple armv7-apple-ios -ffreestanding -dM -E /dev/null -o - | /home/gha/actions-runner/_work/llvm-project/llvm-project/build/bin/FileCheck -match-full-lines -check-prefix IOS-32 /home/gha/actions-runner/_work/llvm-project/llvm-project/clang/test/Preprocessor/init.c
# executed command: /home/gha/actions-runner/_work/llvm-project/llvm-project/build/bin/clang -cc1 -internal-isystem /home/gha/actions-runner/_work/llvm-project/llvm-project/build/lib/clang/24/include -nostdsysteminc -triple armv7-apple-ios -ffreestanding -dM -E /dev/null -o -
# note: command had no output on stdout or stderr
# executed command: /home/gha/actions-runner/_work/llvm-project/llvm-project/build/bin/FileCheck -match-full-lines -check-prefix IOS-32 /home/gha/actions-runner/_work/llvm-project/llvm-project/clang/test/Preprocessor/init.c
# note: command had no output on stdout or stderr
# RUN: at line 2401
/home/gha/actions-runner/_work/llvm-project/llvm-project/build/bin/clang -cc1 -internal-isystem /home/gha/actions-runner/_work/llvm-project/llvm-project/build/lib/clang/24/include -nostdsysteminc -triple x86_64-apple-ios-simulator -ffreestanding -dM -E /dev/null -o - | /home/gha/actions-runner/_work/llvm-project/llvm-project/build/bin/FileCheck -match-full-lines -check-prefix IOS-64 /home/gha/actions-runner/_work/llvm-project/llvm-project/clang/test/Preprocessor/init.c
# executed command: /home/gha/actions-runner/_work/llvm-project/llvm-project/build/bin/clang -cc1 -internal-isystem /home/gha/actions-runner/_work/llvm-project/llvm-project/build/lib/clang/24/include -nostdsysteminc -triple x86_64-apple-ios-simulator -ffreestanding -dM -E /dev/null -o -
# note: command had no output on stdout or stderr
# executed command: /home/gha/actions-runner/_work/llvm-project/llvm-project/build/bin/FileCheck -match-full-lines -check-prefix IOS-64 /home/gha/actions-runner/_work/llvm-project/llvm-project/clang/test/Preprocessor/init.c
# note: command had no output on stdout or stderr
# RUN: at line 2402
/home/gha/actions-runner/_work/llvm-project/llvm-project/build/bin/clang -cc1 -internal-isystem /home/gha/actions-runner/_work/llvm-project/llvm-project/build/lib/clang/24/include -nostdsysteminc -triple arm64-apple-ios -ffreestanding -dM -E /dev/null -o - | /home/gha/actions-runner/_work/llvm-project/llvm-project/build/bin/FileCheck -match-full-lines -check-prefix IOS-64 /home/gha/actions-runner/_work/llvm-project/llvm-project/clang/test/Preprocessor/init.c
# executed command: /home/gha/actions-runner/_work/llvm-project/llvm-project/build/bin/clang -cc1 -internal-isystem /home/gha/actions-runner/_work/llvm-project/llvm-project/build/lib/clang/24/include -nostdsysteminc -triple arm64-apple-ios -ffreestanding -dM -E /dev/null -o -
# note: command had no output on stdout or stderr
# executed command: /home/gha/actions-runner/_work/llvm-project/llvm-project/build/bin/FileCheck -match-full-lines -check-prefix IOS-64 /home/gha/actions-runner/_work/llvm-project/llvm-project/clang/test/Preprocessor/init.c
# note: command had no output on stdout or stderr
# RUN: at line 2412
/home/gha/actions-runner/_work/llvm-project/llvm-project/build/bin/clang -cc1 -internal-isystem /home/gha/actions-runner/_work/llvm-project/llvm-project/build/lib/clang/24/include -nostdsysteminc -triple i386-apple-tvos-simulator -ffreestanding -dM -E /dev/null -o - | /home/gha/actions-runner/_work/llvm-project/llvm-project/build/bin/FileCheck -match-full-lines -check-prefix TVOS-32 /home/gha/actions-runner/_work/llvm-project/llvm-project/clang/test/Preprocessor/init.c
# executed command: /home/gha/actions-runner/_work/llvm-project/llvm-project/build/bin/clang -cc1 -internal-isystem /home/gha/actions-runner/_work/llvm-project/llvm-project/build/lib/clang/24/include -nostdsysteminc -triple i386-apple-tvos-simulator -ffreestanding -dM -E /dev/null -o -
# note: command had no output on stdout or stderr
# executed command: /home/gha/actions-runner/_work/llvm-project/llvm-project/build/bin/FileCheck -match-full-lines -check-prefix TVOS-32 /home/gha/actions-runner/_work/llvm-project/llvm-project/clang/test/Preprocessor/init.c
# note: command had no output on stdout or stderr
# RUN: at line 2413
/home/gha/actions-runner/_work/llvm-project/llvm-project/build/bin/clang -cc1 -internal-isystem /home/gha/actions-runner/_work/llvm-project/llvm-project/build/lib/clang/24/include -nostdsysteminc -triple armv7-apple-tvos -ffreestanding -dM -E /dev/null -o - | /home/gha/actions-runner/_work/llvm-project/llvm-project/build/bin/FileCheck -match-full-lines -check-prefix TVOS-32 /home/gha/actions-runner/_work/llvm-project/llvm-project/clang/test/Preprocessor/init.c
# executed command: /home/gha/actions-runner/_work/llvm-project/llvm-project/build/bin/clang -cc1 -internal-isystem /home/gha/actions-runner/_work/llvm-project/llvm-project/build/lib/clang/24/include -nostdsysteminc -triple armv7-apple-tvos -ffreestanding -dM -E /dev/null -o -
# note: command had no output on stdout or stderr
# executed command: /home/gha/actions-runner/_work/llvm-project/llvm-project/build/bin/FileCheck -match-full-lines -check-prefix TVOS-32 /home/gha/actions-runner/_work/llvm-project/llvm-project/clang/test/Preprocessor/init.c
# note: command had no output on stdout or stderr
# RUN: at line 2414
/home/gha/actions-runner/_work/llvm-project/llvm-project/build/bin/clang -cc1 -internal-isystem /home/gha/actions-runner/_work/llvm-project/llvm-project/build/lib/clang/24/include -nostdsysteminc -triple x86_64-apple-tvos-simulator -ffreestanding -dM -E /dev/null -o - | /home/gha/actions-runner/_work/llvm-project/llvm-project/build/bin/FileCheck -match-full-lines -check-prefix TVOS-64 /home/gha/actions-runner/_work/llvm-project/llvm-project/clang/test/Preprocessor/init.c
# executed command: /home/gha/actions-runner/_work/llvm-project/llvm-project/build/bin/clang -cc1 -internal-isystem /home/gha/actions-runner/_work/llvm-project/llvm-project/build/lib/clang/24/include -nostdsysteminc -triple x86_64-apple-tvos-simulator -ffreestanding -dM -E /dev/null -o -
# note: command had no output on stdout or stderr
# executed command: /home/gha/actions-runner/_work/llvm-project/llvm-project/build/bin/FileCheck -match-full-lines -check-prefix TVOS-64 /home/gha/actions-runner/_work/llvm-project/llvm-project/clang/test/Preprocessor/init.c
# note: command had no output on stdout or stderr
# RUN: at line 2415
/home/gha/actions-runner/_work/llvm-project/llvm-project/build/bin/clang -cc1 -internal-isystem /home/gha/actions-runner/_work/llvm-project/llvm-project/build/lib/clang/24/include -nostdsysteminc -triple arm64-apple-tvos -ffreestanding -dM -E /dev/null -o - | /home/gha/actions-runner/_work/llvm-project/llvm-project/build/bin/FileCheck -match-full-lines -check-prefix TVOS-64 /home/gha/actions-runner/_work/llvm-project/llvm-project/clang/test/Preprocessor/init.c
# executed command: /home/gha/actions-runner/_work/llvm-project/llvm-project/build/bin/clang -cc1 -internal-isystem /home/gha/actions-runner/_work/llvm-project/llvm-project/build/lib/clang/24/include -nostdsysteminc -triple arm64-apple-tvos -ffreestanding -dM -E /dev/null -o -
# note: command had no output on stdout or stderr
# executed command: /home/gha/actions-runner/_work/llvm-project/llvm-project/build/bin/FileCheck -match-full-lines -check-prefix TVOS-64 /home/gha/actions-runner/_work/llvm-project/llvm-project/clang/test/Preprocessor/init.c
# note: command had no output on stdout or stderr
# RUN: at line 2425
/home/gha/actions-runner/_work/llvm-project/llvm-project/build/bin/clang -cc1 -internal-isystem /home/gha/actions-runner/_work/llvm-project/llvm-project/build/lib/clang/24/include -nostdsysteminc -triple i386-apple-watchos-simulator -ffreestanding -dM -E /dev/null -o - | /home/gha/actions-runner/_work/llvm-project/llvm-project/build/bin/FileCheck -match-full-lines -check-prefix WATCHOS-32 /home/gha/actions-runner/_work/llvm-project/llvm-project/clang/test/Preprocessor/init.c
# executed command: /home/gha/actions-runner/_work/llvm-project/llvm-project/build/bin/clang -cc1 -internal-isystem /home/gha/actions-runner/_work/llvm-project/llvm-project/build/lib/clang/24/include -nostdsysteminc -triple i386-apple-watchos-simulator -ffreestanding -dM -E /dev/null -o -
# note: command had no output on stdout or stderr
# executed command: /home/gha/actions-runner/_work/llvm-project/llvm-project/build/bin/FileCheck -match-full-lines -check-prefix WATCHOS-32 /home/gha/actions-runner/_work/llvm-project/llvm-project/clang/test/Preprocessor/init.c
# note: command had no output on stdout or stderr
# RUN: at line 2426
/home/gha/actions-runner/_work/llvm-project/llvm-project/build/bin/clang -cc1 -internal-isystem /home/gha/actions-runner/_work/llvm-project/llvm-project/build/lib/clang/24/include -nostdsysteminc -triple armv7k-apple-watchos -ffreestanding -dM -E /dev/null -o - | /home/gha/actions-runner/_work/llvm-project/llvm-project/build/bin/FileCheck -match-full-lines -check-prefix WATCHOS-64 /home/gha/actions-runner/_work/llvm-project/llvm-project/clang/test/Preprocessor/init.c
# executed command: /home/gha/actions-runner/_work/llvm-project/llvm-project/build/bin/clang -cc1 -internal-isystem /home/gha/actions-runner/_work/llvm-project/llvm-project/build/lib/clang/24/include -nostdsysteminc -triple armv7k-apple-watchos -ffreestanding -dM -E /dev/null -o -
# note: command had no output on stdout or stderr
# executed command: /home/gha/actions-runner/_work/llvm-project/llvm-project/build/bin/FileCheck -match-full-lines -check-prefix WATCHOS-64 /home/gha/actions-runner/_work/llvm-project/llvm-project/clang/test/Preprocessor/init.c
# note: command had no output on stdout or stderr
# RUN: at line 2427
/home/gha/actions-runner/_work/llvm-project/llvm-project/build/bin/clang -cc1 -internal-isystem /home/gha/actions-runner/_work/llvm-project/llvm-project/build/lib/clang/24/include -nostdsysteminc -triple x86_64-apple-watchos-simulator -ffreestanding -dM -E /dev/null -o - | /home/gha/actions-runner/_work/llvm-project/llvm-project/build/bin/FileCheck -match-full-lines -check-prefix WATCHOS-64 /home/gha/actions-runner/_work/llvm-project/llvm-project/clang/test/Preprocessor/init.c
# executed command: /home/gha/actions-runner/_work/llvm-project/llvm-project/build/bin/clang -cc1 -internal-isystem /home/gha/actions-runner/_work/llvm-project/llvm-project/build/lib/clang/24/include -nostdsysteminc -triple x86_64-apple-watchos-simulator -ffreestanding -dM -E /dev/null -o -
# note: command had no output on stdout or stderr
# executed command: /home/gha/actions-runner/_work/llvm-project/llvm-project/build/bin/FileCheck -match-full-lines -check-prefix WATCHOS-64 /home/gha/actions-runner/_work/llvm-project/llvm-project/clang/test/Preprocessor/init.c
# note: command had no output on stdout or stderr
# RUN: at line 2428
/home/gha/actions-runner/_work/llvm-project/llvm-project/build/bin/clang -cc1 -internal-isystem /home/gha/actions-runner/_work/llvm-project/llvm-project/build/lib/clang/24/include -nostdsysteminc -triple arm64-apple-watchos -ffreestanding -dM -E /dev/null -o - | /home/gha/actions-runner/_work/llvm-project/llvm-project/build/bin/FileCheck -match-full-lines -check-prefix WATCHOS-64 /home/gha/actions-runner/_work/llvm-project/llvm-project/clang/test/Preprocessor/init.c
# executed command: /home/gha/actions-runner/_work/llvm-project/llvm-project/build/bin/clang -cc1 -internal-isystem /home/gha/actions-runner/_work/llvm-project/llvm-project/build/lib/clang/24/include -nostdsysteminc -triple arm64-apple-watchos -ffreestanding -dM -E /dev/null -o -
# note: command had no output on stdout or stderr
# executed command: /home/gha/actions-runner/_work/llvm-project/llvm-project/build/bin/FileCheck -match-full-lines -check-prefix WATCHOS-64 /home/gha/actions-runner/_work/llvm-project/llvm-project/clang/test/Preprocessor/init.c
# note: command had no output on stdout or stderr
# RUN: at line 2438
/home/gha/actions-runner/_work/llvm-project/llvm-project/build/bin/clang -cc1 -internal-isystem /home/gha/actions-runner/_work/llvm-project/llvm-project/build/lib/clang/24/include -nostdsysteminc -triple armv7-apple-none-macho -ffreestanding -dM -E /dev/null -o - | /home/gha/actions-runner/_work/llvm-project/llvm-project/build/bin/FileCheck -match-full-lines -check-prefix ARM-DARWIN-BAREMETAL-32 /home/gha/actions-runner/_work/llvm-project/llvm-project/clang/test/Preprocessor/init.c
# executed command: /home/gha/actions-runner/_work/llvm-project/llvm-project/build/bin/clang -cc1 -internal-isystem /home/gha/actions-runner/_work/llvm-project/llvm-project/build/lib/clang/24/include -nostdsysteminc -triple armv7-apple-none-macho -ffreestanding -dM -E /dev/null -o -
# note: command had no output on stdout or stderr
# executed command: /home/gha/actions-runner/_work/llvm-project/llvm-project/build/bin/FileCheck -match-full-lines -check-prefix ARM-DARWIN-BAREMETAL-32 /home/gha/actions-runner/_work/llvm-project/llvm-project/clang/test/Preprocessor/init.c
# note: command had no output on stdout or stderr
# RUN: at line 2439
/home/gha/actions-runner/_work/llvm-project/llvm-project/build/bin/clang -cc1 -internal-isystem /home/gha/actions-runner/_work/llvm-project/llvm-project/build/lib/clang/24/include -nostdsysteminc -triple arm64-apple-none-macho -ffreestanding -dM -E /dev/null -o - | /home/gha/actions-runner/_work/llvm-project/llvm-project/build/bin/FileCheck -match-full-lines -check-prefix ARM-DARWIN-BAREMETAL-64 /home/gha/actions-runner/_work/llvm-project/llvm-project/clang/test/Preprocessor/init.c
# executed command: /home/gha/actions-runner/_work/llvm-project/llvm-project/build/bin/clang -cc1 -internal-isystem /home/gha/actions-runner/_work/llvm-project/llvm-project/build/lib/clang/24/include -nostdsysteminc -triple arm64-apple-none-macho -ffreestanding -dM -E /dev/null -o -
# note: command had no output on stdout or stderr
# executed command: /home/gha/actions-runner/_work/llvm-project/llvm-project/build/bin/FileCheck -match-full-lines -check-prefix ARM-DARWIN-BAREMETAL-64 /home/gha/actions-runner/_work/llvm-project/llvm-project/clang/test/Preprocessor/init.c
# note: command had no output on stdout or stderr
# RUN: at line 2451
/home/gha/actions-runner/_work/llvm-project/llvm-project/build/bin/clang -cc1 -internal-isystem /home/gha/actions-runner/_work/llvm-project/llvm-project/build/lib/clang/24/include -nostdsysteminc -E -dM -ffreestanding -fgnuc-version=4.2.1 -triple=riscv32 < /dev/null | /home/gha/actions-runner/_work/llvm-project/llvm-project/build/bin/FileCheck -match-full-lines -check-prefix=RISCV32 /home/gha/actions-runner/_work/llvm-project/llvm-project/clang/test/Preprocessor/init.c
# executed command: /home/gha/actions-runner/_work/llvm-project/llvm-project/build/bin/clang -cc1 -internal-isystem /home/gha/actions-runner/_work/llvm-project/llvm-project/build/lib/clang/24/include -nostdsysteminc -E -dM -ffreestanding -fgnuc-version=4.2.1 -triple=riscv32
# note: command had no output on stdout or stderr
# executed command: /home/gha/actions-runner/_work/llvm-project/llvm-project/build/bin/FileCheck -match-full-lines -check-prefix=RISCV32 /home/gha/actions-runner/_work/llvm-project/llvm-project/clang/test/Preprocessor/init.c
# note: command had no output on stdout or stderr
# RUN: at line 2453
/home/gha/actions-runner/_work/llvm-project/llvm-project/build/bin/clang -cc1 -internal-isystem /home/gha/actions-runner/_work/llvm-project/llvm-project/build/lib/clang/24/include -nostdsysteminc -E -dM -ffreestanding -fgnuc-version=4.2.1 -triple=riscv32-unknown-linux < /dev/null | /home/gha/actions-runner/_work/llvm-project/llvm-project/build/bin/FileCheck -match-full-lines -check-prefixes=RISCV32,RISCV32-LINUX /home/gha/actions-runner/_work/llvm-project/llvm-project/clang/test/Preprocessor/init.c
# executed command: /home/gha/actions-runner/_work/llvm-project/llvm-project/build/bin/clang -cc1 -internal-isystem /home/gha/actions-runner/_work/llvm-project/llvm-project/build/lib/clang/24/include -nostdsysteminc -E -dM -ffreestanding -fgnuc-version=4.2.1 -triple=riscv32-unknown-linux
# note: command had no output on stdout or stderr
# executed command: /home/gha/actions-runner/_work/llvm-project/llvm-project/build/bin/FileCheck -match-full-lines -check-prefixes=RISCV32,RISCV32-LINUX /home/gha/actions-runner/_work/llvm-project/llvm-project/clang/test/Preprocessor/init.c
# .---command stderr------------
# | /home/gha/actions-runner/_work/llvm-project/llvm-project/clang/test/Preprocessor/init.c:2665:19: error: RISCV32-LINUX: expected string not found in input
# | // RISCV32-LINUX: #define __gnu_linux__ 1
# | ^
# | <stdin>:366:26: note: scanning from here
# | #define __WINT_WIDTH__ 32
# | ^
# | <stdin>:375:1: note: possible intended match here
# | #define __linux__ 1
# | ^
# |
# | Input file: <stdin>
# | Check file: /home/gha/actions-runner/_work/llvm-project/llvm-project/clang/test/Preprocessor/init.c
# |
# | -dump-input=help explains the following input dump.
# |
# | Input was:
# | <<<<<<
# | .
# | .
# | .
# | 361: #define __WCHAR_WIDTH__ 32
# | 362: #define __WINT_MAX__ 4294967295U
# | 363: #define __WINT_MIN__ 0U
# | 364: #define __WINT_TYPE__ unsigned int
# | 365: #define __WINT_UNSIGNED__ 1
# | 366: #define __WINT_WIDTH__ 32
# | check:2665'0 { search range start (exclusive)
# | check:2665'1 error: no match found in search range
# | 367: #define __clang__ 1
# | 368: #define __clang_literal_encoding__ "UTF-8"
# | 369: #define __clang_major__ 24
# | 370: #define __clang_minor__ 0
# | 371: #define __clang_patchlevel__ 0
# | 372: #define __clang_version__ "24.0.0git (https://github.com/llvm/llvm-project 1e36267418e9d99c458d16594aae9b2ea77f98b7)"
# | 373: #define __clang_wide_literal_encoding__ "UTF-32"
# | 374: #define __linux 1
# | 375: #define __linux__ 1
# | check:2665'2 ? possible intended match
# | 376: #define __llvm__ 1
# | 377: #define __riscv 1
# | 378: #define __riscv_arch_test 1
# | 379: #define __riscv_cmodel_medlow 1
# | 380: #define __riscv_float_abi_soft 1
# | 381: #define __riscv_i 2001000
# | 382: #define __riscv_misaligned_avoid 1
# | 383: #define __riscv_v_intrinsic 1000000
# | 384: #define __riscv_xlen 32
# | 385: #define __unix 1
# | 386: #define __unix__ 1
# | 387: #define linux 1
# | 388: #define unix 1
# | check:2665'3 } search range end (exclusive)
# | >>>>>>
# `-----------------------------
# error: command failed with exit status: 1
--
```
</details>
If these failures are unrelated to your changes (for example tests are broken or flaky at HEAD), please open an issue at https://github.com/llvm/llvm-project/issues and add the `infrastructure` label.
https://github.com/llvm/llvm-project/pull/227243
More information about the cfe-commits
mailing list