[llvm] [X86] Narrow the mask when folding (vselect mask, (v16i8 (vtrunc (v8i64 x))), 0). (PR #228270)
via llvm-commits
llvm-commits at lists.llvm.org
Fri Oct 2 01:03:22 PDT 2026
github-actions[bot] wrote:
<!--PREMERGE ADVISOR COMMENT: Linux-->
# :penguin: Linux x64 Test Results
* 154598 tests passed
* 3458 tests skipped
* 1 test failed
## Failed Tests
(click on a test name to see its output)
### lldb-api
<details>
<summary>lldb-api.functionalities/gdb_remote_client/TestEmptyThreadList.py</summary>
```
Script:
--
/usr/bin/python3 /home/gha/actions-runner/_work/llvm-project/llvm-project/lldb/test/API/dotest.py -u CXXFLAGS -u CFLAGS --env LLVM_LIBS_DIR=/home/gha/actions-runner/_work/llvm-project/llvm-project/build/./lib --env LLVM_INCLUDE_DIR=/home/gha/actions-runner/_work/llvm-project/llvm-project/build/include --env LLVM_TOOLS_DIR=/home/gha/actions-runner/_work/llvm-project/llvm-project/build/./bin --libcxx-include-dir /home/gha/actions-runner/_work/llvm-project/llvm-project/build/include/c++/v1 --libcxx-include-target-dir /home/gha/actions-runner/_work/llvm-project/llvm-project/build/include/x86_64-unknown-linux-gnu/c++/v1 --libcxx-library-dir /home/gha/actions-runner/_work/llvm-project/llvm-project/build/./lib/x86_64-unknown-linux-gnu --triple x86_64-unknown-linux-gnu --build-dir /home/gha/actions-runner/_work/llvm-project/llvm-project/build/lldb-test-build --lldb-module-cache-dir /home/gha/actions-runner/_work/llvm-project/llvm-project/build/lldb-test-build/module-cache-lldb/lldb-api --clang-module-cache-dir /home/gha/actions-runner/_work/llvm-project/llvm-project/build/lldb-test-build/module-cache-clang/lldb-api --executable /home/gha/actions-runner/_work/llvm-project/llvm-project/build/./bin/lldb --lldb-python-dir /home/gha/actions-runner/_work/llvm-project/llvm-project/build/local/lib/python3.14/dist-packages --compiler /home/gha/actions-runner/_work/llvm-project/llvm-project/build/./bin/clang --dsymutil /home/gha/actions-runner/_work/llvm-project/llvm-project/build/./bin/dsymutil --make /usr/bin/gmake --llvm-tools-dir /home/gha/actions-runner/_work/llvm-project/llvm-project/build/./bin --lldb-obj-root /home/gha/actions-runner/_work/llvm-project/llvm-project/build/tools/lldb --lldb-libs-dir /home/gha/actions-runner/_work/llvm-project/llvm-project/build/./lib --cmake-build-type Release /home/gha/actions-runner/_work/llvm-project/llvm-project/lldb/test/API/functionalities/gdb_remote_client -p TestEmptyThreadList.py --timeout 1200
--
Exit Code: 1
Command Output (stdout):
--
Skipping the following test categories: msvcstl, dsym, pdb, gmodules, debugserver, objc
--
Command Output (stderr):
--
FAIL: LLDB (/home/gha/actions-runner/_work/llvm-project/llvm-project/build/bin/clang-x86_64) :: test_thread_list_goes_empty (TestEmptyThreadList.TestEmptyThreadList.test_thread_list_goes_empty)
Log Files:
- /home/gha/actions-runner/_work/llvm-project/llvm-project/build/lldb-test-build/functionalities/gdb_remote_client/TestEmptyThreadList/Failure_test_thread_list_goes_empty.log
======================================================================
FAIL: test_thread_list_goes_empty (TestEmptyThreadList.TestEmptyThreadList.test_thread_list_goes_empty)
----------------------------------------------------------------------
Traceback (most recent call last):
File "/home/gha/actions-runner/_work/llvm-project/llvm-project/lldb/test/API/functionalities/gdb_remote_client/TestEmptyThreadList.py", line 61, in test_thread_list_goes_empty
self.assertState(process.GetState(), lldb.eStateStopped)
~~~~~~~~~~~~~~~~^^^^^^^^^^^^^^^^^^^^^^^^^^^^^^^^^^^^^^^^
File "/home/gha/actions-runner/_work/llvm-project/llvm-project/lldb/packages/Python/lldbsuite/test/lldbtest.py", line 3117, in assertState
self.fail(self._formatMessage(msg, error))
~~~~~~~~~^^^^^^^^^^^^^^^^^^^^^^^^^^^^^^^^^
AssertionError: exited (10) != stopped (5)
Config=x86_64-/home/gha/actions-runner/_work/llvm-project/llvm-project/build/bin/clang
----------------------------------------------------------------------
Ran 1 test in 0.095s
FAILED (failures=1)
--
```
</details>
If these failures are unrelated to your changes (for example tests are broken or flaky at HEAD), please open an issue at https://github.com/llvm/llvm-project/issues and add the `infrastructure` label.
https://github.com/llvm/llvm-project/pull/228270
More information about the llvm-commits
mailing list