[llvm] [AliasSetTracker] Use ModRefInfo (NFC) (PR #217917)
via llvm-commits
llvm-commits at lists.llvm.org
Fri Aug 21 10:51:33 PDT 2026
github-actions[bot] wrote:
<!--PREMERGE ADVISOR COMMENT: Linux-->
# :penguin: Linux x64 Test Results
The build failed before running any tests. Click on a failure below to see the details.
<details>
<summary>lib/Analysis/CMakeFiles/LLVMAnalysis.dir/AliasSetTracker.cpp.o</summary>
```
FAILED: lib/Analysis/CMakeFiles/LLVMAnalysis.dir/AliasSetTracker.cpp.o
sccache /opt/llvm/bin/clang++ -D_DEBUG -D_GLIBCXX_ASSERTIONS -D_GLIBCXX_USE_CXX11_ABI=1 -D_GNU_SOURCE -D_LIBCPP_HARDENING_MODE=_LIBCPP_HARDENING_MODE_EXTENSIVE -D__STDC_CONSTANT_MACROS -D__STDC_FORMAT_MACROS -D__STDC_LIMIT_MACROS -I/home/gha/actions-runner/_work/llvm-project/llvm-project/build/lib/Analysis -I/home/gha/actions-runner/_work/llvm-project/llvm-project/llvm/lib/Analysis -I/home/gha/actions-runner/_work/llvm-project/llvm-project/build/include -I/home/gha/actions-runner/_work/llvm-project/llvm-project/llvm/include -gmlt -fPIC -fno-semantic-interposition -fvisibility-inlines-hidden -Werror -Werror=date-time -Werror=unguarded-availability-new -Wall -Wextra -Wno-unused-parameter -Wwrite-strings -Wcast-qual -Wmissing-field-initializers -pedantic -Wno-long-long -Wc++98-compat-extra-semi -Wimplicit-fallthrough -Wcovered-switch-default -Wno-noexcept-type -Wnon-virtual-dtor -Wdelete-non-virtual-dtor -Wsuggest-override -Wstring-conversion -Wno-pass-failed -Wmisleading-indentation -Wctad-maybe-unsupported -fdiagnostics-color -ffunction-sections -fdata-sections -O3 -DNDEBUG -std=c++17 -UNDEBUG -fno-exceptions -funwind-tables -fno-rtti -MD -MT lib/Analysis/CMakeFiles/LLVMAnalysis.dir/AliasSetTracker.cpp.o -MF lib/Analysis/CMakeFiles/LLVMAnalysis.dir/AliasSetTracker.cpp.o.d -o lib/Analysis/CMakeFiles/LLVMAnalysis.dir/AliasSetTracker.cpp.o -c /home/gha/actions-runner/_work/llvm-project/llvm-project/llvm/lib/Analysis/AliasSetTracker.cpp
In file included from /home/gha/actions-runner/_work/llvm-project/llvm-project/llvm/lib/Analysis/AliasSetTracker.cpp:13:
/home/gha/actions-runner/_work/llvm-project/llvm-project/llvm/include/llvm/Analysis/AliasSetTracker.h:96:31: error: use of undeclared identifier 'isRefSet'
96 | bool isRef() const { return isRefSet(static_cast<ModRefInfo>(Access)); }
| ^~~~~~~~
/home/gha/actions-runner/_work/llvm-project/llvm-project/llvm/include/llvm/Analysis/AliasSetTracker.h:97:31: error: use of undeclared identifier 'isModSet'
97 | bool isMod() const { return isModSet(static_cast<ModRefInfo>(Access)); }
| ^~~~~~~~
/home/gha/actions-runner/_work/llvm-project/llvm-project/llvm/include/llvm/Analysis/AliasSetTracker.h:130:16: error: incomplete type 'llvm::ModRefInfo' named in nested name specifier
130 | Access(ModRefInfo::NoModRef) {}
| ^~~~~~~~~~~~
3 errors generated.
```
</details>
<details>
<summary>tools/clang/tools/driver/CMakeFiles/clang.dir/cc1_main.cpp.o</summary>
```
FAILED: tools/clang/tools/driver/CMakeFiles/clang.dir/cc1_main.cpp.o
sccache /opt/llvm/bin/clang++ -DLLVM_BUILD_STATIC -D_DEBUG -D_GLIBCXX_ASSERTIONS -D_GLIBCXX_USE_CXX11_ABI=1 -D_GNU_SOURCE -D_LIBCPP_HARDENING_MODE=_LIBCPP_HARDENING_MODE_EXTENSIVE -D__STDC_CONSTANT_MACROS -D__STDC_FORMAT_MACROS -D__STDC_LIMIT_MACROS -I/home/gha/actions-runner/_work/llvm-project/llvm-project/build/tools/clang/tools/driver -I/home/gha/actions-runner/_work/llvm-project/llvm-project/clang/tools/driver -I/home/gha/actions-runner/_work/llvm-project/llvm-project/clang/include -I/home/gha/actions-runner/_work/llvm-project/llvm-project/build/tools/clang/include -I/home/gha/actions-runner/_work/llvm-project/llvm-project/build/include -I/home/gha/actions-runner/_work/llvm-project/llvm-project/llvm/include -gmlt -fPIC -fno-semantic-interposition -fvisibility-inlines-hidden -Werror -Werror=date-time -Werror=unguarded-availability-new -Wall -Wextra -Wno-unused-parameter -Wwrite-strings -Wcast-qual -Wmissing-field-initializers -pedantic -Wno-long-long -Wc++98-compat-extra-semi -Wimplicit-fallthrough -Wcovered-switch-default -Wno-noexcept-type -Wnon-virtual-dtor -Wdelete-non-virtual-dtor -Wsuggest-override -Wstring-conversion -Wno-pass-failed -Wmisleading-indentation -Wctad-maybe-unsupported -fdiagnostics-color -ffunction-sections -fdata-sections -fno-common -Woverloaded-virtual -Wno-nested-anon-types -O3 -DNDEBUG -std=c++17 -UNDEBUG -fno-exceptions -funwind-tables -fno-rtti -MD -MT tools/clang/tools/driver/CMakeFiles/clang.dir/cc1_main.cpp.o -MF tools/clang/tools/driver/CMakeFiles/clang.dir/cc1_main.cpp.o.d -o tools/clang/tools/driver/CMakeFiles/clang.dir/cc1_main.cpp.o -c /home/gha/actions-runner/_work/llvm-project/llvm-project/clang/tools/driver/cc1_main.cpp
In file included from /home/gha/actions-runner/_work/llvm-project/llvm-project/clang/tools/driver/cc1_main.cpp:33:
In file included from /home/gha/actions-runner/_work/llvm-project/llvm-project/llvm/include/llvm/LinkAllPasses.h:19:
/home/gha/actions-runner/_work/llvm-project/llvm-project/llvm/include/llvm/Analysis/AliasSetTracker.h:96:31: error: use of undeclared identifier 'isRefSet'
96 | bool isRef() const { return isRefSet(static_cast<ModRefInfo>(Access)); }
| ^~~~~~~~
/home/gha/actions-runner/_work/llvm-project/llvm-project/llvm/include/llvm/Analysis/AliasSetTracker.h:97:31: error: use of undeclared identifier 'isModSet'
97 | bool isMod() const { return isModSet(static_cast<ModRefInfo>(Access)); }
| ^~~~~~~~
/home/gha/actions-runner/_work/llvm-project/llvm-project/llvm/include/llvm/Analysis/AliasSetTracker.h:130:16: error: incomplete type 'llvm::ModRefInfo' named in nested name specifier
130 | Access(ModRefInfo::NoModRef) {}
| ^~~~~~~~~~~~
3 errors generated.
```
</details>
<details>
<summary>unittests/Analysis/CMakeFiles/AnalysisTests.dir/AliasSetTrackerTest.cpp.o</summary>
```
FAILED: unittests/Analysis/CMakeFiles/AnalysisTests.dir/AliasSetTrackerTest.cpp.o
sccache /opt/llvm/bin/clang++ -DLLVM_BUILD_STATIC -D_DEBUG -D_GLIBCXX_ASSERTIONS -D_GLIBCXX_USE_CXX11_ABI=1 -D_GNU_SOURCE -D_LIBCPP_HARDENING_MODE=_LIBCPP_HARDENING_MODE_EXTENSIVE -D__STDC_CONSTANT_MACROS -D__STDC_FORMAT_MACROS -D__STDC_LIMIT_MACROS -I/home/gha/actions-runner/_work/llvm-project/llvm-project/build/unittests/Analysis -I/home/gha/actions-runner/_work/llvm-project/llvm-project/llvm/unittests/Analysis -I/home/gha/actions-runner/_work/llvm-project/llvm-project/build/include -I/home/gha/actions-runner/_work/llvm-project/llvm-project/llvm/include -I/home/gha/actions-runner/_work/llvm-project/llvm-project/third-party/unittest/googletest/include -I/home/gha/actions-runner/_work/llvm-project/llvm-project/third-party/unittest/googlemock/include -gmlt -fPIC -fno-semantic-interposition -fvisibility-inlines-hidden -Werror -Werror=date-time -Werror=unguarded-availability-new -Wall -Wextra -Wno-unused-parameter -Wwrite-strings -Wcast-qual -Wmissing-field-initializers -pedantic -Wno-long-long -Wc++98-compat-extra-semi -Wimplicit-fallthrough -Wcovered-switch-default -Wno-noexcept-type -Wnon-virtual-dtor -Wdelete-non-virtual-dtor -Wsuggest-override -Wstring-conversion -Wno-pass-failed -Wmisleading-indentation -Wctad-maybe-unsupported -fdiagnostics-color -ffunction-sections -fdata-sections -O3 -DNDEBUG -std=c++17 -UNDEBUG -Wno-variadic-macros -Wno-gnu-zero-variadic-macro-arguments -fno-exceptions -funwind-tables -fno-rtti -Wno-suggest-override -MD -MT unittests/Analysis/CMakeFiles/AnalysisTests.dir/AliasSetTrackerTest.cpp.o -MF unittests/Analysis/CMakeFiles/AnalysisTests.dir/AliasSetTrackerTest.cpp.o.d -o unittests/Analysis/CMakeFiles/AnalysisTests.dir/AliasSetTrackerTest.cpp.o -c /home/gha/actions-runner/_work/llvm-project/llvm-project/llvm/unittests/Analysis/AliasSetTrackerTest.cpp
In file included from /home/gha/actions-runner/_work/llvm-project/llvm-project/llvm/unittests/Analysis/AliasSetTrackerTest.cpp:9:
/home/gha/actions-runner/_work/llvm-project/llvm-project/llvm/include/llvm/Analysis/AliasSetTracker.h:96:31: error: use of undeclared identifier 'isRefSet'
96 | bool isRef() const { return isRefSet(static_cast<ModRefInfo>(Access)); }
| ^~~~~~~~
/home/gha/actions-runner/_work/llvm-project/llvm-project/llvm/include/llvm/Analysis/AliasSetTracker.h:97:31: error: use of undeclared identifier 'isModSet'
97 | bool isMod() const { return isModSet(static_cast<ModRefInfo>(Access)); }
| ^~~~~~~~
/home/gha/actions-runner/_work/llvm-project/llvm-project/llvm/include/llvm/Analysis/AliasSetTracker.h:130:16: error: incomplete type 'llvm::ModRefInfo' named in nested name specifier
130 | Access(ModRefInfo::NoModRef) {}
| ^~~~~~~~~~~~
3 errors generated.
```
</details>
If these failures are unrelated to your changes (for example tests are broken or flaky at HEAD), please open an issue at https://github.com/llvm/llvm-project/issues and add the `infrastructure` label.
https://github.com/llvm/llvm-project/pull/217917
More information about the llvm-commits
mailing list