[llvm] [AliasSetTracker] Use ModRefInfo (NFC) (PR #217917)
via llvm-commits
llvm-commits at lists.llvm.org
Fri Aug 21 10:51:32 PDT 2026
github-actions[bot] wrote:
<!--PREMERGE ADVISOR COMMENT: Windows-->
# :window: Windows x64 Test Results
The build failed before running any tests. Click on a failure below to see the details.
<details>
<summary>[code=1] lib/Analysis/CMakeFiles/LLVMAnalysis.dir/AliasSetTracker.cpp.obj</summary>
```
FAILED: [code=1] lib/Analysis/CMakeFiles/LLVMAnalysis.dir/AliasSetTracker.cpp.obj
sccache C:\clang\clang-msvc\bin\clang-cl.exe /nologo -TP -DUNICODE -D_CRT_NONSTDC_NO_DEPRECATE -D_CRT_NONSTDC_NO_WARNINGS -D_CRT_SECURE_NO_DEPRECATE -D_CRT_SECURE_NO_WARNINGS -D_GLIBCXX_ASSERTIONS -D_HAS_EXCEPTIONS=0 -D_LIBCPP_HARDENING_MODE=_LIBCPP_HARDENING_MODE_EXTENSIVE -D_SCL_SECURE_NO_DEPRECATE -D_SCL_SECURE_NO_WARNINGS -D_UNICODE -D__STDC_CONSTANT_MACROS -D__STDC_FORMAT_MACROS -D__STDC_LIMIT_MACROS -IC:\_work\llvm-project\llvm-project\build\lib\Analysis -IC:\_work\llvm-project\llvm-project\llvm\lib\Analysis -IC:\_work\llvm-project\llvm-project\build\include -IC:\_work\llvm-project\llvm-project\llvm\include /DWIN32 /D_WINDOWS /Zc:inline /Zc:__cplusplus /Oi /Brepro /bigobj /permissive- -Werror=unguarded-availability-new /W4 -Wextra -Wno-unused-parameter -Wwrite-strings -Wcast-qual -Wmissing-field-initializers -Wimplicit-fallthrough -Wcovered-switch-default -Wno-noexcept-type -Wnon-virtual-dtor -Wdelete-non-virtual-dtor -Wsuggest-override -Wstring-conversion -Wno-pass-failed -Wmisleading-indentation -Wctad-maybe-unsupported /Gw /O2 /Ob2 -std:c++17 -MD -UNDEBUG /EHs-c- /GR- /showIncludes /Folib\Analysis\CMakeFiles\LLVMAnalysis.dir\AliasSetTracker.cpp.obj /Fdlib\Analysis\CMakeFiles\LLVMAnalysis.dir\LLVMAnalysis.pdb -c -- C:\_work\llvm-project\llvm-project\llvm\lib\Analysis\AliasSetTracker.cpp
In file included from C:\_work\llvm-project\llvm-project\llvm\lib\Analysis\AliasSetTracker.cpp:13:
C:\_work\llvm-project\llvm-project\llvm\include\llvm/Analysis/AliasSetTracker.h(96,31): error: use of undeclared identifier 'isRefSet'
96 | bool isRef() const { return isRefSet(static_cast<ModRefInfo>(Access)); }
| ^~~~~~~~
C:\_work\llvm-project\llvm-project\llvm\include\llvm/Analysis/AliasSetTracker.h(97,31): error: use of undeclared identifier 'isModSet'
97 | bool isMod() const { return isModSet(static_cast<ModRefInfo>(Access)); }
| ^~~~~~~~
C:\_work\llvm-project\llvm-project\llvm\include\llvm/Analysis/AliasSetTracker.h(130,16): error: incomplete type 'llvm::ModRefInfo' named in nested name specifier
130 | Access(ModRefInfo::NoModRef) {}
| ^~~~~~~~~~~~
3 errors generated.
```
</details>
<details>
<summary>[code=1] tools/clang/tools/driver/CMakeFiles/clang.dir/cc1_main.cpp.obj</summary>
```
FAILED: [code=1] tools/clang/tools/driver/CMakeFiles/clang.dir/cc1_main.cpp.obj
sccache C:\clang\clang-msvc\bin\clang-cl.exe /nologo -TP -DCLANG_BUILD_STATIC -DLLVM_BUILD_STATIC -DUNICODE -D_CRT_NONSTDC_NO_DEPRECATE -D_CRT_NONSTDC_NO_WARNINGS -D_CRT_SECURE_NO_DEPRECATE -D_CRT_SECURE_NO_WARNINGS -D_GLIBCXX_ASSERTIONS -D_HAS_EXCEPTIONS=0 -D_LIBCPP_HARDENING_MODE=_LIBCPP_HARDENING_MODE_EXTENSIVE -D_SCL_SECURE_NO_DEPRECATE -D_SCL_SECURE_NO_WARNINGS -D_UNICODE -D__STDC_CONSTANT_MACROS -D__STDC_FORMAT_MACROS -D__STDC_LIMIT_MACROS -IC:\_work\llvm-project\llvm-project\build\tools\clang\tools\driver -IC:\_work\llvm-project\llvm-project\clang\tools\driver -IC:\_work\llvm-project\llvm-project\clang\include -IC:\_work\llvm-project\llvm-project\build\tools\clang\include -IC:\_work\llvm-project\llvm-project\build\include -IC:\_work\llvm-project\llvm-project\llvm\include /DWIN32 /D_WINDOWS /Zc:inline /Zc:__cplusplus /Oi /Brepro /bigobj /permissive- -Werror=unguarded-availability-new /W4 -Wextra -Wno-unused-parameter -Wwrite-strings -Wcast-qual -Wmissing-field-initializers -Wimplicit-fallthrough -Wcovered-switch-default -Wno-noexcept-type -Wnon-virtual-dtor -Wdelete-non-virtual-dtor -Wsuggest-override -Wstring-conversion -Wno-pass-failed -Wmisleading-indentation -Wctad-maybe-unsupported /Gw /O2 /Ob2 -std:c++17 -MD -UNDEBUG /EHs-c- /GR- /showIncludes /Fotools\clang\tools\driver\CMakeFiles\clang.dir\cc1_main.cpp.obj /Fdtools\clang\tools\driver\CMakeFiles\clang.dir\ -c -- C:\_work\llvm-project\llvm-project\clang\tools\driver\cc1_main.cpp
In file included from C:\_work\llvm-project\llvm-project\clang\tools\driver\cc1_main.cpp:33:
In file included from C:\_work\llvm-project\llvm-project\llvm\include\llvm/LinkAllPasses.h:19:
C:\_work\llvm-project\llvm-project\llvm\include\llvm/Analysis/AliasSetTracker.h(96,31): error: use of undeclared identifier 'isRefSet'
96 | bool isRef() const { return isRefSet(static_cast<ModRefInfo>(Access)); }
| ^~~~~~~~
C:\_work\llvm-project\llvm-project\llvm\include\llvm/Analysis/AliasSetTracker.h(97,31): error: use of undeclared identifier 'isModSet'
97 | bool isMod() const { return isModSet(static_cast<ModRefInfo>(Access)); }
| ^~~~~~~~
C:\_work\llvm-project\llvm-project\llvm\include\llvm/Analysis/AliasSetTracker.h(130,16): error: incomplete type 'llvm::ModRefInfo' named in nested name specifier
130 | Access(ModRefInfo::NoModRef) {}
| ^~~~~~~~~~~~
3 errors generated.
```
</details>
<details>
<summary>[code=1] unittests/Analysis/CMakeFiles/AnalysisTests.dir/AliasSetTrackerTest.cpp.obj</summary>
```
FAILED: [code=1] unittests/Analysis/CMakeFiles/AnalysisTests.dir/AliasSetTrackerTest.cpp.obj
sccache C:\clang\clang-msvc\bin\clang-cl.exe /nologo -TP -DLLVM_BUILD_STATIC -DUNICODE -D_CRT_NONSTDC_NO_DEPRECATE -D_CRT_NONSTDC_NO_WARNINGS -D_CRT_SECURE_NO_DEPRECATE -D_CRT_SECURE_NO_WARNINGS -D_GLIBCXX_ASSERTIONS -D_HAS_EXCEPTIONS=0 -D_LIBCPP_HARDENING_MODE=_LIBCPP_HARDENING_MODE_EXTENSIVE -D_SCL_SECURE_NO_DEPRECATE -D_SCL_SECURE_NO_WARNINGS -D_UNICODE -D__STDC_CONSTANT_MACROS -D__STDC_FORMAT_MACROS -D__STDC_LIMIT_MACROS -IC:\_work\llvm-project\llvm-project\build\unittests\Analysis -IC:\_work\llvm-project\llvm-project\llvm\unittests\Analysis -IC:\_work\llvm-project\llvm-project\build\include -IC:\_work\llvm-project\llvm-project\llvm\include -IC:\_work\llvm-project\llvm-project\third-party\unittest\googletest\include -IC:\_work\llvm-project\llvm-project\third-party\unittest\googlemock\include /DWIN32 /D_WINDOWS /Zc:inline /Zc:__cplusplus /Oi /Brepro /bigobj /permissive- -Werror=unguarded-availability-new /W4 -Wextra -Wno-unused-parameter -Wwrite-strings -Wcast-qual -Wmissing-field-initializers -Wimplicit-fallthrough -Wcovered-switch-default -Wno-noexcept-type -Wnon-virtual-dtor -Wdelete-non-virtual-dtor -Wsuggest-override -Wstring-conversion -Wno-pass-failed -Wmisleading-indentation -Wctad-maybe-unsupported /Gw /O2 /Ob2 -std:c++17 -MD -UNDEBUG -Wno-gnu-zero-variadic-macro-arguments /EHs-c- /GR- -Wno-suggest-override /showIncludes /Founittests\Analysis\CMakeFiles\AnalysisTests.dir\AliasSetTrackerTest.cpp.obj /Fdunittests\Analysis\CMakeFiles\AnalysisTests.dir\ -c -- C:\_work\llvm-project\llvm-project\llvm\unittests\Analysis\AliasSetTrackerTest.cpp
In file included from C:\_work\llvm-project\llvm-project\llvm\unittests\Analysis\AliasSetTrackerTest.cpp:9:
C:\_work\llvm-project\llvm-project\llvm\include\llvm/Analysis/AliasSetTracker.h(96,31): error: use of undeclared identifier 'isRefSet'
96 | bool isRef() const { return isRefSet(static_cast<ModRefInfo>(Access)); }
| ^~~~~~~~
C:\_work\llvm-project\llvm-project\llvm\include\llvm/Analysis/AliasSetTracker.h(97,31): error: use of undeclared identifier 'isModSet'
97 | bool isMod() const { return isModSet(static_cast<ModRefInfo>(Access)); }
| ^~~~~~~~
C:\_work\llvm-project\llvm-project\llvm\include\llvm/Analysis/AliasSetTracker.h(130,16): error: incomplete type 'llvm::ModRefInfo' named in nested name specifier
130 | Access(ModRefInfo::NoModRef) {}
| ^~~~~~~~~~~~
3 errors generated.
```
</details>
If these failures are unrelated to your changes (for example tests are broken or flaky at HEAD), please open an issue at https://github.com/llvm/llvm-project/issues and add the `infrastructure` label.
https://github.com/llvm/llvm-project/pull/217917
More information about the llvm-commits
mailing list