[llvm-bugs] [Bug 44849] New: llvm 10 rc1 fails to build on s390x - stage2 build

via llvm-bugs llvm-bugs at lists.llvm.org
Sat Feb 8 08:59:30 PST 2020


            Bug ID: 44849
           Summary: llvm 10 rc1 fails to build on s390x - stage2 build
           Product: libraries
           Version: trunk
          Hardware: PC
                OS: Linux
            Status: NEW
          Severity: release blocker
          Priority: P
         Component: Backend: SystemZ
          Assignee: unassignedbugs at nondot.org
          Reporter: sylvestre at debian.org
                CC: llvm-bugs at lists.llvm.org
            Blocks: 44555

fatal error: error in backend: Not supported instr: <MCInst 421 <MCOperand
Reg:187> <MCOperand Reg:139>>
make[8]: *** [lib/Target/X86/CMakeFiles/LLVMX86CodeGen.dir/build.make:326:
lib/Target/X86/CMakeFiles/LLVMX86CodeGen.dir/X86ISelLowering.cpp.o] Error 70
make[8]: Leaving directory
make[7]: *** [CMakeFiles/Makefile2:30692:
lib/Target/X86/CMakeFiles/LLVMX86CodeGen.dir/all] Error 2
make[7]: *** Waiting for unfinished jobs....

Full log:

Reported: https://bugs.debian.org/cgi-bin/bugreport.cgi?bug=950900

Referenced Bugs:

[Bug 44555] [meta] 10.0.0 Release Blockers
You are receiving this mail because:
You are on the CC list for the bug.
-------------- next part --------------
An HTML attachment was scrubbed...
URL: <http://lists.llvm.org/pipermail/llvm-bugs/attachments/20200208/3c44247a/attachment.html>

More information about the llvm-bugs mailing list