[llvm-branch-commits] [clang] [clang][ssaf][orchestrator] Merge transformation reports per link unit (PR #232548)

via llvm-branch-commits llvm-branch-commits at lists.llvm.org
Fri Oct 23 21:26:21 PDT 2026


github-actions[bot] wrote:

<!--PREMERGE ADVISOR COMMENT: Linux-->
# :penguin: Linux x64 Test Results

* 63705 tests passed
* 836 tests skipped
* 4 tests failed

## Failed Tests
(click on a test name to see its output)

### Clang
<details>
<summary>Clang.Analysis/Scalable/ssaf-orchestrator-make/transformation-reports.test</summary>

```
Exit Code: 2

Command Output (stdout):
--
# RUN: at line 2
rm -rf /home/gha/actions-runner/_work/llvm-project/llvm-project/build/tools/clang/test/Analysis/Scalable/ssaf-orchestrator-make/Output/transformation-reports.test.tmp && split-file /home/gha/actions-runner/_work/llvm-project/llvm-project/clang/test/Analysis/Scalable/ssaf-orchestrator-make/transformation-reports.test /home/gha/actions-runner/_work/llvm-project/llvm-project/build/tools/clang/test/Analysis/Scalable/ssaf-orchestrator-make/Output/transformation-reports.test.tmp
# executed command: rm -rf /home/gha/actions-runner/_work/llvm-project/llvm-project/build/tools/clang/test/Analysis/Scalable/ssaf-orchestrator-make/Output/transformation-reports.test.tmp
# note: command had no output on stdout or stderr
# executed command: split-file /home/gha/actions-runner/_work/llvm-project/llvm-project/clang/test/Analysis/Scalable/ssaf-orchestrator-make/transformation-reports.test /home/gha/actions-runner/_work/llvm-project/llvm-project/build/tools/clang/test/Analysis/Scalable/ssaf-orchestrator-make/Output/transformation-reports.test.tmp
# note: command had no output on stdout or stderr
# RUN: at line 3
mkdir -p /home/gha/actions-runner/_work/llvm-project/llvm-project/build/tools/clang/test/Analysis/Scalable/ssaf-orchestrator-make/Output/transformation-reports.test.tmp/build
# executed command: mkdir -p /home/gha/actions-runner/_work/llvm-project/llvm-project/build/tools/clang/test/Analysis/Scalable/ssaf-orchestrator-make/Output/transformation-reports.test.tmp/build
# note: command had no output on stdout or stderr
# RUN: at line 9
cd /home/gha/actions-runner/_work/llvm-project/llvm-project/build/tools/clang/test/Analysis/Scalable/ssaf-orchestrator-make/Output/transformation-reports.test.tmp
# executed command: cd /home/gha/actions-runner/_work/llvm-project/llvm-project/build/tools/clang/test/Analysis/Scalable/ssaf-orchestrator-make/Output/transformation-reports.test.tmp
# note: command had no output on stdout or stderr
# RUN: at line 10
"/usr/bin/python3" "/home/gha/actions-runner/_work/llvm-project/llvm-project/build/bin/clang-ssaf-orchestrator-make"      --extract-summaries=PointerFlow,UnsafeBufferUsage      --analysis=UnsafeBufferReachableAnalysisResult      --transformation=cpp-bounded-buffers      --ssaf-clang=/home/gha/actions-runner/_work/llvm-project/llvm-project/build/bin/clang-24      -o /home/gha/actions-runner/_work/llvm-project/llvm-project/build/tools/clang/test/Analysis/Scalable/ssaf-orchestrator-make/Output/transformation-reports.test.tmp/out -- make    | /home/gha/actions-runner/_work/llvm-project/llvm-project/build/bin/FileCheck /home/gha/actions-runner/_work/llvm-project/llvm-project/clang/test/Analysis/Scalable/ssaf-orchestrator-make/transformation-reports.test --check-prefix=STDOUT
# executed command: /usr/bin/python3 /home/gha/actions-runner/_work/llvm-project/llvm-project/build/bin/clang-ssaf-orchestrator-make --extract-summaries=PointerFlow,UnsafeBufferUsage --analysis=UnsafeBufferReachableAnalysisResult --transformation=cpp-bounded-buffers --ssaf-clang=/home/gha/actions-runner/_work/llvm-project/llvm-project/build/bin/clang-24 -o /home/gha/actions-runner/_work/llvm-project/llvm-project/build/tools/clang/test/Analysis/Scalable/ssaf-orchestrator-make/Output/transformation-reports.test.tmp/out -- make
# .---command stderr------------
# | clang-ssaf-orchestrator-make: error: required tools not resolvable:
# |   --ssaf-report-merge: clang-ssaf-report-merge: not found on PATH
# |   --ssaf-conflict-merge: clang-ssaf-conflict-merge: not found on PATH
# `-----------------------------
# error: command failed with exit status: 1
# executed command: /home/gha/actions-runner/_work/llvm-project/llvm-project/build/bin/FileCheck /home/gha/actions-runner/_work/llvm-project/llvm-project/clang/test/Analysis/Scalable/ssaf-orchestrator-make/transformation-reports.test --check-prefix=STDOUT
# .---command stderr------------
# | FileCheck error: '<stdin>' is empty.
# | FileCheck command line:  /home/gha/actions-runner/_work/llvm-project/llvm-project/build/bin/FileCheck /home/gha/actions-runner/_work/llvm-project/llvm-project/clang/test/Analysis/Scalable/ssaf-orchestrator-make/transformation-reports.test --check-prefix=STDOUT
# `-----------------------------
# error: command failed with exit status: 2

--

```
</details>
<details>
<summary>Clang.Analysis/Scalable/ssaf-orchestrator-make/two-pass-compile-and-link.test</summary>

```
Exit Code: 2

Command Output (stdout):
--
# RUN: at line 3
rm -rf /home/gha/actions-runner/_work/llvm-project/llvm-project/build/tools/clang/test/Analysis/Scalable/ssaf-orchestrator-make/Output/two-pass-compile-and-link.test.tmp && split-file /home/gha/actions-runner/_work/llvm-project/llvm-project/clang/test/Analysis/Scalable/ssaf-orchestrator-make/two-pass-compile-and-link.test /home/gha/actions-runner/_work/llvm-project/llvm-project/build/tools/clang/test/Analysis/Scalable/ssaf-orchestrator-make/Output/two-pass-compile-and-link.test.tmp
# executed command: rm -rf /home/gha/actions-runner/_work/llvm-project/llvm-project/build/tools/clang/test/Analysis/Scalable/ssaf-orchestrator-make/Output/two-pass-compile-and-link.test.tmp
# note: command had no output on stdout or stderr
# executed command: split-file /home/gha/actions-runner/_work/llvm-project/llvm-project/clang/test/Analysis/Scalable/ssaf-orchestrator-make/two-pass-compile-and-link.test /home/gha/actions-runner/_work/llvm-project/llvm-project/build/tools/clang/test/Analysis/Scalable/ssaf-orchestrator-make/Output/two-pass-compile-and-link.test.tmp
# note: command had no output on stdout or stderr
# RUN: at line 4
mkdir -p /home/gha/actions-runner/_work/llvm-project/llvm-project/build/tools/clang/test/Analysis/Scalable/ssaf-orchestrator-make/Output/two-pass-compile-and-link.test.tmp/build
# executed command: mkdir -p /home/gha/actions-runner/_work/llvm-project/llvm-project/build/tools/clang/test/Analysis/Scalable/ssaf-orchestrator-make/Output/two-pass-compile-and-link.test.tmp/build
# note: command had no output on stdout or stderr
# RUN: at line 6
cd /home/gha/actions-runner/_work/llvm-project/llvm-project/build/tools/clang/test/Analysis/Scalable/ssaf-orchestrator-make/Output/two-pass-compile-and-link.test.tmp
# executed command: cd /home/gha/actions-runner/_work/llvm-project/llvm-project/build/tools/clang/test/Analysis/Scalable/ssaf-orchestrator-make/Output/two-pass-compile-and-link.test.tmp
# note: command had no output on stdout or stderr
# RUN: at line 7
"/usr/bin/python3" "/home/gha/actions-runner/_work/llvm-project/llvm-project/build/bin/clang-ssaf-orchestrator-make"      --extract-summaries=PointerFlow,UnsafeBufferUsage      --analysis=UnsafeBufferReachableAnalysisResult      --transformation=cpp-bounded-buffers      --ssaf-clang=/home/gha/actions-runner/_work/llvm-project/llvm-project/build/bin/clang-24      -o /home/gha/actions-runner/_work/llvm-project/llvm-project/build/tools/clang/test/Analysis/Scalable/ssaf-orchestrator-make/Output/two-pass-compile-and-link.test.tmp/out -- make    | /home/gha/actions-runner/_work/llvm-project/llvm-project/build/bin/FileCheck /home/gha/actions-runner/_work/llvm-project/llvm-project/clang/test/Analysis/Scalable/ssaf-orchestrator-make/two-pass-compile-and-link.test --check-prefix=STDOUT
# executed command: /usr/bin/python3 /home/gha/actions-runner/_work/llvm-project/llvm-project/build/bin/clang-ssaf-orchestrator-make --extract-summaries=PointerFlow,UnsafeBufferUsage --analysis=UnsafeBufferReachableAnalysisResult --transformation=cpp-bounded-buffers --ssaf-clang=/home/gha/actions-runner/_work/llvm-project/llvm-project/build/bin/clang-24 -o /home/gha/actions-runner/_work/llvm-project/llvm-project/build/tools/clang/test/Analysis/Scalable/ssaf-orchestrator-make/Output/two-pass-compile-and-link.test.tmp/out -- make
# .---command stderr------------
# | clang-ssaf-orchestrator-make: error: required tools not resolvable:
# |   --ssaf-report-merge: clang-ssaf-report-merge: not found on PATH
# |   --ssaf-conflict-merge: clang-ssaf-conflict-merge: not found on PATH
# `-----------------------------
# error: command failed with exit status: 1
# executed command: /home/gha/actions-runner/_work/llvm-project/llvm-project/build/bin/FileCheck /home/gha/actions-runner/_work/llvm-project/llvm-project/clang/test/Analysis/Scalable/ssaf-orchestrator-make/two-pass-compile-and-link.test --check-prefix=STDOUT
# .---command stderr------------
# | FileCheck error: '<stdin>' is empty.
# | FileCheck command line:  /home/gha/actions-runner/_work/llvm-project/llvm-project/build/bin/FileCheck /home/gha/actions-runner/_work/llvm-project/llvm-project/clang/test/Analysis/Scalable/ssaf-orchestrator-make/two-pass-compile-and-link.test --check-prefix=STDOUT
# `-----------------------------
# error: command failed with exit status: 2

--

```
</details>
<details>
<summary>Clang.Analysis/Scalable/ssaf-orchestrator-make/two-pass.test</summary>

```
Exit Code: 2

Command Output (stdout):
--
# RUN: at line 3
rm -rf /home/gha/actions-runner/_work/llvm-project/llvm-project/build/tools/clang/test/Analysis/Scalable/ssaf-orchestrator-make/Output/two-pass.test.tmp && split-file /home/gha/actions-runner/_work/llvm-project/llvm-project/clang/test/Analysis/Scalable/ssaf-orchestrator-make/two-pass.test /home/gha/actions-runner/_work/llvm-project/llvm-project/build/tools/clang/test/Analysis/Scalable/ssaf-orchestrator-make/Output/two-pass.test.tmp
# executed command: rm -rf /home/gha/actions-runner/_work/llvm-project/llvm-project/build/tools/clang/test/Analysis/Scalable/ssaf-orchestrator-make/Output/two-pass.test.tmp
# note: command had no output on stdout or stderr
# executed command: split-file /home/gha/actions-runner/_work/llvm-project/llvm-project/clang/test/Analysis/Scalable/ssaf-orchestrator-make/two-pass.test /home/gha/actions-runner/_work/llvm-project/llvm-project/build/tools/clang/test/Analysis/Scalable/ssaf-orchestrator-make/Output/two-pass.test.tmp
# note: command had no output on stdout or stderr
# RUN: at line 4
mkdir -p /home/gha/actions-runner/_work/llvm-project/llvm-project/build/tools/clang/test/Analysis/Scalable/ssaf-orchestrator-make/Output/two-pass.test.tmp/build
# executed command: mkdir -p /home/gha/actions-runner/_work/llvm-project/llvm-project/build/tools/clang/test/Analysis/Scalable/ssaf-orchestrator-make/Output/two-pass.test.tmp/build
# note: command had no output on stdout or stderr
# RUN: at line 6
cd /home/gha/actions-runner/_work/llvm-project/llvm-project/build/tools/clang/test/Analysis/Scalable/ssaf-orchestrator-make/Output/two-pass.test.tmp
# executed command: cd /home/gha/actions-runner/_work/llvm-project/llvm-project/build/tools/clang/test/Analysis/Scalable/ssaf-orchestrator-make/Output/two-pass.test.tmp
# note: command had no output on stdout or stderr
# RUN: at line 7
"/usr/bin/python3" "/home/gha/actions-runner/_work/llvm-project/llvm-project/build/bin/clang-ssaf-orchestrator-make"      --extract-summaries=PointerFlow,UnsafeBufferUsage      --analysis=UnsafeBufferReachableAnalysisResult      --transformation=cpp-bounded-buffers      --ssaf-clang=/home/gha/actions-runner/_work/llvm-project/llvm-project/build/bin/clang-24      -o /home/gha/actions-runner/_work/llvm-project/llvm-project/build/tools/clang/test/Analysis/Scalable/ssaf-orchestrator-make/Output/two-pass.test.tmp/out -- make    | /home/gha/actions-runner/_work/llvm-project/llvm-project/build/bin/FileCheck /home/gha/actions-runner/_work/llvm-project/llvm-project/clang/test/Analysis/Scalable/ssaf-orchestrator-make/two-pass.test --check-prefix=STDOUT
# executed command: /usr/bin/python3 /home/gha/actions-runner/_work/llvm-project/llvm-project/build/bin/clang-ssaf-orchestrator-make --extract-summaries=PointerFlow,UnsafeBufferUsage --analysis=UnsafeBufferReachableAnalysisResult --transformation=cpp-bounded-buffers --ssaf-clang=/home/gha/actions-runner/_work/llvm-project/llvm-project/build/bin/clang-24 -o /home/gha/actions-runner/_work/llvm-project/llvm-project/build/tools/clang/test/Analysis/Scalable/ssaf-orchestrator-make/Output/two-pass.test.tmp/out -- make
# .---command stderr------------
# | clang-ssaf-orchestrator-make: error: required tools not resolvable:
# |   --ssaf-report-merge: clang-ssaf-report-merge: not found on PATH
# |   --ssaf-conflict-merge: clang-ssaf-conflict-merge: not found on PATH
# `-----------------------------
# error: command failed with exit status: 1
# executed command: /home/gha/actions-runner/_work/llvm-project/llvm-project/build/bin/FileCheck /home/gha/actions-runner/_work/llvm-project/llvm-project/clang/test/Analysis/Scalable/ssaf-orchestrator-make/two-pass.test --check-prefix=STDOUT
# .---command stderr------------
# | FileCheck error: '<stdin>' is empty.
# | FileCheck command line:  /home/gha/actions-runner/_work/llvm-project/llvm-project/build/bin/FileCheck /home/gha/actions-runner/_work/llvm-project/llvm-project/clang/test/Analysis/Scalable/ssaf-orchestrator-make/two-pass.test --check-prefix=STDOUT
# `-----------------------------
# error: command failed with exit status: 2

--

```
</details>
<details>
<summary>Clang.CIR/Transforms/canonicalize.cir</summary>

```
Exit Code: 1

Command Output (stdout):
--
# RUN: at line 1
/home/gha/actions-runner/_work/llvm-project/llvm-project/build/bin/cir-opt /home/gha/actions-runner/_work/llvm-project/llvm-project/clang/test/CIR/Transforms/canonicalize.cir -cir-canonicalize -o - | /home/gha/actions-runner/_work/llvm-project/llvm-project/build/bin/FileCheck /home/gha/actions-runner/_work/llvm-project/llvm-project/clang/test/CIR/Transforms/canonicalize.cir
# executed command: /home/gha/actions-runner/_work/llvm-project/llvm-project/build/bin/cir-opt /home/gha/actions-runner/_work/llvm-project/llvm-project/clang/test/CIR/Transforms/canonicalize.cir -cir-canonicalize -o -
# note: command had no output on stdout or stderr
# executed command: /home/gha/actions-runner/_work/llvm-project/llvm-project/build/bin/FileCheck /home/gha/actions-runner/_work/llvm-project/llvm-project/clang/test/CIR/Transforms/canonicalize.cir
# .---command stderr------------
# | /home/gha/actions-runner/_work/llvm-project/llvm-project/clang/test/CIR/Transforms/canonicalize.cir:62:17: error: CHECK-NEXT: is not on the line after the previous match
# |  // CHECK-NEXT: cir.br ^[[HEADER]](%[[KEEP]] : !s32i)
# |                 ^
# | <stdin>:26:2: note: 'next' match was here
# |  cir.br ^bb1(%0 : !s32i)
# |  ^
# | <stdin>:23:35: note: previous match ended here
# |  cir.call @use(%0) : (!s32i) -> ()
# |                                   ^
# | <stdin>:24:1: note: non-matching line after previous match is here
# |  cir.br ^bb2
# | ^
# | 
# | Input file: <stdin>
# | Check file: /home/gha/actions-runner/_work/llvm-project/llvm-project/clang/test/CIR/Transforms/canonicalize.cir
# | 
# | -dump-input=help explains the following input dump.
# | 
# | Input was:
# | <<<<<<
# |            .
# |            .
# |            .
# |           18:  } 
# |           19:  cir.func private @use(!s32i) 
# |           20:  cir.func @no_merge_self_arg_loop(%arg0: !s32i) -> !s32i { 
# |           21:  cir.return %arg0 : !s32i 
# |           22:  ^bb1(%0: !s32i): // pred: ^bb2 
# |           23:  cir.call @use(%0) : (!s32i) -> () 
# | next:62'0                                      {   search range start (exclusive)
# |           24:  cir.br ^bb2 
# |           25:  ^bb2: // pred: ^bb1 
# |           26:  cir.br ^bb1(%0 : !s32i) 
# | next:62'1      !~~~~~~~~~~~~~~~~~~~~~~   error: match on wrong line
# |           27:  } 
# |           28:  cir.func @scope_yield_value_fold() -> !u32i { 
# |           29:  %0 = cir.const #cir.int<7> : !u32i 
# |           30:  cir.return %0 : !u32i 
# |           31:  } 
# |            .
# |            .
# |            .
# |          142:  cir.func @cast_zext_u8_s32() -> !s32i { 
# |          143:  %0 = cir.const #cir.int<255> : !s32i 
# |          144:  cir.return %0 : !s32i 
# |          145:  } 
# |          146: } 
# |          147:  
# | next:62'2      } search range end (exclusive)
# | >>>>>>
# `-----------------------------
# error: command failed with exit status: 1

--

```
</details>

If these failures are unrelated to your changes (for example tests are broken or flaky at HEAD), please open an issue at https://github.com/llvm/llvm-project/issues and add the `infrastructure` label.

https://github.com/llvm/llvm-project/pull/232548


More information about the llvm-branch-commits mailing list