[llvm-branch-commits] [llvm] [llvm-readobj][ELF] Print call graph callees in section order (PR #230649)
via llvm-branch-commits
llvm-branch-commits at lists.llvm.org
Tue Oct 13 21:52:28 PDT 2026
github-actions[bot] wrote:
<!--PREMERGE ADVISOR COMMENT: Windows-->
# :window: Windows x64 Test Results
* 144085 tests passed
* 3560 tests skipped
* 4 tests failed
## Failed Tests
(click on a test name to see its output)
### LLVM
<details>
<summary>LLVM.CodeGen/X86/mem-cache-hint-dag-combine-i386.ll</summary>
```
Exit Code: 1
Command Output (stdout):
--
# RUN: at line 2
c:\_work\llvm-project\llvm-project\build\bin\llc.exe -mtriple=i386 -mattr=+sse2 -stop-after=finalize-isel C:\_work\llvm-project\llvm-project\llvm\test\CodeGen\X86\mem-cache-hint-dag-combine-i386.ll -o - | c:\_work\llvm-project\llvm-project\build\bin\filecheck.exe C:\_work\llvm-project\llvm-project\llvm\test\CodeGen\X86\mem-cache-hint-dag-combine-i386.ll
# executed command: 'c:\_work\llvm-project\llvm-project\build\bin\llc.exe' -mtriple=i386 -mattr=+sse2 -stop-after=finalize-isel 'C:\_work\llvm-project\llvm-project\llvm\test\CodeGen\X86\mem-cache-hint-dag-combine-i386.ll' -o -
# note: command had no output on stdout or stderr
# executed command: 'c:\_work\llvm-project\llvm-project\build\bin\filecheck.exe' 'C:\_work\llvm-project\llvm-project\llvm\test\CodeGen\X86\mem-cache-hint-dag-combine-i386.ll'
# .---command stderr------------
# | C:\_work\llvm-project\llvm-project\llvm\test\CodeGen\X86\mem-cache-hint-dag-combine-i386.ll:21:16: error: CHECK-NEXT: expected string not found in input
# | ; CHECK-NEXT: [[LD_Fp64m80_:%[0-9]+]]:rfp80 = nofpexcept LD_Fp64m80 killed [[MOV32rm]], 1, $noreg, 0, $noreg, implicit-def dead $fpsw, implicit $fpcw :: (load (s64) from %ir.p, !mem.cache_hint !1)
# | ^
# | <stdin>:170:92: note: scanning from here
# | %0:gr32 = MOV32rm %fixed-stack.0, 1, $noreg, 0, $noreg :: (load (s32) from %fixed-stack.0)
# | ^
# | <stdin>:170:92: note: with "MOV32rm" equal to "%0"
# | %0:gr32 = MOV32rm %fixed-stack.0, 1, $noreg, 0, $noreg :: (load (s32) from %fixed-stack.0)
# | ^
# | <stdin>:170:92: note: pattern attempts to capture variables: "LD_Fp64m80_"
# | %0:gr32 = MOV32rm %fixed-stack.0, 1, $noreg, 0, $noreg :: (load (s32) from %fixed-stack.0)
# | ^
# | <stdin>:171:2: note: possible intended match here
# | %1:rfp80 = nofpexcept LD_Fp64m80 %0, 1, $noreg, 0, $noreg, implicit-def dead $fpsw, implicit $fpcw :: (load (s64) from %ir.p, !mem.cache_hint !1)
# | ^
# | C:\_work\llvm-project\llvm-project\llvm\test\CodeGen\X86\mem-cache-hint-dag-combine-i386.ll:38:16: error: CHECK-NEXT: expected string not found in input
# | ; CHECK-NEXT: [[LD_Fp64m80_:%[0-9]+]]:rfp80 = nofpexcept LD_Fp64m80 killed [[MOV32rm]], 1, $noreg, 0, $noreg, implicit-def dead $fpsw, implicit $fpcw :: (load (s64) from %ir.p)
# | ^
# | <stdin>:235:92: note: scanning from here
# | %0:gr32 = MOV32rm %fixed-stack.0, 1, $noreg, 0, $noreg :: (load (s32) from %fixed-stack.0)
# | ^
# | <stdin>:235:92: note: with "MOV32rm" equal to "%0"
# | %0:gr32 = MOV32rm %fixed-stack.0, 1, $noreg, 0, $noreg :: (load (s32) from %fixed-stack.0)
# | ^
# | <stdin>:235:92: note: pattern attempts to capture variables: "LD_Fp64m80_"
# | %0:gr32 = MOV32rm %fixed-stack.0, 1, $noreg, 0, $noreg :: (load (s32) from %fixed-stack.0)
# | ^
# | <stdin>:236:2: note: possible intended match here
# | %1:rfp80 = nofpexcept LD_Fp64m80 %0, 1, $noreg, 0, $noreg, implicit-def dead $fpsw, implicit $fpcw :: (load (s64) from %ir.p)
# | ^
# |
# | Input file: <stdin>
# | Check file: C:\_work\llvm-project\llvm-project\llvm\test\CodeGen\X86\mem-cache-hint-dag-combine-i386.ll
# |
# | -dump-input=help explains the following input dump.
# |
# | Input was:
# | <<<<<<
# | .
# | .
# | .
# | 165: constants: []
# | 166: machineFunctionInfo:
# | 167: amxProgModel: None
# | 168: body: |
# | 169: bb.0 (%ir-block.0):
# | 170: %0:gr32 = MOV32rm %fixed-stack.0, 1, $noreg, 0, $noreg :: (load (s32) from %fixed-stack.0)
# | next:21'0 { search range start (exclusive)
# | next:21'1 error: no match found in search range
# | next:21'2 with "MOV32rm" equal to "%0"
# | next:21'3 pattern attempts to capture variables: "LD_Fp64m80_"
# | 171: %1:rfp80 = nofpexcept LD_Fp64m80 %0, 1, $noreg, 0, $noreg, implicit-def dead $fpsw, implicit $fpcw :: (load (s64) from %ir.p, !mem.cache_hint !1)
# | next:21'4 ? possible intended match
# | 172: RET 0, %1
# | 173: ...
# | 174: ---
# | 175: name: combine_consecutive_loads_as_double_different
# | next:21'5 } search range end (exclusive)
# | 176: alignment: 1
# | 177: exposesReturnsTwice: false
# | 178: legalized: false
# | 179: regBankSelected: false
# | 180: selected: false
# | .
# | .
# | .
# | 230: constants: []
# | 231: machineFunctionInfo:
# | 232: amxProgModel: None
# | 233: body: |
# | 234: bb.0 (%ir-block.0):
# | 235: %0:gr32 = MOV32rm %fixed-stack.0, 1, $noreg, 0, $noreg :: (load (s32) from %fixed-stack.0)
# | next:38'0 { search range start (exclusive)
# | next:38'1 error: no match found in search range
# | next:38'2 with "MOV32rm" equal to "%0"
# | next:38'3 pattern attempts to capture variables: "LD_Fp64m80_"
# | 236: %1:rfp80 = nofpexcept LD_Fp64m80 %0, 1, $noreg, 0, $noreg, implicit-def dead $fpsw, implicit $fpcw :: (load (s64) from %ir.p)
# | next:38'4 ? possible intended match
# | 237: RET 0, %1
# | 238: ...
# | next:38'5 } search range end (exclusive)
# | >>>>>>
# `-----------------------------
# error: command failed with exit status: 1
--
```
</details>
<details>
<summary>LLVM.CodeGen/X86/mem-cache-hint-dag-combine.ll</summary>
```
Exit Code: 1
Command Output (stdout):
--
# RUN: at line 2
c:\_work\llvm-project\llvm-project\build\bin\llc.exe -mtriple=x86_64 -mattr=+avx2 -stop-after=finalize-isel -combiner-reduce-load-op-store-width-force-narrowing-profitable=1 C:\_work\llvm-project\llvm-project\llvm\test\CodeGen\X86\mem-cache-hint-dag-combine.ll -o - | c:\_work\llvm-project\llvm-project\build\bin\filecheck.exe C:\_work\llvm-project\llvm-project\llvm\test\CodeGen\X86\mem-cache-hint-dag-combine.ll
# executed command: 'c:\_work\llvm-project\llvm-project\build\bin\llc.exe' -mtriple=x86_64 -mattr=+avx2 -stop-after=finalize-isel -combiner-reduce-load-op-store-width-force-narrowing-profitable=1 'C:\_work\llvm-project\llvm-project\llvm\test\CodeGen\X86\mem-cache-hint-dag-combine.ll' -o -
# note: command had no output on stdout or stderr
# executed command: 'c:\_work\llvm-project\llvm-project\build\bin\filecheck.exe' 'C:\_work\llvm-project\llvm-project\llvm\test\CodeGen\X86\mem-cache-hint-dag-combine.ll'
# .---command stderr------------
# | C:\_work\llvm-project\llvm-project\llvm\test\CodeGen\X86\mem-cache-hint-dag-combine.ll:134:16: error: CHECK-NEXT: expected string not found in input
# | ; CHECK-NEXT: MOV8mr [[COPY1]], 1, $noreg, 0, $noreg, killed [[COPY2]] :: (store (s8) into %ir.p, align 4, !alias.scope !6, !noalias !9, !mem.cache_hint !1)
# | ^
# | <stdin>:812:27: note: scanning from here
# | %2:gr8 = COPY %1.sub_8bit
# | ^
# | <stdin>:812:27: note: with "COPY1" equal to "%0"
# | %2:gr8 = COPY %1.sub_8bit
# | ^
# | <stdin>:812:27: note: with "COPY2" equal to "%2"
# | %2:gr8 = COPY %1.sub_8bit
# | ^
# | <stdin>:813:2: note: possible intended match here
# | MOV8mr %0, 1, $noreg, 0, $noreg, %2 :: (store (s8) into %ir.p, align 4, !alias.scope !6, !noalias !9, !mem.cache_hint !1)
# | ^
# | C:\_work\llvm-project\llvm-project\llvm\test\CodeGen\X86\mem-cache-hint-dag-combine.ll:166:16: error: CHECK-NEXT: expected string not found in input
# | ; CHECK-NEXT: MOV16mr [[COPY1]], 1, $noreg, 0, $noreg, killed [[COPY2]] :: (store (s16) into %ir.p, !mem.cache_hint !1)
# | ^
# | <stdin>:945:29: note: scanning from here
# | %2:gr16 = COPY %1.sub_16bit
# | ^
# | <stdin>:945:29: note: with "COPY1" equal to "%0"
# | %2:gr16 = COPY %1.sub_16bit
# | ^
# | <stdin>:945:29: note: with "COPY2" equal to "%2"
# | %2:gr16 = COPY %1.sub_16bit
# | ^
# | <stdin>:946:2: note: possible intended match here
# | MOV16mr %0, 1, $noreg, 0, $noreg, %2 :: (store (s16) into %ir.p, !mem.cache_hint !1)
# | ^
# | C:\_work\llvm-project\llvm-project\llvm\test\CodeGen\X86\mem-cache-hint-dag-combine.ll:185:16: error: CHECK-NEXT: expected string not found in input
# | ; CHECK-NEXT: MOV16mr [[COPY1]], 1, $noreg, 0, $noreg, killed [[COPY2]] :: (store (s16) into %ir.p)
# | ^
# | <stdin>:1014:29: note: scanning from here
# | %2:gr16 = COPY %1.sub_16bit
# | ^
# | <stdin>:1014:29: note: with "COPY1" equal to "%0"
# | %2:gr16 = COPY %1.sub_16bit
# | ^
# | <stdin>:1014:29: note: with "COPY2" equal to "%2"
# | %2:gr16 = COPY %1.sub_16bit
# | ^
# | <stdin>:1015:2: note: possible intended match here
# | MOV16mr %0, 1, $noreg, 0, $noreg, %2 :: (store (s16) into %ir.p)
# | ^
# | C:\_work\llvm-project\llvm-project\llvm\test\CodeGen\X86\mem-cache-hint-dag-combine.ll:298:16: error: CHECK-NEXT: expected string not found in input
# | ; CHECK-NEXT: MOV32mr [[COPY1]], 1, $noreg, 0, $noreg, killed [[MOV32rm]] :: (store (s32) into %ir.dst, !mem.cache_hint !1)
# | ^
# | <stdin>:1343:93: note: scanning from here
# | %2:gr32 = MOV32rm %1, 1, $noreg, 0, $noreg :: (load (s32) from %ir.src, !mem.cache_hint !1)
# | ^
# | <stdin>:1343:93: note: with "COPY1" equal to "%0"
# | %2:gr32 = MOV32rm %1, 1, $noreg, 0, $noreg :: (load (s32) from %ir.src, !mem.cache_hint !1)
# | ^
# | <stdin>:1343:93: note: with "MOV32rm" equal to "%2"
# | %2:gr32 = MOV32rm %1, 1, $noreg, 0, $noreg :: (load (s32) from %ir.src, !mem.cache_hint !1)
# | ^
# | <stdin>:1344:2: note: possible intended match here
# | MOV32mr %0, 1, $noreg, 0, $noreg, %2 :: (store (s32) into %ir.dst, !mem.cache_hint !1)
# | ^
# | C:\_work\llvm-project\llvm-project\llvm\test\CodeGen\X86\mem-cache-hint-dag-combine.ll:325:16: error: CHECK-NEXT: expected string not found in input
# | ; CHECK-NEXT: MOV32mr [[COPY1]], 1, $noreg, 0, $noreg, killed [[MOV32rm]] :: (store (s32) into %ir.dst)
# | ^
# | <stdin>:1412:73: note: scanning from here
# | %2:gr32 = MOV32rm %1, 1, $noreg, 0, $noreg :: (load (s32) from %ir.src)
# | ^
# | <stdin>:1412:73: note: with "COPY1" equal to "%0"
# | %2:gr32 = MOV32rm %1, 1, $noreg, 0, $noreg :: (load (s32) from %ir.src)
# | ^
# | <stdin>:1412:73: note: with "MOV32rm" equal to "%2"
# | %2:gr32 = MOV32rm %1, 1, $noreg, 0, $noreg :: (load (s32) from %ir.src)
# | ^
# | <stdin>:1413:2: note: possible intended match here
# | MOV32mr %0, 1, $noreg, 0, $noreg, %2 :: (store (s32) into %ir.dst)
# | ^
# | C:\_work\llvm-project\llvm-project\llvm\test\CodeGen\X86\mem-cache-hint-dag-combine.ll:404:16: error: CHECK-NEXT: expected string not found in input
# | ; CHECK-NEXT: TEST8ri killed [[COPY3]], 1, implicit-def $eflags
# | ^
# | <stdin>:1685:27: note: scanning from here
# | %3:gr8 = COPY %0.sub_8bit
# | ^
# | <stdin>:1685:27: note: with "COPY3" equal to "%3"
# | %3:gr8 = COPY %0.sub_8bit
# | ^
# | <stdin>:1686:2: note: possible intended match here
# | TEST8ri %3, 1, implicit-def $eflags
# | ^
# | C:\_work\llvm-project\llvm-project\llvm\test\CodeGen\X86\mem-cache-hint-dag-combine.ll:424:16: error: CHECK-NEXT: expected string not found in input
# | ; CHECK-NEXT: TEST8ri killed [[COPY3]], 1, implicit-def $eflags
# | ^
# | <stdin>:1762:27: note: scanning from here
# | %3:gr8 = COPY %0.sub_8bit
# | ^
# | <stdin>:1762:27: note: with "COPY3" equal to "%3"
# | %3:gr8 = COPY %0.sub_8bit
# | ^
# | <stdin>:1763:2: note: possible intended match here
# | TEST8ri %3, 1, implicit-def $eflags
# | ^
# |
# | Input file: <stdin>
# | Check file: C:\_work\llvm-project\llvm-project\llvm\test\CodeGen\X86\mem-cache-hint-dag-combine.ll
# |
# | -dump-input=help explains the following input dump.
# |
# | Input was:
# | <<<<<<
# | .
# | .
# | .
# | 807: bb.0 (%ir-block.0):
# | 808: liveins: $rdi, $esi
# | 809:
# | 810: %1:gr32 = COPY $esi
# | 811: %0:gr64 = COPY $rdi
# | 812: %2:gr8 = COPY %1.sub_8bit
# | next:134'0 { search range start (exclusive)
# | next:134'1 error: no match found in search range
# | next:134'2 with "COPY1" equal to "%0"
# | next:134'3 with "COPY2" equal to "%2"
# | 813: MOV8mr %0, 1, $noreg, 0, $noreg, %2 :: (store (s8) into %ir.p, align 4, !alias.scope !6, !noalias !9, !mem.cache_hint !1)
# | next:134'4 ? possible intended match
# | 814: RET 0
# | 815: ...
# | 816: ---
# | 817: name: reduce_load_op_store
# | next:134'5 } search range end (exclusive)
# | 818: alignment: 1
# | 819: exposesReturnsTwice: false
# | 820: legalized: false
# | 821: regBankSelected: false
# | 822: selected: false
# | .
# | .
# | .
# | 940: bb.0 (%ir-block.0):
# | 941: liveins: $rdi, $esi
# | 942:
# | 943: %1:gr32 = COPY $esi
# | 944: %0:gr64 = COPY $rdi
# | 945: %2:gr16 = COPY %1.sub_16bit
# | next:166'0 { search range start (exclusive)
# | next:166'1 error: no match found in search range
# | next:166'2 with "COPY1" equal to "%0"
# | next:166'3 with "COPY2" equal to "%2"
# | 946: MOV16mr %0, 1, $noreg, 0, $noreg, %2 :: (store (s16) into %ir.p, !mem.cache_hint !1)
# | next:166'4 ? possible intended match
# | 947: RET 0
# | 948: ...
# | 949: ---
# | 950: name: merge_trunc_stores_different
# | next:166'5 } search range end (exclusive)
# | 951: alignment: 1
# | 952: exposesReturnsTwice: false
# | 953: legalized: false
# | 954: regBankSelected: false
# | 955: selected: false
# | .
# | .
# | .
# | 1009: bb.0 (%ir-block.0):
# | 1010: liveins: $rdi, $esi
# | 1011:
# | 1012: %1:gr32 = COPY $esi
# | 1013: %0:gr64 = COPY $rdi
# | 1014: %2:gr16 = COPY %1.sub_16bit
# | next:185'0 { search range start (exclusive)
# | next:185'1 error: no match found in search range
# | next:185'2 with "COPY1" equal to "%0"
# | next:185'3 with "COPY2" equal to "%2"
# | 1015: MOV16mr %0, 1, $noreg, 0, $noreg, %2 :: (store (s16) into %ir.p)
# | next:185'4 ? possible intended match
# | 1016: RET 0
# | 1017: ...
# | 1018: ---
# | 1019: name: match_load_combine_same
# | next:185'5 } search range end (exclusive)
# | 1020: alignment: 1
# | 1021: exposesReturnsTwice: false
# | 1022: legalized: false
# | 1023: regBankSelected: false
# | 1024: selected: false
# | .
# | .
# | .
# | 1338: bb.0 (%ir-block.0):
# | 1339: liveins: $rdi, $rsi
# | 1340:
# | 1341: %1:gr64 = COPY $rsi
# | 1342: %0:gr64 = COPY $rdi
# | 1343: %2:gr32 = MOV32rm %1, 1, $noreg, 0, $noreg :: (load (s32) from %ir.src, !mem.cache_hint !1)
# | next:298'0 { search range start (exclusive)
# | next:298'1 error: no match found in search range
# | next:298'2 with "COPY1" equal to "%0"
# | next:298'3 with "MOV32rm" equal to "%2"
# | 1344: MOV32mr %0, 1, $noreg, 0, $noreg, %2 :: (store (s32) into %ir.dst, !mem.cache_hint !1)
# | next:298'4 ? possible intended match
# | 1345: RET 0
# | 1346: .
# | ...
# `---data was truncated (10240/14281) (change limit with -D output_limit=N)
# error: command failed with exit status: 1
--
```
</details>
### Clang
<details>
<summary>Clang.Analysis/Scalable/ssaf-orchestrator-make/bad-args.test</summary>
```
Exit Code: 1
Command Output (stdout):
--
# RUN: at line 2
not "C:/Python312/python.exe" "C:\_work\llvm-project\llvm-project\build\bin\clang-ssaf-orchestrator-make" 2>&1 | c:\_work\llvm-project\llvm-project\build\bin\filecheck.exe C:\_work\llvm-project\llvm-project\clang\test\Analysis\Scalable\ssaf-orchestrator-make\bad-args.test --check-prefix=NO-EXTRACTORS
# executed command: not C:/Python312/python.exe 'C:\_work\llvm-project\llvm-project\build\bin\clang-ssaf-orchestrator-make'
# note: command had no output on stdout or stderr
# executed command: 'c:\_work\llvm-project\llvm-project\build\bin\filecheck.exe' 'C:\_work\llvm-project\llvm-project\clang\test\Analysis\Scalable\ssaf-orchestrator-make\bad-args.test' --check-prefix=NO-EXTRACTORS
# note: command had no output on stdout or stderr
# RUN: at line 5
not "C:/Python312/python.exe" "C:\_work\llvm-project\llvm-project\build\bin\clang-ssaf-orchestrator-make" --extract-summaries=PointerFlow 2>&1 | c:\_work\llvm-project\llvm-project\build\bin\filecheck.exe C:\_work\llvm-project\llvm-project\clang\test\Analysis\Scalable\ssaf-orchestrator-make\bad-args.test --check-prefix=NO-BUILD
# executed command: not C:/Python312/python.exe 'C:\_work\llvm-project\llvm-project\build\bin\clang-ssaf-orchestrator-make' --extract-summaries=PointerFlow
# note: command had no output on stdout or stderr
# executed command: 'c:\_work\llvm-project\llvm-project\build\bin\filecheck.exe' 'C:\_work\llvm-project\llvm-project\clang\test\Analysis\Scalable\ssaf-orchestrator-make\bad-args.test' --check-prefix=NO-BUILD
# note: command had no output on stdout or stderr
# RUN: at line 9
not "C:/Python312/python.exe" "C:\_work\llvm-project\llvm-project\build\bin\clang-ssaf-orchestrator-make" --extract-summaries=PointerFlow --ssaf-clang=/no/such/clang -- make 2>&1 | c:\_work\llvm-project\llvm-project\build\bin\filecheck.exe C:\_work\llvm-project\llvm-project\clang\test\Analysis\Scalable\ssaf-orchestrator-make\bad-args.test --check-prefix=NO-CLANG
# executed command: not C:/Python312/python.exe 'C:\_work\llvm-project\llvm-project\build\bin\clang-ssaf-orchestrator-make' --extract-summaries=PointerFlow --ssaf-clang=/no/such/clang -- make
# note: command had no output on stdout or stderr
# executed command: 'c:\_work\llvm-project\llvm-project\build\bin\filecheck.exe' 'C:\_work\llvm-project\llvm-project\clang\test\Analysis\Scalable\ssaf-orchestrator-make\bad-args.test' --check-prefix=NO-CLANG
# .---command stderr------------
# | C:\_work\llvm-project\llvm-project\clang\test\Analysis\Scalable\ssaf-orchestrator-make\bad-args.test:13:13: error: NO-CLANG: expected string not found in input
# | # NO-CLANG: --ssaf-clang: not a file: /no/such/clang
# | ^
# | <stdin>:1:68: note: scanning from here
# | clang-ssaf-orchestrator-make: error: required tools not resolvable:
# | ^
# | <stdin>:2:2: note: possible intended match here
# | --ssaf-clang: /no/such/clang: not found on PATH
# | ^
# |
# | Input file: <stdin>
# | Check file: C:\_work\llvm-project\llvm-project\clang\test\Analysis\Scalable\ssaf-orchestrator-make\bad-args.test
# |
# | -dump-input=help explains the following input dump.
# |
# | Input was:
# | <<<<<<
# | 1: clang-ssaf-orchestrator-make: error: required tools not resolvable:
# | check:13'0 { search range start (exclusive)
# | check:13'1 error: no match found in search range
# | 2: --ssaf-clang: /no/such/clang: not found on PATH
# | check:13'2 ? possible intended match
# | check:13'3 } search range end (exclusive)
# | >>>>>>
# `-----------------------------
# error: command failed with exit status: 1
--
```
</details>
<details>
<summary>Clang.Analysis/Scalable/ssaf-orchestrator-make/unittests.test</summary>
```
Exit Code: 1
Command Output (stdout):
--
# RUN: at line 2
env PYTHONDONTWRITEBYTECODE=1 PYTHONPATH=C:\_work\llvm-project\llvm-project\build\lib "C:/Python312/python.exe" -m unittest discover -s C:\_work\llvm-project\llvm-project\clang\tools\clang-ssaf-orchestrator-make/tests -t C:\_work\llvm-project\llvm-project\clang\tools\clang-ssaf-orchestrator-make > C:\_work\llvm-project\llvm-project\build\tools\clang\test\Analysis\Scalable\ssaf-orchestrator-make\Output\unittests.test.tmp.log 2>&1
# executed command: env PYTHONDONTWRITEBYTECODE=1 'PYTHONPATH=C:\_work\llvm-project\llvm-project\build\lib' C:/Python312/python.exe -m unittest discover -s 'C:\_work\llvm-project\llvm-project\clang\tools\clang-ssaf-orchestrator-make/tests' -t 'C:\_work\llvm-project\llvm-project\clang\tools\clang-ssaf-orchestrator-make'
# .---redirected output from 'C:\_work\llvm-project\llvm-project\build\tools\clang\test\Analysis\Scalable\ssaf-orchestrator-make\Output\unittests.test.tmp.log'
# | ........EEEEEFFFF..EEEE.EE.................EEE.....EEE..EEEE.EEE...FF...........FF.FFFFFF.FFFF.FF...F.F...FF.....................E............EEEEE..FF..........EEEEEE............................................EEEE.EEEE...F...........EEEEEE.E.........EE..EEEEEEEE...........
# | ======================================================================
# | ERROR: test_a_member_that_is_not_an_object_is_not_an_input (tests.test_ar_shim.SsafStep.test_a_member_that_is_not_an_object_is_not_an_input)
# | ----------------------------------------------------------------------
# | Traceback (most recent call last):
# | File "C:\_work\llvm-project\llvm-project\clang\tools\clang-ssaf-orchestrator-make\tests\test_ar_shim.py", line 88, in test_a_member_that_is_not_an_object_is_not_an_input
# | self._summary("build/a.o")
# | File "C:\_work\llvm-project\llvm-project\clang\tools\clang-ssaf-orchestrator-make\tests\test_ar_shim.py", line 37, in _summary
# | records.get_path_for_artifact(
# | File "C:\_work\llvm-project\llvm-project\build\lib\clang_ssaf_orchestrator_make\ssaf_artifact_repository.py", line 48, in get_path_for_artifact
# | return coalesce_root_path(
# | ^^^^^^^^^^^^^^^^^^^
# | File "C:\_work\llvm-project\llvm-project\build\lib\clang_ssaf_orchestrator_make\utils.py", line 15, in coalesce_root_path
# | raise ValueError("path leaves %s: %s" % (root, coalesced))
# | ValueError: path leaves C:\Users\ContainerAdministrator\AppData\Local\Temp\lit-tmp-r6k6se10\tmp7hqmbz0z\out\ssaf-artifacts: C:\Users\ContainerAdministrator\AppData\Local\Temp\lit-tmp-r6k6se10\tmp7hqmbz0z\project\build\a.o.summary.json
# |
# | ======================================================================
# | ERROR: test_a_member_the_run_never_touched_is_not_an_input (tests.test_ar_shim.SsafStep.test_a_member_the_run_never_touched_is_not_an_input)
# | ----------------------------------------------------------------------
# | Traceback (most recent call last):
# | File "C:\_work\llvm-project\llvm-project\clang\tools\clang-ssaf-orchestrator-make\tests\test_ar_shim.py", line 56, in test_a_member_the_run_never_touched_is_not_an_input
# | ar.invoke_ssaf_tools(shim, self.root)
# | File "C:\_work\llvm-project\llvm-project\build\lib\clang_ssaf_orchestrator_make\shims\ar.py", line 61, in invoke_ssaf_tools
# | input_build_artifact_ids = filter_build_artifacts(
# | ^^^^^^^^^^^^^^^^^^^^^^^
# | File "C:\_work\llvm-project\llvm-project\build\lib\clang_ssaf_orchestrator_make\shims\commands.py", line 41, in filter_build_artifacts
# | artifact_of(ssaf_artifact_repo, build_artifact_id, SSAFArtifactKind.SUMMARY)
# | File "C:\_work\llvm-project\llvm-project\build\lib\clang_ssaf_orchestrator_make\shims\commands.py", line 27, in artifact_of
# | if not ssaf_artifact_repo.has_artifact(ssaf_artifact_id):
# | ^^^^^^^^^^^^^^^^^^^^^^^^^^^^^^^^^^^^^^^^^^^^^^^^^
# | File "C:\_work\llvm-project\llvm-project\build\lib\clang_ssaf_orchestrator_make\ssaf_artifact_repository.py", line 55, in has_artifact
# | return os.path.exists(self.get_path_for_artifact(ssaf_artifact_id))
# | ^^^^^^^^^^^^^^^^^^^^^^^^^^^^^^^^^^^^^^^^^^^^
# | File "C:\_work\llvm-project\llvm-project\build\lib\clang_ssaf_orchestrator_make\ssaf_artifact_repository.py", line 48, in get_path_for_artifact
# | return coalesce_root_path(
# | ^^^^^^^^^^^^^^^^^^^
# | File "C:\_work\llvm-project\llvm-project\build\lib\clang_ssaf_orchestrator_make\utils.py", line 15, in coalesce_root_path
# | raise ValueError("path leaves %s: %s" % (root, coalesced))
# | ValueError: path leaves C:\Users\ContainerAdministrator\AppData\Local\Temp\lit-tmp-r6k6se10\tmp61wau76i\out\ssaf-artifacts: C:\Users\ContainerAdministrator\AppData\Local\Temp\lit-tmp-r6k6se10\tmp61wau76i\project\build\a.o.summary.json
# |
# | ======================================================================
# | ERROR: test_in_the_transformation_pass_the_edits_are_merged_instead (tests.test_ar_shim.SsafStep.test_in_the_transformation_pass_the_edits_are_merged_instead)
# | ----------------------------------------------------------------------
# | Traceback (most recent call last):
# | File "C:\_work\llvm-project\llvm-project\clang\tools\clang-ssaf-orchestrator-make\tests\test_ar_shim.py", line 105, in test_in_the_transformation_pass_the_edits_are_merged_instead
# | ar.invoke_ssaf_tools(shim, self.root)
# | File "C:\_work\llvm-project\llvm-project\build\lib\clang_ssaf_orchestrator_make\shims\ar.py", line 61, in invoke_ssaf_tools
# | input_build_artifact_ids = filter_build_artifacts(
# | ^^^^^^^^^^^^^^^^^^^^^^^
# | File "C:\_work\llvm-project\llvm-project\build\lib\clang_ssaf_orchestrator_make\shims\commands.py", line 41, in filter_build_artifacts
# | artifact_of(ssaf_artifact_repo, build_artifact_id, SSAFArtifactKind.SUMMARY)
# | File "C:\_work\llvm-project\llvm-project\build\lib\clang_ssaf_orchestrator_make\shims\commands.py", line 27, in artifact_of
# | if not ssaf_artifact_repo.has_artifact(ssaf_artifact_id):
# | ^^^^^^^^^^^^^^^^^^^^^^^^^^^^^^^^^^^^^^^^^^^^^^^^^
# | File "C:\_work\llvm-project\llvm-project\build\lib\clang_ssaf_orchestrator_make\ssaf_artifact_repository.py", line 55, in has_artifact
# | return os.path.exists(self.get_path_for_artifact(ssaf_artifact_id))
# | ^^^^^^^^^^^^^^^^^^^^^^^^^^^^^^^^^^^^^^^^^^^^
# | File "C:\_work\llvm-project\llvm-project\build\lib\clang_ssaf_orchestrator_make\ssaf_artifact_repository.py", line 48, in get_path_for_artifact
# | return coalesce_root_path(
# | ^^^^^^^^^^^^^^^^^^^
# | File "C:\_work\llvm-project\llvm-project\build\lib\clang_ssaf_orchestrator_make\utils.py", line 15, in coalesce_root_path
# | raise ValueError("path leaves %s: %s" % (root, coalesced))
# | ValueError: path leaves C:\Users\ContainerAdministrator\AppData\Local\Temp\lit-tmp-r6k6se10\tmp_rha_zwb\out\ssaf-artifacts: C:\Users\ContainerAdministrator\AppData\Local\Temp\lit-tmp-r6k6se10\tmp_rha_zwb\project\build\a.o.summary.json
# |
# | ======================================================================
# | ERROR: test_the_namespace_is_the_archives_file_name_not_its_path (tests.test_ar_shim.SsafStep.test_the_namespace_is_the_archives_file_name_not_its_path)
# | ----------------------------------------------------------------------
# | Traceback (most recent call last):
# | File "C:\_work\llvm-project\llvm-project\clang\tools\clang-ssaf-orchestrator-make\tests\test_ar_shim.py", line 81, in test_the_namespace_is_the_archives_file_name_not_its_path
# | self._summary("build/a.o")
# | File "C:\_work\llvm-project\llvm-project\clang\tools\clang-ssaf-orchestrator-make\tests\test_ar_shim.py", line 37, in _summary
# | records.get_path_for_artifact(
# | File "C:\_work\llvm-project\llvm-project\build\lib\clang_ssaf_orchestrator_make\ssaf_artifact_repository.py", line 48, in get_path_for_artifact
# | return coalesce_root_path(
# | ^^^^^^^^^^^^^^^^^^^
# | File "C:\_work\llvm-project\llvm-project\build\lib\clang_ssaf_orchestrator_make\utils.py", line 15, in coalesce_root_path
# | raise ValueError("path leaves %s: %s" % (root, coalesced))
# | ValueError: path leaves C:\Users\ContainerAdministrator\AppData\Local\Temp\lit-tmp-r6k6se10\tmpr3ocg_fh\out\ssaf-artifacts: C:\Users\ContainerAdministrator\AppData\Local\Temp\lit-tmp-r6k6se10\tmpr3ocg_fh\project\build\a.o.summary.json
# |
# | ======================================================================
# | ERROR: test_the_summaries_that_exist_are_handed_to_the_linker (tests.test_ar_shim.SsafStep.test_the_summaries_that_exist_are_handed_to_the_linker)
# | ----------------------------------------------------------------------
# | Traceback (most recent call last):
# | File "C:\_work\llvm-project\llvm-project\clang\tools\clang-ssaf-orchestrator-make\tests\test_ar_shim.py", line 69, in test_the_summaries_that_exist_are_handed_to_the_linker
# | self._summary("build/a.o")
# | File "C:\_work\llvm-project\llvm-project\clang\tools\clang-ssaf-orchestrator-make\tests\test_ar_shim.py", line 37, in _summary
# | records.get_path_for_artifact(
# | File "C:\_work\llvm-project\llvm-project\build\lib\clang_ssaf_orchestrator_make\ssaf_artifact_repository.py", line 48, in get_path_for_artifact
# | return coalesce_root_path(
# | ^^^^^^^^^^^^^^^^^^^
# | File "C:\_work\llvm-project\llvm-project\build\lib\clang_ssaf_orchestrator_make\utils.py", line 15, in coalesce_root_path
# | raise ValueError("path leaves %s: %s" % (root, coalesced))
# | ValueError: path leaves C:\Users\ContainerAdministrator\AppData\Local\Temp\lit-tmp-r6k6se10\tmpkdpq0uk5\out\ssaf-artifacts: C:\Users\ContainerAdministrator\AppData\Local\Temp\lit-tmp-r6k6se10\tmpkdpq0uk5\project\build\a.o.summary.json
# |
# | ======================================================================
# | ERROR: test_a_record_whose_output_extends_another_is_not_read_back (tests.test_build_graph.BuildstepRecords.test_a_record_whose_output_extends_another_is_not_read_back)
# | ----------------------------------------------------------------------
# | Traceback (most recent call last):
# | File "C:\_work\llvm-project\llvm-project\clang\tools\clang-ssaf-orchestrator-make\tests\test_build_graph.py", line 129, in test_a_record_whose_output_extends_another_is_not_read_back
# | self.graph.record_build_step(
# | File "C:\_work\llvm-project\llvm-project\build\lib\clang_ssaf_orchestrator_make\build_graph.py", line 46, in record_build_step
# | path = make_parents(self.get_buildstep_record_path(output_build_artifact_id))
# | ^^^^^^^^^^^^^^^^^^^^^^^^^^^^^^^^^^^^^^^^^^^^^^^^^^^^^^^^
# | File "C:\_work\llvm-project\llvm-project\build\lib\clang_ssaf_orchestrator_make\build_graph.py", line 37, in get_buildstep_record_path
# | return coalesce_root_path(
# | ^^^^^^^^^^^^^^^^^^^
# | File "C:\_work\llvm-project\llvm-project\build\lib\clang_ssaf_orchestrator_make\utils.py", line 15, in coalesce_root_path
# | raise ValueError("path leaves %s: %s" % (root, coalesced))
# | ValueError: path leaves C:\Users\ContainerAdministrator\AppData\Local\Temp\lit-tmp-r6k6se10\tmpxkcw7uup\build-graph: C:\p\prg.o.buildstep.json
# |
# | ======================================================================
# | ERROR: test_a_summary_beside_a_record_is_not_read_as_one (tests.test_build_graph.BuildstepRecords.te
# | ...
# `---data was truncated (10240/115719) (change limit with -D output_limit=N)
# note: command had no output on stdout or stderr
# error: command failed with exit status: 1
--
```
</details>
If these failures are unrelated to your changes (for example tests are broken or flaky at HEAD), please open an issue at https://github.com/llvm/llvm-project/issues and add the `infrastructure` label.
https://github.com/llvm/llvm-project/pull/230649
More information about the llvm-branch-commits
mailing list