[clang] [Clang][Sema] Add -Wredundant-defer to diagnose redundant `_Defer`s (PR #225748)
via cfe-commits
cfe-commits at lists.llvm.org
Thu Oct 1 09:01:01 PDT 2026
github-actions[bot] wrote:
<!--PREMERGE ADVISOR COMMENT: Windows-->
# :window: Windows x64 Test Results
The build failed before running any tests. Click on a failure below to see the details.
<details>
<summary>[code=3221225501] tools/clang/include/clang/Basic/DiagnosticAnalysisKinds.inc C:/_work/llvm-project/llvm-project/build/tools/clang/include/clang/Basic/DiagnosticAnalysisKinds.inc</summary>
```
FAILED: [code=3221225501] tools/clang/include/clang/Basic/DiagnosticAnalysisKinds.inc C:/_work/llvm-project/llvm-project/build/tools/clang/include/clang/Basic/DiagnosticAnalysisKinds.inc
C:\Windows\system32\cmd.exe /C "cd /D C:\_work\llvm-project\llvm-project\build\tools\clang\include\clang\Basic && C:\_work\llvm-project\llvm-project\build\bin\clang-tblgen.exe -gen-clang-diags-defs -clang-component=Analysis -IC:/_work/llvm-project/llvm-project/clang/include/clang/Basic -IC:/_work/llvm-project/llvm-project/clang/include -IC:/_work/llvm-project/llvm-project/build/tools/clang/include -IC:/_work/llvm-project/llvm-project/build/include -IC:/_work/llvm-project/llvm-project/llvm/include --long-string-literals=0 C:/_work/llvm-project/llvm-project/clang/include/clang/Basic/Diagnostic.td --write-if-changed -o DiagnosticAnalysisKinds.inc -d DiagnosticAnalysisKinds.inc.d && C:\BuildTools\Common7\IDE\CommonExtensions\Microsoft\CMake\CMake\bin\cmake.exe -E cmake_transform_depfile Ninja gccdepfile C:/_work/llvm-project/llvm-project/llvm C:/_work/llvm-project/llvm-project/clang/include/clang/Basic C:/_work/llvm-project/llvm-project/build C:/_work/llvm-project/llvm-project/build/tools/clang/include/clang/Basic C:/_work/llvm-project/llvm-project/build/tools/clang/include/clang/Basic/DiagnosticAnalysisKinds.inc.d C:/_work/llvm-project/llvm-project/build/CMakeFiles/d/598a303f70730827d342396820e43d2090dd12884a2e4f2f1274425e22ca800f.d"
Assertion failed: R->getValueAsDef("Class")->getName() != "CLASS_NOTE" && "Note can't be in a DiagGroup", file C:\_work\llvm-project\llvm-project\clang\utils\TableGen\ClangDiagnosticsEmitter.cpp, line 156
PLEASE submit a bug report to https://github.com/llvm/llvm-project/issues/ and include the crash backtrace and instructions to reproduce the bug.
Stack dump:
0. Program arguments: C:\\_work\\llvm-project\\llvm-project\\build\\bin\\clang-tblgen.exe -gen-clang-diags-defs -clang-component=Analysis -IC:/_work/llvm-project/llvm-project/clang/include/clang/Basic -IC:/_work/llvm-project/llvm-project/clang/include -IC:/_work/llvm-project/llvm-project/build/tools/clang/include -IC:/_work/llvm-project/llvm-project/build/include -IC:/_work/llvm-project/llvm-project/llvm/include --long-string-literals=0 C:/_work/llvm-project/llvm-project/clang/include/clang/Basic/Diagnostic.td --write-if-changed -o DiagnosticAnalysisKinds.inc -d DiagnosticAnalysisKinds.inc.d
Exception Code: 0xC000001D
#0 0x00007ff64e82e176 (C:\_work\llvm-project\llvm-project\build\bin\clang-tblgen.exe+0x17e176)
#1 0x00007ffd159bbb04 (C:\Windows\System32\ucrtbase.dll+0x7bb04)
#2 0x00007ffd159bcad1 (C:\Windows\System32\ucrtbase.dll+0x7cad1)
#3 0x00007ffd159be4a1 (C:\Windows\System32\ucrtbase.dll+0x7e4a1)
#4 0x00007ffd159be6e1 (C:\Windows\System32\ucrtbase.dll+0x7e6e1)
#5 0x00007ff64e753cc8 (C:\_work\llvm-project\llvm-project\build\bin\clang-tblgen.exe+0xa3cc8)
#6 0x00007ff64e751e0a (C:\_work\llvm-project\llvm-project\build\bin\clang-tblgen.exe+0xa1e0a)
#7 0x00007ff64e80488b (C:\_work\llvm-project\llvm-project\build\bin\clang-tblgen.exe+0x15488b)
#8 0x00007ff64e86972c (C:\_work\llvm-project\llvm-project\build\bin\clang-tblgen.exe+0x1b972c)
#9 0x00007ff64e866228 (C:\_work\llvm-project\llvm-project\build\bin\clang-tblgen.exe+0x1b6228)
#10 0x00007ff64e867928 (C:\_work\llvm-project\llvm-project\build\bin\clang-tblgen.exe+0x1b7928)
#11 0x00007ff64e8041d3 (C:\_work\llvm-project\llvm-project\build\bin\clang-tblgen.exe+0x1541d3)
#12 0x00007ff64e8c6ee0 (C:\_work\llvm-project\llvm-project\build\bin\clang-tblgen.exe+0x216ee0)
#13 0x00007ffd21064cb0 (C:\Windows\System32\KERNEL32.DLL+0x14cb0)
#14 0x00007ffd2d65edeb (C:\Windows\SYSTEM32\ntdll.dll+0x7edeb)
```
</details>
<details>
<summary>[code=3221225501] tools/clang/include/clang/Basic/DiagnosticASTKinds.inc C:/_work/llvm-project/llvm-project/build/tools/clang/include/clang/Basic/DiagnosticASTKinds.inc</summary>
```
FAILED: [code=3221225501] tools/clang/include/clang/Basic/DiagnosticASTKinds.inc C:/_work/llvm-project/llvm-project/build/tools/clang/include/clang/Basic/DiagnosticASTKinds.inc
C:\Windows\system32\cmd.exe /C "cd /D C:\_work\llvm-project\llvm-project\build\tools\clang\include\clang\Basic && C:\_work\llvm-project\llvm-project\build\bin\clang-tblgen.exe -gen-clang-diags-defs -clang-component=AST -IC:/_work/llvm-project/llvm-project/clang/include/clang/Basic -IC:/_work/llvm-project/llvm-project/clang/include -IC:/_work/llvm-project/llvm-project/build/tools/clang/include -IC:/_work/llvm-project/llvm-project/build/include -IC:/_work/llvm-project/llvm-project/llvm/include --long-string-literals=0 C:/_work/llvm-project/llvm-project/clang/include/clang/Basic/Diagnostic.td --write-if-changed -o DiagnosticASTKinds.inc -d DiagnosticASTKinds.inc.d && C:\BuildTools\Common7\IDE\CommonExtensions\Microsoft\CMake\CMake\bin\cmake.exe -E cmake_transform_depfile Ninja gccdepfile C:/_work/llvm-project/llvm-project/llvm C:/_work/llvm-project/llvm-project/clang/include/clang/Basic C:/_work/llvm-project/llvm-project/build C:/_work/llvm-project/llvm-project/build/tools/clang/include/clang/Basic C:/_work/llvm-project/llvm-project/build/tools/clang/include/clang/Basic/DiagnosticASTKinds.inc.d C:/_work/llvm-project/llvm-project/build/CMakeFiles/d/85f84f5360c259248ef8a0e1e1c735a908d291b9aaf21ca75c13275241c7ec9f.d"
Assertion failed: R->getValueAsDef("Class")->getName() != "CLASS_NOTE" && "Note can't be in a DiagGroup", file C:\_work\llvm-project\llvm-project\clang\utils\TableGen\ClangDiagnosticsEmitter.cpp, line 156
PLEASE submit a bug report to https://github.com/llvm/llvm-project/issues/ and include the crash backtrace and instructions to reproduce the bug.
Stack dump:
0. Program arguments: C:\\_work\\llvm-project\\llvm-project\\build\\bin\\clang-tblgen.exe -gen-clang-diags-defs -clang-component=AST -IC:/_work/llvm-project/llvm-project/clang/include/clang/Basic -IC:/_work/llvm-project/llvm-project/clang/include -IC:/_work/llvm-project/llvm-project/build/tools/clang/include -IC:/_work/llvm-project/llvm-project/build/include -IC:/_work/llvm-project/llvm-project/llvm/include --long-string-literals=0 C:/_work/llvm-project/llvm-project/clang/include/clang/Basic/Diagnostic.td --write-if-changed -o DiagnosticASTKinds.inc -d DiagnosticASTKinds.inc.d
Exception Code: 0xC000001D
#0 0x00007ff64e82e176 (C:\_work\llvm-project\llvm-project\build\bin\clang-tblgen.exe+0x17e176)
#1 0x00007ffd159bbb04 (C:\Windows\System32\ucrtbase.dll+0x7bb04)
#2 0x00007ffd159bcad1 (C:\Windows\System32\ucrtbase.dll+0x7cad1)
#3 0x00007ffd159be4a1 (C:\Windows\System32\ucrtbase.dll+0x7e4a1)
#4 0x00007ffd159be6e1 (C:\Windows\System32\ucrtbase.dll+0x7e6e1)
#5 0x00007ff64e753cc8 (C:\_work\llvm-project\llvm-project\build\bin\clang-tblgen.exe+0xa3cc8)
#6 0x00007ff64e751e0a (C:\_work\llvm-project\llvm-project\build\bin\clang-tblgen.exe+0xa1e0a)
#7 0x00007ff64e80488b (C:\_work\llvm-project\llvm-project\build\bin\clang-tblgen.exe+0x15488b)
#8 0x00007ff64e86972c (C:\_work\llvm-project\llvm-project\build\bin\clang-tblgen.exe+0x1b972c)
#9 0x00007ff64e866228 (C:\_work\llvm-project\llvm-project\build\bin\clang-tblgen.exe+0x1b6228)
#10 0x00007ff64e867928 (C:\_work\llvm-project\llvm-project\build\bin\clang-tblgen.exe+0x1b7928)
#11 0x00007ff64e8041d3 (C:\_work\llvm-project\llvm-project\build\bin\clang-tblgen.exe+0x1541d3)
#12 0x00007ff64e8c6ee0 (C:\_work\llvm-project\llvm-project\build\bin\clang-tblgen.exe+0x216ee0)
#13 0x00007ffd21064cb0 (C:\Windows\System32\KERNEL32.DLL+0x14cb0)
#14 0x00007ffd2d65edeb (C:\Windows\SYSTEM32\ntdll.dll+0x7edeb)
```
</details>
<details>
<summary>[code=3221225501] tools/clang/include/clang/Basic/DiagnosticCodeGenKinds.inc C:/_work/llvm-project/llvm-project/build/tools/clang/include/clang/Basic/DiagnosticCodeGenKinds.inc</summary>
```
FAILED: [code=3221225501] tools/clang/include/clang/Basic/DiagnosticCodeGenKinds.inc C:/_work/llvm-project/llvm-project/build/tools/clang/include/clang/Basic/DiagnosticCodeGenKinds.inc
C:\Windows\system32\cmd.exe /C "cd /D C:\_work\llvm-project\llvm-project\build\tools\clang\include\clang\Basic && C:\_work\llvm-project\llvm-project\build\bin\clang-tblgen.exe -gen-clang-diags-defs -clang-component=CodeGen -IC:/_work/llvm-project/llvm-project/clang/include/clang/Basic -IC:/_work/llvm-project/llvm-project/clang/include -IC:/_work/llvm-project/llvm-project/build/tools/clang/include -IC:/_work/llvm-project/llvm-project/build/include -IC:/_work/llvm-project/llvm-project/llvm/include --long-string-literals=0 C:/_work/llvm-project/llvm-project/clang/include/clang/Basic/Diagnostic.td --write-if-changed -o DiagnosticCodeGenKinds.inc -d DiagnosticCodeGenKinds.inc.d && C:\BuildTools\Common7\IDE\CommonExtensions\Microsoft\CMake\CMake\bin\cmake.exe -E cmake_transform_depfile Ninja gccdepfile C:/_work/llvm-project/llvm-project/llvm C:/_work/llvm-project/llvm-project/clang/include/clang/Basic C:/_work/llvm-project/llvm-project/build C:/_work/llvm-project/llvm-project/build/tools/clang/include/clang/Basic C:/_work/llvm-project/llvm-project/build/tools/clang/include/clang/Basic/DiagnosticCodeGenKinds.inc.d C:/_work/llvm-project/llvm-project/build/CMakeFiles/d/209d3a52ed1a3bf3fcfb3888884669ea3fe41812e81ec07a173a63ac89044cd1.d"
Assertion failed: R->getValueAsDef("Class")->getName() != "CLASS_NOTE" && "Note can't be in a DiagGroup", file C:\_work\llvm-project\llvm-project\clang\utils\TableGen\ClangDiagnosticsEmitter.cpp, line 156
PLEASE submit a bug report to https://github.com/llvm/llvm-project/issues/ and include the crash backtrace and instructions to reproduce the bug.
Stack dump:
0. Program arguments: C:\\_work\\llvm-project\\llvm-project\\build\\bin\\clang-tblgen.exe -gen-clang-diags-defs -clang-component=CodeGen -IC:/_work/llvm-project/llvm-project/clang/include/clang/Basic -IC:/_work/llvm-project/llvm-project/clang/include -IC:/_work/llvm-project/llvm-project/build/tools/clang/include -IC:/_work/llvm-project/llvm-project/build/include -IC:/_work/llvm-project/llvm-project/llvm/include --long-string-literals=0 C:/_work/llvm-project/llvm-project/clang/include/clang/Basic/Diagnostic.td --write-if-changed -o DiagnosticCodeGenKinds.inc -d DiagnosticCodeGenKinds.inc.d
Exception Code: 0xC000001D
#0 0x00007ff64e82e176 (C:\_work\llvm-project\llvm-project\build\bin\clang-tblgen.exe+0x17e176)
#1 0x00007ffd159bbb04 (C:\Windows\System32\ucrtbase.dll+0x7bb04)
#2 0x00007ffd159bcad1 (C:\Windows\System32\ucrtbase.dll+0x7cad1)
#3 0x00007ffd159be4a1 (C:\Windows\System32\ucrtbase.dll+0x7e4a1)
#4 0x00007ffd159be6e1 (C:\Windows\System32\ucrtbase.dll+0x7e6e1)
#5 0x00007ff64e753cc8 (C:\_work\llvm-project\llvm-project\build\bin\clang-tblgen.exe+0xa3cc8)
#6 0x00007ff64e751e0a (C:\_work\llvm-project\llvm-project\build\bin\clang-tblgen.exe+0xa1e0a)
#7 0x00007ff64e80488b (C:\_work\llvm-project\llvm-project\build\bin\clang-tblgen.exe+0x15488b)
#8 0x00007ff64e86972c (C:\_work\llvm-project\llvm-project\build\bin\clang-tblgen.exe+0x1b972c)
#9 0x00007ff64e866228 (C:\_work\llvm-project\llvm-project\build\bin\clang-tblgen.exe+0x1b6228)
#10 0x00007ff64e867928 (C:\_work\llvm-project\llvm-project\build\bin\clang-tblgen.exe+0x1b7928)
#11 0x00007ff64e8041d3 (C:\_work\llvm-project\llvm-project\build\bin\clang-tblgen.exe+0x1541d3)
#12 0x00007ff64e8c6ee0 (C:\_work\llvm-project\llvm-project\build\bin\clang-tblgen.exe+0x216ee0)
#13 0x00007ffd21064cb0 (C:\Windows\System32\KERNEL32.DLL+0x14cb0)
#14 0x00007ffd2d65edeb (C:\Windows\SYSTEM32\ntdll.dll+0x7edeb)
```
</details>
<details>
<summary>[code=3221225501] tools/clang/include/clang/Basic/DiagnosticCommentKinds.inc C:/_work/llvm-project/llvm-project/build/tools/clang/include/clang/Basic/DiagnosticCommentKinds.inc</summary>
```
FAILED: [code=3221225501] tools/clang/include/clang/Basic/DiagnosticCommentKinds.inc C:/_work/llvm-project/llvm-project/build/tools/clang/include/clang/Basic/DiagnosticCommentKinds.inc
C:\Windows\system32\cmd.exe /C "cd /D C:\_work\llvm-project\llvm-project\build\tools\clang\include\clang\Basic && C:\_work\llvm-project\llvm-project\build\bin\clang-tblgen.exe -gen-clang-diags-defs -clang-component=Comment -IC:/_work/llvm-project/llvm-project/clang/include/clang/Basic -IC:/_work/llvm-project/llvm-project/clang/include -IC:/_work/llvm-project/llvm-project/build/tools/clang/include -IC:/_work/llvm-project/llvm-project/build/include -IC:/_work/llvm-project/llvm-project/llvm/include --long-string-literals=0 C:/_work/llvm-project/llvm-project/clang/include/clang/Basic/Diagnostic.td --write-if-changed -o DiagnosticCommentKinds.inc -d DiagnosticCommentKinds.inc.d && C:\BuildTools\Common7\IDE\CommonExtensions\Microsoft\CMake\CMake\bin\cmake.exe -E cmake_transform_depfile Ninja gccdepfile C:/_work/llvm-project/llvm-project/llvm C:/_work/llvm-project/llvm-project/clang/include/clang/Basic C:/_work/llvm-project/llvm-project/build C:/_work/llvm-project/llvm-project/build/tools/clang/include/clang/Basic C:/_work/llvm-project/llvm-project/build/tools/clang/include/clang/Basic/DiagnosticCommentKinds.inc.d C:/_work/llvm-project/llvm-project/build/CMakeFiles/d/ed769fd5a99fa975767750701583eba5fec5486e154e08afed33ece9663b789f.d"
Assertion failed: R->getValueAsDef("Class")->getName() != "CLASS_NOTE" && "Note can't be in a DiagGroup", file C:\_work\llvm-project\llvm-project\clang\utils\TableGen\ClangDiagnosticsEmitter.cpp, line 156
PLEASE submit a bug report to https://github.com/llvm/llvm-project/issues/ and include the crash backtrace and instructions to reproduce the bug.
Stack dump:
0. Program arguments: C:\\_work\\llvm-project\\llvm-project\\build\\bin\\clang-tblgen.exe -gen-clang-diags-defs -clang-component=Comment -IC:/_work/llvm-project/llvm-project/clang/include/clang/Basic -IC:/_work/llvm-project/llvm-project/clang/include -IC:/_work/llvm-project/llvm-project/build/tools/clang/include -IC:/_work/llvm-project/llvm-project/build/include -IC:/_work/llvm-project/llvm-project/llvm/include --long-string-literals=0 C:/_work/llvm-project/llvm-project/clang/include/clang/Basic/Diagnostic.td --write-if-changed -o DiagnosticCommentKinds.inc -d DiagnosticCommentKinds.inc.d
Exception Code: 0xC000001D
#0 0x00007ff64e82e176 (C:\_work\llvm-project\llvm-project\build\bin\clang-tblgen.exe+0x17e176)
#1 0x00007ffd159bbb04 (C:\Windows\System32\ucrtbase.dll+0x7bb04)
#2 0x00007ffd159bcad1 (C:\Windows\System32\ucrtbase.dll+0x7cad1)
#3 0x00007ffd159be4a1 (C:\Windows\System32\ucrtbase.dll+0x7e4a1)
#4 0x00007ffd159be6e1 (C:\Windows\System32\ucrtbase.dll+0x7e6e1)
#5 0x00007ff64e753cc8 (C:\_work\llvm-project\llvm-project\build\bin\clang-tblgen.exe+0xa3cc8)
#6 0x00007ff64e751e0a (C:\_work\llvm-project\llvm-project\build\bin\clang-tblgen.exe+0xa1e0a)
#7 0x00007ff64e80488b (C:\_work\llvm-project\llvm-project\build\bin\clang-tblgen.exe+0x15488b)
#8 0x00007ff64e86972c (C:\_work\llvm-project\llvm-project\build\bin\clang-tblgen.exe+0x1b972c)
#9 0x00007ff64e866228 (C:\_work\llvm-project\llvm-project\build\bin\clang-tblgen.exe+0x1b6228)
#10 0x00007ff64e867928 (C:\_work\llvm-project\llvm-project\build\bin\clang-tblgen.exe+0x1b7928)
#11 0x00007ff64e8041d3 (C:\_work\llvm-project\llvm-project\build\bin\clang-tblgen.exe+0x1541d3)
#12 0x00007ff64e8c6ee0 (C:\_work\llvm-project\llvm-project\build\bin\clang-tblgen.exe+0x216ee0)
#13 0x00007ffd21064cb0 (C:\Windows\System32\KERNEL32.DLL+0x14cb0)
#14 0x00007ffd2d65edeb (C:\Windows\SYSTEM32\ntdll.dll+0x7edeb)
```
</details>
<details>
<summary>[code=3221225501] tools/clang/include/clang/Basic/DiagnosticCommonKinds.inc C:/_work/llvm-project/llvm-project/build/tools/clang/include/clang/Basic/DiagnosticCommonKinds.inc</summary>
```
FAILED: [code=3221225501] tools/clang/include/clang/Basic/DiagnosticCommonKinds.inc C:/_work/llvm-project/llvm-project/build/tools/clang/include/clang/Basic/DiagnosticCommonKinds.inc
C:\Windows\system32\cmd.exe /C "cd /D C:\_work\llvm-project\llvm-project\build\tools\clang\include\clang\Basic && C:\_work\llvm-project\llvm-project\build\bin\clang-tblgen.exe -gen-clang-diags-defs -clang-component=Common -IC:/_work/llvm-project/llvm-project/clang/include/clang/Basic -IC:/_work/llvm-project/llvm-project/clang/include -IC:/_work/llvm-project/llvm-project/build/tools/clang/include -IC:/_work/llvm-project/llvm-project/build/include -IC:/_work/llvm-project/llvm-project/llvm/include --long-string-literals=0 C:/_work/llvm-project/llvm-project/clang/include/clang/Basic/Diagnostic.td --write-if-changed -o DiagnosticCommonKinds.inc -d DiagnosticCommonKinds.inc.d && C:\BuildTools\Common7\IDE\CommonExtensions\Microsoft\CMake\CMake\bin\cmake.exe -E cmake_transform_depfile Ninja gccdepfile C:/_work/llvm-project/llvm-project/llvm C:/_work/llvm-project/llvm-project/clang/include/clang/Basic C:/_work/llvm-project/llvm-project/build C:/_work/llvm-project/llvm-project/build/tools/clang/include/clang/Basic C:/_work/llvm-project/llvm-project/build/tools/clang/include/clang/Basic/DiagnosticCommonKinds.inc.d C:/_work/llvm-project/llvm-project/build/CMakeFiles/d/4242afcf8e8566a0c484ccf8e67485bfd5eb94bd554e04afec868374564dbeef.d"
Assertion failed: R->getValueAsDef("Class")->getName() != "CLASS_NOTE" && "Note can't be in a DiagGroup", file C:\_work\llvm-project\llvm-project\clang\utils\TableGen\ClangDiagnosticsEmitter.cpp, line 156
PLEASE submit a bug report to https://github.com/llvm/llvm-project/issues/ and include the crash backtrace and instructions to reproduce the bug.
Stack dump:
0. Program arguments: C:\\_work\\llvm-project\\llvm-project\\build\\bin\\clang-tblgen.exe -gen-clang-diags-defs -clang-component=Common -IC:/_work/llvm-project/llvm-project/clang/include/clang/Basic -IC:/_work/llvm-project/llvm-project/clang/include -IC:/_work/llvm-project/llvm-project/build/tools/clang/include -IC:/_work/llvm-project/llvm-project/build/include -IC:/_work/llvm-project/llvm-project/llvm/include --long-string-literals=0 C:/_work/llvm-project/llvm-project/clang/include/clang/Basic/Diagnostic.td --write-if-changed -o DiagnosticCommonKinds.inc -d DiagnosticCommonKinds.inc.d
Exception Code: 0xC000001D
#0 0x00007ff64e82e176 (C:\_work\llvm-project\llvm-project\build\bin\clang-tblgen.exe+0x17e176)
#1 0x00007ffd159bbb04 (C:\Windows\System32\ucrtbase.dll+0x7bb04)
#2 0x00007ffd159bcad1 (C:\Windows\System32\ucrtbase.dll+0x7cad1)
#3 0x00007ffd159be4a1 (C:\Windows\System32\ucrtbase.dll+0x7e4a1)
#4 0x00007ffd159be6e1 (C:\Windows\System32\ucrtbase.dll+0x7e6e1)
#5 0x00007ff64e753cc8 (C:\_work\llvm-project\llvm-project\build\bin\clang-tblgen.exe+0xa3cc8)
#6 0x00007ff64e751e0a (C:\_work\llvm-project\llvm-project\build\bin\clang-tblgen.exe+0xa1e0a)
#7 0x00007ff64e80488b (C:\_work\llvm-project\llvm-project\build\bin\clang-tblgen.exe+0x15488b)
#8 0x00007ff64e86972c (C:\_work\llvm-project\llvm-project\build\bin\clang-tblgen.exe+0x1b972c)
#9 0x00007ff64e866228 (C:\_work\llvm-project\llvm-project\build\bin\clang-tblgen.exe+0x1b6228)
#10 0x00007ff64e867928 (C:\_work\llvm-project\llvm-project\build\bin\clang-tblgen.exe+0x1b7928)
#11 0x00007ff64e8041d3 (C:\_work\llvm-project\llvm-project\build\bin\clang-tblgen.exe+0x1541d3)
#12 0x00007ff64e8c6ee0 (C:\_work\llvm-project\llvm-project\build\bin\clang-tblgen.exe+0x216ee0)
#13 0x00007ffd21064cb0 (C:\Windows\System32\KERNEL32.DLL+0x14cb0)
#14 0x00007ffd2d65edeb (C:\Windows\SYSTEM32\ntdll.dll+0x7edeb)
```
</details>
<details>
<summary>[code=3221225501] tools/clang/include/clang/Basic/DiagnosticCrossTUKinds.inc C:/_work/llvm-project/llvm-project/build/tools/clang/include/clang/Basic/DiagnosticCrossTUKinds.inc</summary>
```
FAILED: [code=3221225501] tools/clang/include/clang/Basic/DiagnosticCrossTUKinds.inc C:/_work/llvm-project/llvm-project/build/tools/clang/include/clang/Basic/DiagnosticCrossTUKinds.inc
C:\Windows\system32\cmd.exe /C "cd /D C:\_work\llvm-project\llvm-project\build\tools\clang\include\clang\Basic && C:\_work\llvm-project\llvm-project\build\bin\clang-tblgen.exe -gen-clang-diags-defs -clang-component=CrossTU -IC:/_work/llvm-project/llvm-project/clang/include/clang/Basic -IC:/_work/llvm-project/llvm-project/clang/include -IC:/_work/llvm-project/llvm-project/build/tools/clang/include -IC:/_work/llvm-project/llvm-project/build/include -IC:/_work/llvm-project/llvm-project/llvm/include --long-string-literals=0 C:/_work/llvm-project/llvm-project/clang/include/clang/Basic/Diagnostic.td --write-if-changed -o DiagnosticCrossTUKinds.inc -d DiagnosticCrossTUKinds.inc.d && C:\BuildTools\Common7\IDE\CommonExtensions\Microsoft\CMake\CMake\bin\cmake.exe -E cmake_transform_depfile Ninja gccdepfile C:/_work/llvm-project/llvm-project/llvm C:/_work/llvm-project/llvm-project/clang/include/clang/Basic C:/_work/llvm-project/llvm-project/build C:/_work/llvm-project/llvm-project/build/tools/clang/include/clang/Basic C:/_work/llvm-project/llvm-project/build/tools/clang/include/clang/Basic/DiagnosticCrossTUKinds.inc.d C:/_work/llvm-project/llvm-project/build/CMakeFiles/d/508851155e99dbcb39727340539f54acb4016678e6e213d233f955323280cfc2.d"
Assertion failed: R->getValueAsDef("Class")->getName() != "CLASS_NOTE" && "Note can't be in a DiagGroup", file C:\_work\llvm-project\llvm-project\clang\utils\TableGen\ClangDiagnosticsEmitter.cpp, line 156
PLEASE submit a bug report to https://github.com/llvm/llvm-project/issues/ and include the crash backtrace and instructions to reproduce the bug.
Stack dump:
0. Program arguments: C:\\_work\\llvm-project\\llvm-project\\build\\bin\\clang-tblgen.exe -gen-clang-diags-defs -clang-component=CrossTU -IC:/_work/llvm-project/llvm-project/clang/include/clang/Basic -IC:/_work/llvm-project/llvm-project/clang/include -IC:/_work/llvm-project/llvm-project/build/tools/clang/include -IC:/_work/llvm-project/llvm-project/build/include -IC:/_work/llvm-project/llvm-project/llvm/include --long-string-literals=0 C:/_work/llvm-project/llvm-project/clang/include/clang/Basic/Diagnostic.td --write-if-changed -o DiagnosticCrossTUKinds.inc -d DiagnosticCrossTUKinds.inc.d
Exception Code: 0xC000001D
#0 0x00007ff64e82e176 (C:\_work\llvm-project\llvm-project\build\bin\clang-tblgen.exe+0x17e176)
#1 0x00007ffd159bbb04 (C:\Windows\System32\ucrtbase.dll+0x7bb04)
#2 0x00007ffd159bcad1 (C:\Windows\System32\ucrtbase.dll+0x7cad1)
#3 0x00007ffd159be4a1 (C:\Windows\System32\ucrtbase.dll+0x7e4a1)
#4 0x00007ffd159be6e1 (C:\Windows\System32\ucrtbase.dll+0x7e6e1)
#5 0x00007ff64e753cc8 (C:\_work\llvm-project\llvm-project\build\bin\clang-tblgen.exe+0xa3cc8)
#6 0x00007ff64e751e0a (C:\_work\llvm-project\llvm-project\build\bin\clang-tblgen.exe+0xa1e0a)
#7 0x00007ff64e80488b (C:\_work\llvm-project\llvm-project\build\bin\clang-tblgen.exe+0x15488b)
#8 0x00007ff64e86972c (C:\_work\llvm-project\llvm-project\build\bin\clang-tblgen.exe+0x1b972c)
#9 0x00007ff64e866228 (C:\_work\llvm-project\llvm-project\build\bin\clang-tblgen.exe+0x1b6228)
#10 0x00007ff64e867928 (C:\_work\llvm-project\llvm-project\build\bin\clang-tblgen.exe+0x1b7928)
#11 0x00007ff64e8041d3 (C:\_work\llvm-project\llvm-project\build\bin\clang-tblgen.exe+0x1541d3)
#12 0x00007ff64e8c6ee0 (C:\_work\llvm-project\llvm-project\build\bin\clang-tblgen.exe+0x216ee0)
#13 0x00007ffd21064cb0 (C:\Windows\System32\KERNEL32.DLL+0x14cb0)
#14 0x00007ffd2d65edeb (C:\Windows\SYSTEM32\ntdll.dll+0x7edeb)
```
</details>
<details>
<summary>[code=3221225501] tools/clang/include/clang/Basic/DiagnosticDriverKinds.inc C:/_work/llvm-project/llvm-project/build/tools/clang/include/clang/Basic/DiagnosticDriverKinds.inc</summary>
```
FAILED: [code=3221225501] tools/clang/include/clang/Basic/DiagnosticDriverKinds.inc C:/_work/llvm-project/llvm-project/build/tools/clang/include/clang/Basic/DiagnosticDriverKinds.inc
C:\Windows\system32\cmd.exe /C "cd /D C:\_work\llvm-project\llvm-project\build\tools\clang\include\clang\Basic && C:\_work\llvm-project\llvm-project\build\bin\clang-tblgen.exe -gen-clang-diags-defs -clang-component=Driver -IC:/_work/llvm-project/llvm-project/clang/include/clang/Basic -IC:/_work/llvm-project/llvm-project/clang/include -IC:/_work/llvm-project/llvm-project/build/tools/clang/include -IC:/_work/llvm-project/llvm-project/build/include -IC:/_work/llvm-project/llvm-project/llvm/include --long-string-literals=0 C:/_work/llvm-project/llvm-project/clang/include/clang/Basic/Diagnostic.td --write-if-changed -o DiagnosticDriverKinds.inc -d DiagnosticDriverKinds.inc.d && C:\BuildTools\Common7\IDE\CommonExtensions\Microsoft\CMake\CMake\bin\cmake.exe -E cmake_transform_depfile Ninja gccdepfile C:/_work/llvm-project/llvm-project/llvm C:/_work/llvm-project/llvm-project/clang/include/clang/Basic C:/_work/llvm-project/llvm-project/build C:/_work/llvm-project/llvm-project/build/tools/clang/include/clang/Basic C:/_work/llvm-project/llvm-project/build/tools/clang/include/clang/Basic/DiagnosticDriverKinds.inc.d C:/_work/llvm-project/llvm-project/build/CMakeFiles/d/b1fa9595c0d3c0c018689363a931d18bb49728611e2391844dd50f59f9779fd9.d"
Assertion failed: R->getValueAsDef("Class")->getName() != "CLASS_NOTE" && "Note can't be in a DiagGroup", file C:\_work\llvm-project\llvm-project\clang\utils\TableGen\ClangDiagnosticsEmitter.cpp, line 156
PLEASE submit a bug report to https://github.com/llvm/llvm-project/issues/ and include the crash backtrace and instructions to reproduce the bug.
Stack dump:
0. Program arguments: C:\\_work\\llvm-project\\llvm-project\\build\\bin\\clang-tblgen.exe -gen-clang-diags-defs -clang-component=Driver -IC:/_work/llvm-project/llvm-project/clang/include/clang/Basic -IC:/_work/llvm-project/llvm-project/clang/include -IC:/_work/llvm-project/llvm-project/build/tools/clang/include -IC:/_work/llvm-project/llvm-project/build/include -IC:/_work/llvm-project/llvm-project/llvm/include --long-string-literals=0 C:/_work/llvm-project/llvm-project/clang/include/clang/Basic/Diagnostic.td --write-if-changed -o DiagnosticDriverKinds.inc -d DiagnosticDriverKinds.inc.d
Exception Code: 0xC000001D
#0 0x00007ff64e82e176 (C:\_work\llvm-project\llvm-project\build\bin\clang-tblgen.exe+0x17e176)
#1 0x00007ffd159bbb04 (C:\Windows\System32\ucrtbase.dll+0x7bb04)
#2 0x00007ffd159bcad1 (C:\Windows\System32\ucrtbase.dll+0x7cad1)
#3 0x00007ffd159be4a1 (C:\Windows\System32\ucrtbase.dll+0x7e4a1)
#4 0x00007ffd159be6e1 (C:\Windows\System32\ucrtbase.dll+0x7e6e1)
#5 0x00007ff64e753cc8 (C:\_work\llvm-project\llvm-project\build\bin\clang-tblgen.exe+0xa3cc8)
#6 0x00007ff64e751e0a (C:\_work\llvm-project\llvm-project\build\bin\clang-tblgen.exe+0xa1e0a)
#7 0x00007ff64e80488b (C:\_work\llvm-project\llvm-project\build\bin\clang-tblgen.exe+0x15488b)
#8 0x00007ff64e86972c (C:\_work\llvm-project\llvm-project\build\bin\clang-tblgen.exe+0x1b972c)
#9 0x00007ff64e866228 (C:\_work\llvm-project\llvm-project\build\bin\clang-tblgen.exe+0x1b6228)
#10 0x00007ff64e867928 (C:\_work\llvm-project\llvm-project\build\bin\clang-tblgen.exe+0x1b7928)
#11 0x00007ff64e8041d3 (C:\_work\llvm-project\llvm-project\build\bin\clang-tblgen.exe+0x1541d3)
#12 0x00007ff64e8c6ee0 (C:\_work\llvm-project\llvm-project\build\bin\clang-tblgen.exe+0x216ee0)
#13 0x00007ffd21064cb0 (C:\Windows\System32\KERNEL32.DLL+0x14cb0)
#14 0x00007ffd2d65edeb (C:\Windows\SYSTEM32\ntdll.dll+0x7edeb)
```
</details>
<details>
<summary>[code=3221225501] tools/clang/include/clang/Basic/DiagnosticInstallAPIKinds.inc C:/_work/llvm-project/llvm-project/build/tools/clang/include/clang/Basic/DiagnosticInstallAPIKinds.inc</summary>
```
FAILED: [code=3221225501] tools/clang/include/clang/Basic/DiagnosticInstallAPIKinds.inc C:/_work/llvm-project/llvm-project/build/tools/clang/include/clang/Basic/DiagnosticInstallAPIKinds.inc
C:\Windows\system32\cmd.exe /C "cd /D C:\_work\llvm-project\llvm-project\build\tools\clang\include\clang\Basic && C:\_work\llvm-project\llvm-project\build\bin\clang-tblgen.exe -gen-clang-diags-defs -clang-component=InstallAPI -IC:/_work/llvm-project/llvm-project/clang/include/clang/Basic -IC:/_work/llvm-project/llvm-project/clang/include -IC:/_work/llvm-project/llvm-project/build/tools/clang/include -IC:/_work/llvm-project/llvm-project/build/include -IC:/_work/llvm-project/llvm-project/llvm/include --long-string-literals=0 C:/_work/llvm-project/llvm-project/clang/include/clang/Basic/Diagnostic.td --write-if-changed -o DiagnosticInstallAPIKinds.inc -d DiagnosticInstallAPIKinds.inc.d && C:\BuildTools\Common7\IDE\CommonExtensions\Microsoft\CMake\CMake\bin\cmake.exe -E cmake_transform_depfile Ninja gccdepfile C:/_work/llvm-project/llvm-project/llvm C:/_work/llvm-project/llvm-project/clang/include/clang/Basic C:/_work/llvm-project/llvm-project/build C:/_work/llvm-project/llvm-project/build/tools/clang/include/clang/Basic C:/_work/llvm-project/llvm-project/build/tools/clang/include/clang/Basic/DiagnosticInstallAPIKinds.inc.d C:/_work/llvm-project/llvm-project/build/CMakeFiles/d/986c5d0f2a6cd9a1d207bd3a6b4d9581218633ef6278c18b1c50cc80c2547069.d"
Assertion failed: R->getValueAsDef("Class")->getName() != "CLASS_NOTE" && "Note can't be in a DiagGroup", file C:\_work\llvm-project\llvm-project\clang\utils\TableGen\ClangDiagnosticsEmitter.cpp, line 156
PLEASE submit a bug report to https://github.com/llvm/llvm-project/issues/ and include the crash backtrace and instructions to reproduce the bug.
Stack dump:
0. Program arguments: C:\\_work\\llvm-project\\llvm-project\\build\\bin\\clang-tblgen.exe -gen-clang-diags-defs -clang-component=InstallAPI -IC:/_work/llvm-project/llvm-project/clang/include/clang/Basic -IC:/_work/llvm-project/llvm-project/clang/include -IC:/_work/llvm-project/llvm-project/build/tools/clang/include -IC:/_work/llvm-project/llvm-project/build/include -IC:/_work/llvm-project/llvm-project/llvm/include --long-string-literals=0 C:/_work/llvm-project/llvm-project/clang/include/clang/Basic/Diagnostic.td --write-if-changed -o DiagnosticInstallAPIKinds.inc -d DiagnosticInstallAPIKinds.inc.d
Exception Code: 0xC000001D
#0 0x00007ff64e82e176 (C:\_work\llvm-project\llvm-project\build\bin\clang-tblgen.exe+0x17e176)
#1 0x00007ffd159bbb04 (C:\Windows\System32\ucrtbase.dll+0x7bb04)
#2 0x00007ffd159bcad1 (C:\Windows\System32\ucrtbase.dll+0x7cad1)
#3 0x00007ffd159be4a1 (C:\Windows\System32\ucrtbase.dll+0x7e4a1)
#4 0x00007ffd159be6e1 (C:\Windows\System32\ucrtbase.dll+0x7e6e1)
#5 0x00007ff64e753cc8 (C:\_work\llvm-project\llvm-project\build\bin\clang-tblgen.exe+0xa3cc8)
#6 0x00007ff64e751e0a (C:\_work\llvm-project\llvm-project\build\bin\clang-tblgen.exe+0xa1e0a)
#7 0x00007ff64e80488b (C:\_work\llvm-project\llvm-project\build\bin\clang-tblgen.exe+0x15488b)
#8 0x00007ff64e86972c (C:\_work\llvm-project\llvm-project\build\bin\clang-tblgen.exe+0x1b972c)
#9 0x00007ff64e866228 (C:\_work\llvm-project\llvm-project\build\bin\clang-tblgen.exe+0x1b6228)
#10 0x00007ff64e867928 (C:\_work\llvm-project\llvm-project\build\bin\clang-tblgen.exe+0x1b7928)
#11 0x00007ff64e8041d3 (C:\_work\llvm-project\llvm-project\build\bin\clang-tblgen.exe+0x1541d3)
#12 0x00007ff64e8c6ee0 (C:\_work\llvm-project\llvm-project\build\bin\clang-tblgen.exe+0x216ee0)
#13 0x00007ffd21064cb0 (C:\Windows\System32\KERNEL32.DLL+0x14cb0)
#14 0x00007ffd2d65edeb (C:\Windows\SYSTEM32\ntdll.dll+0x7edeb)
```
</details>
<details>
<summary>[code=3221225501] tools/clang/include/clang/Basic/DiagnosticFrontendKinds.inc C:/_work/llvm-project/llvm-project/build/tools/clang/include/clang/Basic/DiagnosticFrontendKinds.inc</summary>
```
FAILED: [code=3221225501] tools/clang/include/clang/Basic/DiagnosticFrontendKinds.inc C:/_work/llvm-project/llvm-project/build/tools/clang/include/clang/Basic/DiagnosticFrontendKinds.inc
C:\Windows\system32\cmd.exe /C "cd /D C:\_work\llvm-project\llvm-project\build\tools\clang\include\clang\Basic && C:\_work\llvm-project\llvm-project\build\bin\clang-tblgen.exe -gen-clang-diags-defs -clang-component=Frontend -IC:/_work/llvm-project/llvm-project/clang/include/clang/Basic -IC:/_work/llvm-project/llvm-project/clang/include -IC:/_work/llvm-project/llvm-project/build/tools/clang/include -IC:/_work/llvm-project/llvm-project/build/include -IC:/_work/llvm-project/llvm-project/llvm/include --long-string-literals=0 C:/_work/llvm-project/llvm-project/clang/include/clang/Basic/Diagnostic.td --write-if-changed -o DiagnosticFrontendKinds.inc -d DiagnosticFrontendKinds.inc.d && C:\BuildTools\Common7\IDE\CommonExtensions\Microsoft\CMake\CMake\bin\cmake.exe -E cmake_transform_depfile Ninja gccdepfile C:/_work/llvm-project/llvm-project/llvm C:/_work/llvm-project/llvm-project/clang/include/clang/Basic C:/_work/llvm-project/llvm-project/build C:/_work/llvm-project/llvm-project/build/tools/clang/include/clang/Basic C:/_work/llvm-project/llvm-project/build/tools/clang/include/clang/Basic/DiagnosticFrontendKinds.inc.d C:/_work/llvm-project/llvm-project/build/CMakeFiles/d/38bdf71c883ef44b69abb2bac92da46bf89833f7399835d5e8b6d7679007b2ad.d"
Assertion failed: R->getValueAsDef("Class")->getName() != "CLASS_NOTE" && "Note can't be in a DiagGroup", file C:\_work\llvm-project\llvm-project\clang\utils\TableGen\ClangDiagnosticsEmitter.cpp, line 156
PLEASE submit a bug report to https://github.com/llvm/llvm-project/issues/ and include the crash backtrace and instructions to reproduce the bug.
Stack dump:
0. Program arguments: C:\\_work\\llvm-project\\llvm-project\\build\\bin\\clang-tblgen.exe -gen-clang-diags-defs -clang-component=Frontend -IC:/_work/llvm-project/llvm-project/clang/include/clang/Basic -IC:/_work/llvm-project/llvm-project/clang/include -IC:/_work/llvm-project/llvm-project/build/tools/clang/include -IC:/_work/llvm-project/llvm-project/build/include -IC:/_work/llvm-project/llvm-project/llvm/include --long-string-literals=0 C:/_work/llvm-project/llvm-project/clang/include/clang/Basic/Diagnostic.td --write-if-changed -o DiagnosticFrontendKinds.inc -d DiagnosticFrontendKinds.inc.d
Exception Code: 0xC000001D
#0 0x00007ff64e82e176 (C:\_work\llvm-project\llvm-project\build\bin\clang-tblgen.exe+0x17e176)
#1 0x00007ffd159bbb04 (C:\Windows\System32\ucrtbase.dll+0x7bb04)
#2 0x00007ffd159bcad1 (C:\Windows\System32\ucrtbase.dll+0x7cad1)
#3 0x00007ffd159be4a1 (C:\Windows\System32\ucrtbase.dll+0x7e4a1)
#4 0x00007ffd159be6e1 (C:\Windows\System32\ucrtbase.dll+0x7e6e1)
#5 0x00007ff64e753cc8 (C:\_work\llvm-project\llvm-project\build\bin\clang-tblgen.exe+0xa3cc8)
#6 0x00007ff64e751e0a (C:\_work\llvm-project\llvm-project\build\bin\clang-tblgen.exe+0xa1e0a)
#7 0x00007ff64e80488b (C:\_work\llvm-project\llvm-project\build\bin\clang-tblgen.exe+0x15488b)
#8 0x00007ff64e86972c (C:\_work\llvm-project\llvm-project\build\bin\clang-tblgen.exe+0x1b972c)
#9 0x00007ff64e866228 (C:\_work\llvm-project\llvm-project\build\bin\clang-tblgen.exe+0x1b6228)
#10 0x00007ff64e867928 (C:\_work\llvm-project\llvm-project\build\bin\clang-tblgen.exe+0x1b7928)
#11 0x00007ff64e8041d3 (C:\_work\llvm-project\llvm-project\build\bin\clang-tblgen.exe+0x1541d3)
#12 0x00007ff64e8c6ee0 (C:\_work\llvm-project\llvm-project\build\bin\clang-tblgen.exe+0x216ee0)
#13 0x00007ffd21064cb0 (C:\Windows\System32\KERNEL32.DLL+0x14cb0)
#14 0x00007ffd2d65edeb (C:\Windows\SYSTEM32\ntdll.dll+0x7edeb)
```
</details>
<details>
<summary>[code=3221225501] tools/clang/include/clang/Basic/DiagnosticLexKinds.inc C:/_work/llvm-project/llvm-project/build/tools/clang/include/clang/Basic/DiagnosticLexKinds.inc</summary>
```
FAILED: [code=3221225501] tools/clang/include/clang/Basic/DiagnosticLexKinds.inc C:/_work/llvm-project/llvm-project/build/tools/clang/include/clang/Basic/DiagnosticLexKinds.inc
C:\Windows\system32\cmd.exe /C "cd /D C:\_work\llvm-project\llvm-project\build\tools\clang\include\clang\Basic && C:\_work\llvm-project\llvm-project\build\bin\clang-tblgen.exe -gen-clang-diags-defs -clang-component=Lex -IC:/_work/llvm-project/llvm-project/clang/include/clang/Basic -IC:/_work/llvm-project/llvm-project/clang/include -IC:/_work/llvm-project/llvm-project/build/tools/clang/include -IC:/_work/llvm-project/llvm-project/build/include -IC:/_work/llvm-project/llvm-project/llvm/include --long-string-literals=0 C:/_work/llvm-project/llvm-project/clang/include/clang/Basic/Diagnostic.td --write-if-changed -o DiagnosticLexKinds.inc -d DiagnosticLexKinds.inc.d && C:\BuildTools\Common7\IDE\CommonExtensions\Microsoft\CMake\CMake\bin\cmake.exe -E cmake_transform_depfile Ninja gccdepfile C:/_work/llvm-project/llvm-project/llvm C:/_work/llvm-project/llvm-project/clang/include/clang/Basic C:/_work/llvm-project/llvm-project/build C:/_work/llvm-project/llvm-project/build/tools/clang/include/clang/Basic C:/_work/llvm-project/llvm-project/build/tools/clang/include/clang/Basic/DiagnosticLexKinds.inc.d C:/_work/llvm-project/llvm-project/build/CMakeFiles/d/30508b86d79c25501909f40e20aaad1a870b6eea8b58508d02e87a6f91cd050c.d"
Assertion failed: R->getValueAsDef("Class")->getName() != "CLASS_NOTE" && "Note can't be in a DiagGroup", file C:\_work\llvm-project\llvm-project\clang\utils\TableGen\ClangDiagnosticsEmitter.cpp, line 156
PLEASE submit a bug report to https://github.com/llvm/llvm-project/issues/ and include the crash backtrace and instructions to reproduce the bug.
Stack dump:
0. Program arguments: C:\\_work\\llvm-project\\llvm-project\\build\\bin\\clang-tblgen.exe -gen-clang-diags-defs -clang-component=Lex -IC:/_work/llvm-project/llvm-project/clang/include/clang/Basic -IC:/_work/llvm-project/llvm-project/clang/include -IC:/_work/llvm-project/llvm-project/build/tools/clang/include -IC:/_work/llvm-project/llvm-project/build/include -IC:/_work/llvm-project/llvm-project/llvm/include --long-string-literals=0 C:/_work/llvm-project/llvm-project/clang/include/clang/Basic/Diagnostic.td --write-if-changed -o DiagnosticLexKinds.inc -d DiagnosticLexKinds.inc.d
Exception Code: 0xC000001D
#0 0x00007ff64e82e176 (C:\_work\llvm-project\llvm-project\build\bin\clang-tblgen.exe+0x17e176)
#1 0x00007ffd159bbb04 (C:\Windows\System32\ucrtbase.dll+0x7bb04)
#2 0x00007ffd159bcad1 (C:\Windows\System32\ucrtbase.dll+0x7cad1)
#3 0x00007ffd159be4a1 (C:\Windows\System32\ucrtbase.dll+0x7e4a1)
#4 0x00007ffd159be6e1 (C:\Windows\System32\ucrtbase.dll+0x7e6e1)
#5 0x00007ff64e753cc8 (C:\_work\llvm-project\llvm-project\build\bin\clang-tblgen.exe+0xa3cc8)
#6 0x00007ff64e751e0a (C:\_work\llvm-project\llvm-project\build\bin\clang-tblgen.exe+0xa1e0a)
#7 0x00007ff64e80488b (C:\_work\llvm-project\llvm-project\build\bin\clang-tblgen.exe+0x15488b)
#8 0x00007ff64e86972c (C:\_work\llvm-project\llvm-project\build\bin\clang-tblgen.exe+0x1b972c)
#9 0x00007ff64e866228 (C:\_work\llvm-project\llvm-project\build\bin\clang-tblgen.exe+0x1b6228)
#10 0x00007ff64e867928 (C:\_work\llvm-project\llvm-project\build\bin\clang-tblgen.exe+0x1b7928)
#11 0x00007ff64e8041d3 (C:\_work\llvm-project\llvm-project\build\bin\clang-tblgen.exe+0x1541d3)
#12 0x00007ff64e8c6ee0 (C:\_work\llvm-project\llvm-project\build\bin\clang-tblgen.exe+0x216ee0)
#13 0x00007ffd21064cb0 (C:\Windows\System32\KERNEL32.DLL+0x14cb0)
#14 0x00007ffd2d65edeb (C:\Windows\SYSTEM32\ntdll.dll+0x7edeb)
```
</details>
<details>
<summary>[code=3221225501] tools/clang/include/clang/Basic/DiagnosticParseKinds.inc C:/_work/llvm-project/llvm-project/build/tools/clang/include/clang/Basic/DiagnosticParseKinds.inc</summary>
```
FAILED: [code=3221225501] tools/clang/include/clang/Basic/DiagnosticParseKinds.inc C:/_work/llvm-project/llvm-project/build/tools/clang/include/clang/Basic/DiagnosticParseKinds.inc
C:\Windows\system32\cmd.exe /C "cd /D C:\_work\llvm-project\llvm-project\build\tools\clang\include\clang\Basic && C:\_work\llvm-project\llvm-project\build\bin\clang-tblgen.exe -gen-clang-diags-defs -clang-component=Parse -IC:/_work/llvm-project/llvm-project/clang/include/clang/Basic -IC:/_work/llvm-project/llvm-project/clang/include -IC:/_work/llvm-project/llvm-project/build/tools/clang/include -IC:/_work/llvm-project/llvm-project/build/include -IC:/_work/llvm-project/llvm-project/llvm/include --long-string-literals=0 C:/_work/llvm-project/llvm-project/clang/include/clang/Basic/Diagnostic.td --write-if-changed -o DiagnosticParseKinds.inc -d DiagnosticParseKinds.inc.d && C:\BuildTools\Common7\IDE\CommonExtensions\Microsoft\CMake\CMake\bin\cmake.exe -E cmake_transform_depfile Ninja gccdepfile C:/_work/llvm-project/llvm-project/llvm C:/_work/llvm-project/llvm-project/clang/include/clang/Basic C:/_work/llvm-project/llvm-project/build C:/_work/llvm-project/llvm-project/build/tools/clang/include/clang/Basic C:/_work/llvm-project/llvm-project/build/tools/clang/include/clang/Basic/DiagnosticParseKinds.inc.d C:/_work/llvm-project/llvm-project/build/CMakeFiles/d/550f4d197eaf03bf424adfdbd6a91bdd9cc464a3868f8e2b7f4297c75a0309d7.d"
Assertion failed: R->getValueAsDef("Class")->getName() != "CLASS_NOTE" && "Note can't be in a DiagGroup", file C:\_work\llvm-project\llvm-project\clang\utils\TableGen\ClangDiagnosticsEmitter.cpp, line 156
PLEASE submit a bug report to https://github.com/llvm/llvm-project/issues/ and include the crash backtrace and instructions to reproduce the bug.
Stack dump:
0. Program arguments: C:\\_work\\llvm-project\\llvm-project\\build\\bin\\clang-tblgen.exe -gen-clang-diags-defs -clang-component=Parse -IC:/_work/llvm-project/llvm-project/clang/include/clang/Basic -IC:/_work/llvm-project/llvm-project/clang/include -IC:/_work/llvm-project/llvm-project/build/tools/clang/include -IC:/_work/llvm-project/llvm-project/build/include -IC:/_work/llvm-project/llvm-project/llvm/include --long-string-literals=0 C:/_work/llvm-project/llvm-project/clang/include/clang/Basic/Diagnostic.td --write-if-changed -o DiagnosticParseKinds.inc -d DiagnosticParseKinds.inc.d
Exception Code: 0xC000001D
#0 0x00007ff64e82e176 (C:\_work\llvm-project\llvm-project\build\bin\clang-tblgen.exe+0x17e176)
#1 0x00007ffd159bbb04 (C:\Windows\System32\ucrtbase.dll+0x7bb04)
#2 0x00007ffd159bcad1 (C:\Windows\System32\ucrtbase.dll+0x7cad1)
#3 0x00007ffd159be4a1 (C:\Windows\System32\ucrtbase.dll+0x7e4a1)
#4 0x00007ffd159be6e1 (C:\Windows\System32\ucrtbase.dll+0x7e6e1)
#5 0x00007ff64e753cc8 (C:\_work\llvm-project\llvm-project\build\bin\clang-tblgen.exe+0xa3cc8)
#6 0x00007ff64e751e0a (C:\_work\llvm-project\llvm-project\build\bin\clang-tblgen.exe+0xa1e0a)
#7 0x00007ff64e80488b (C:\_work\llvm-project\llvm-project\build\bin\clang-tblgen.exe+0x15488b)
#8 0x00007ff64e86972c (C:\_work\llvm-project\llvm-project\build\bin\clang-tblgen.exe+0x1b972c)
#9 0x00007ff64e866228 (C:\_work\llvm-project\llvm-project\build\bin\clang-tblgen.exe+0x1b6228)
#10 0x00007ff64e867928 (C:\_work\llvm-project\llvm-project\build\bin\clang-tblgen.exe+0x1b7928)
#11 0x00007ff64e8041d3 (C:\_work\llvm-project\llvm-project\build\bin\clang-tblgen.exe+0x1541d3)
#12 0x00007ff64e8c6ee0 (C:\_work\llvm-project\llvm-project\build\bin\clang-tblgen.exe+0x216ee0)
#13 0x00007ffd21064cb0 (C:\Windows\System32\KERNEL32.DLL+0x14cb0)
#14 0x00007ffd2d65edeb (C:\Windows\SYSTEM32\ntdll.dll+0x7edeb)
```
</details>
<details>
<summary>[code=3221225501] tools/clang/include/clang/Basic/DiagnosticRefactoringKinds.inc C:/_work/llvm-project/llvm-project/build/tools/clang/include/clang/Basic/DiagnosticRefactoringKinds.inc</summary>
```
FAILED: [code=3221225501] tools/clang/include/clang/Basic/DiagnosticRefactoringKinds.inc C:/_work/llvm-project/llvm-project/build/tools/clang/include/clang/Basic/DiagnosticRefactoringKinds.inc
C:\Windows\system32\cmd.exe /C "cd /D C:\_work\llvm-project\llvm-project\build\tools\clang\include\clang\Basic && C:\_work\llvm-project\llvm-project\build\bin\clang-tblgen.exe -gen-clang-diags-defs -clang-component=Refactoring -IC:/_work/llvm-project/llvm-project/clang/include/clang/Basic -IC:/_work/llvm-project/llvm-project/clang/include -IC:/_work/llvm-project/llvm-project/build/tools/clang/include -IC:/_work/llvm-project/llvm-project/build/include -IC:/_work/llvm-project/llvm-project/llvm/include --long-string-literals=0 C:/_work/llvm-project/llvm-project/clang/include/clang/Basic/Diagnostic.td --write-if-changed -o DiagnosticRefactoringKinds.inc -d DiagnosticRefactoringKinds.inc.d && C:\BuildTools\Common7\IDE\CommonExtensions\Microsoft\CMake\CMake\bin\cmake.exe -E cmake_transform_depfile Ninja gccdepfile C:/_work/llvm-project/llvm-project/llvm C:/_work/llvm-project/llvm-project/clang/include/clang/Basic C:/_work/llvm-project/llvm-project/build C:/_work/llvm-project/llvm-project/build/tools/clang/include/clang/Basic C:/_work/llvm-project/llvm-project/build/tools/clang/include/clang/Basic/DiagnosticRefactoringKinds.inc.d C:/_work/llvm-project/llvm-project/build/CMakeFiles/d/5a843bfd0c850dee975b6465a1c02f7b35bcbd2e5e1f668e979fda52acf4b752.d"
Assertion failed: R->getValueAsDef("Class")->getName() != "CLASS_NOTE" && "Note can't be in a DiagGroup", file C:\_work\llvm-project\llvm-project\clang\utils\TableGen\ClangDiagnosticsEmitter.cpp, line 156
PLEASE submit a bug report to https://github.com/llvm/llvm-project/issues/ and include the crash backtrace and instructions to reproduce the bug.
Stack dump:
0. Program arguments: C:\\_work\\llvm-project\\llvm-project\\build\\bin\\clang-tblgen.exe -gen-clang-diags-defs -clang-component=Refactoring -IC:/_work/llvm-project/llvm-project/clang/include/clang/Basic -IC:/_work/llvm-project/llvm-project/clang/include -IC:/_work/llvm-project/llvm-project/build/tools/clang/include -IC:/_work/llvm-project/llvm-project/build/include -IC:/_work/llvm-project/llvm-project/llvm/include --long-string-literals=0 C:/_work/llvm-project/llvm-project/clang/include/clang/Basic/Diagnostic.td --write-if-changed -o DiagnosticRefactoringKinds.inc -d DiagnosticRefactoringKinds.inc.d
Exception Code: 0xC000001D
#0 0x00007ff64e82e176 (C:\_work\llvm-project\llvm-project\build\bin\clang-tblgen.exe+0x17e176)
#1 0x00007ffd159bbb04 (C:\Windows\System32\ucrtbase.dll+0x7bb04)
#2 0x00007ffd159bcad1 (C:\Windows\System32\ucrtbase.dll+0x7cad1)
#3 0x00007ffd159be4a1 (C:\Windows\System32\ucrtbase.dll+0x7e4a1)
#4 0x00007ffd159be6e1 (C:\Windows\System32\ucrtbase.dll+0x7e6e1)
#5 0x00007ff64e753cc8 (C:\_work\llvm-project\llvm-project\build\bin\clang-tblgen.exe+0xa3cc8)
#6 0x00007ff64e751e0a (C:\_work\llvm-project\llvm-project\build\bin\clang-tblgen.exe+0xa1e0a)
#7 0x00007ff64e80488b (C:\_work\llvm-project\llvm-project\build\bin\clang-tblgen.exe+0x15488b)
#8 0x00007ff64e86972c (C:\_work\llvm-project\llvm-project\build\bin\clang-tblgen.exe+0x1b972c)
#9 0x00007ff64e866228 (C:\_work\llvm-project\llvm-project\build\bin\clang-tblgen.exe+0x1b6228)
#10 0x00007ff64e867928 (C:\_work\llvm-project\llvm-project\build\bin\clang-tblgen.exe+0x1b7928)
#11 0x00007ff64e8041d3 (C:\_work\llvm-project\llvm-project\build\bin\clang-tblgen.exe+0x1541d3)
#12 0x00007ff64e8c6ee0 (C:\_work\llvm-project\llvm-project\build\bin\clang-tblgen.exe+0x216ee0)
#13 0x00007ffd21064cb0 (C:\Windows\System32\KERNEL32.DLL+0x14cb0)
#14 0x00007ffd2d65edeb (C:\Windows\SYSTEM32\ntdll.dll+0x7edeb)
```
</details>
<details>
<summary>[code=3221225501] tools/clang/include/clang/Basic/DiagnosticSemaKinds.inc C:/_work/llvm-project/llvm-project/build/tools/clang/include/clang/Basic/DiagnosticSemaKinds.inc</summary>
```
FAILED: [code=3221225501] tools/clang/include/clang/Basic/DiagnosticSemaKinds.inc C:/_work/llvm-project/llvm-project/build/tools/clang/include/clang/Basic/DiagnosticSemaKinds.inc
C:\Windows\system32\cmd.exe /C "cd /D C:\_work\llvm-project\llvm-project\build\tools\clang\include\clang\Basic && C:\_work\llvm-project\llvm-project\build\bin\clang-tblgen.exe -gen-clang-diags-defs -clang-component=Sema -IC:/_work/llvm-project/llvm-project/clang/include/clang/Basic -IC:/_work/llvm-project/llvm-project/clang/include -IC:/_work/llvm-project/llvm-project/build/tools/clang/include -IC:/_work/llvm-project/llvm-project/build/include -IC:/_work/llvm-project/llvm-project/llvm/include --long-string-literals=0 C:/_work/llvm-project/llvm-project/clang/include/clang/Basic/Diagnostic.td --write-if-changed -o DiagnosticSemaKinds.inc -d DiagnosticSemaKinds.inc.d && C:\BuildTools\Common7\IDE\CommonExtensions\Microsoft\CMake\CMake\bin\cmake.exe -E cmake_transform_depfile Ninja gccdepfile C:/_work/llvm-project/llvm-project/llvm C:/_work/llvm-project/llvm-project/clang/include/clang/Basic C:/_work/llvm-project/llvm-project/build C:/_work/llvm-project/llvm-project/build/tools/clang/include/clang/Basic C:/_work/llvm-project/llvm-project/build/tools/clang/include/clang/Basic/DiagnosticSemaKinds.inc.d C:/_work/llvm-project/llvm-project/build/CMakeFiles/d/bf5fff5f17eea3ac226efe717e143ca5b309e5510820bc6d3f1173645fd4e332.d"
Assertion failed: R->getValueAsDef("Class")->getName() != "CLASS_NOTE" && "Note can't be in a DiagGroup", file C:\_work\llvm-project\llvm-project\clang\utils\TableGen\ClangDiagnosticsEmitter.cpp, line 156
PLEASE submit a bug report to https://github.com/llvm/llvm-project/issues/ and include the crash backtrace and instructions to reproduce the bug.
Stack dump:
0. Program arguments: C:\\_work\\llvm-project\\llvm-project\\build\\bin\\clang-tblgen.exe -gen-clang-diags-defs -clang-component=Sema -IC:/_work/llvm-project/llvm-project/clang/include/clang/Basic -IC:/_work/llvm-project/llvm-project/clang/include -IC:/_work/llvm-project/llvm-project/build/tools/clang/include -IC:/_work/llvm-project/llvm-project/build/include -IC:/_work/llvm-project/llvm-project/llvm/include --long-string-literals=0 C:/_work/llvm-project/llvm-project/clang/include/clang/Basic/Diagnostic.td --write-if-changed -o DiagnosticSemaKinds.inc -d DiagnosticSemaKinds.inc.d
Exception Code: 0xC000001D
#0 0x00007ff64e82e176 (C:\_work\llvm-project\llvm-project\build\bin\clang-tblgen.exe+0x17e176)
#1 0x00007ffd159bbb04 (C:\Windows\System32\ucrtbase.dll+0x7bb04)
#2 0x00007ffd159bcad1 (C:\Windows\System32\ucrtbase.dll+0x7cad1)
#3 0x00007ffd159be4a1 (C:\Windows\System32\ucrtbase.dll+0x7e4a1)
#4 0x00007ffd159be6e1 (C:\Windows\System32\ucrtbase.dll+0x7e6e1)
#5 0x00007ff64e753cc8 (C:\_work\llvm-project\llvm-project\build\bin\clang-tblgen.exe+0xa3cc8)
#6 0x00007ff64e751e0a (C:\_work\llvm-project\llvm-project\build\bin\clang-tblgen.exe+0xa1e0a)
#7 0x00007ff64e80488b (C:\_work\llvm-project\llvm-project\build\bin\clang-tblgen.exe+0x15488b)
#8 0x00007ff64e86972c (C:\_work\llvm-project\llvm-project\build\bin\clang-tblgen.exe+0x1b972c)
#9 0x00007ff64e866228 (C:\_work\llvm-project\llvm-project\build\bin\clang-tblgen.exe+0x1b6228)
#10 0x00007ff64e867928 (C:\_work\llvm-project\llvm-project\build\bin\clang-tblgen.exe+0x1b7928)
#11 0x00007ff64e8041d3 (C:\_work\llvm-project\llvm-project\build\bin\clang-tblgen.exe+0x1541d3)
#12 0x00007ff64e8c6ee0 (C:\_work\llvm-project\llvm-project\build\bin\clang-tblgen.exe+0x216ee0)
#13 0x00007ffd21064cb0 (C:\Windows\System32\KERNEL32.DLL+0x14cb0)
#14 0x00007ffd2d65edeb (C:\Windows\SYSTEM32\ntdll.dll+0x7edeb)
```
</details>
<details>
<summary>[code=3221225501] tools/clang/include/clang/Basic/DiagnosticSerializationKinds.inc C:/_work/llvm-project/llvm-project/build/tools/clang/include/clang/Basic/DiagnosticSerializationKinds.inc</summary>
```
FAILED: [code=3221225501] tools/clang/include/clang/Basic/DiagnosticSerializationKinds.inc C:/_work/llvm-project/llvm-project/build/tools/clang/include/clang/Basic/DiagnosticSerializationKinds.inc
C:\Windows\system32\cmd.exe /C "cd /D C:\_work\llvm-project\llvm-project\build\tools\clang\include\clang\Basic && C:\_work\llvm-project\llvm-project\build\bin\clang-tblgen.exe -gen-clang-diags-defs -clang-component=Serialization -IC:/_work/llvm-project/llvm-project/clang/include/clang/Basic -IC:/_work/llvm-project/llvm-project/clang/include -IC:/_work/llvm-project/llvm-project/build/tools/clang/include -IC:/_work/llvm-project/llvm-project/build/include -IC:/_work/llvm-project/llvm-project/llvm/include --long-string-literals=0 C:/_work/llvm-project/llvm-project/clang/include/clang/Basic/Diagnostic.td --write-if-changed -o DiagnosticSerializationKinds.inc -d DiagnosticSerializationKinds.inc.d && C:\BuildTools\Common7\IDE\CommonExtensions\Microsoft\CMake\CMake\bin\cmake.exe -E cmake_transform_depfile Ninja gccdepfile C:/_work/llvm-project/llvm-project/llvm C:/_work/llvm-project/llvm-project/clang/include/clang/Basic C:/_work/llvm-project/llvm-project/build C:/_work/llvm-project/llvm-project/build/tools/clang/include/clang/Basic C:/_work/llvm-project/llvm-project/build/tools/clang/include/clang/Basic/DiagnosticSerializationKinds.inc.d C:/_work/llvm-project/llvm-project/build/CMakeFiles/d/33e073920127c0b86a669e3fae6813246852efa271f95310ac7ad158eda895db.d"
Assertion failed: R->getValueAsDef("Class")->getName() != "CLASS_NOTE" && "Note can't be in a DiagGroup", file C:\_work\llvm-project\llvm-project\clang\utils\TableGen\ClangDiagnosticsEmitter.cpp, line 156
PLEASE submit a bug report to https://github.com/llvm/llvm-project/issues/ and include the crash backtrace and instructions to reproduce the bug.
Stack dump:
0. Program arguments: C:\\_work\\llvm-project\\llvm-project\\build\\bin\\clang-tblgen.exe -gen-clang-diags-defs -clang-component=Serialization -IC:/_work/llvm-project/llvm-project/clang/include/clang/Basic -IC:/_work/llvm-project/llvm-project/clang/include -IC:/_work/llvm-project/llvm-project/build/tools/clang/include -IC:/_work/llvm-project/llvm-project/build/include -IC:/_work/llvm-project/llvm-project/llvm/include --long-string-literals=0 C:/_work/llvm-project/llvm-project/clang/include/clang/Basic/Diagnostic.td --write-if-changed -o DiagnosticSerializationKinds.inc -d DiagnosticSerializationKinds.inc.d
Exception Code: 0xC000001D
#0 0x00007ff64e82e176 (C:\_work\llvm-project\llvm-project\build\bin\clang-tblgen.exe+0x17e176)
#1 0x00007ffd159bbb04 (C:\Windows\System32\ucrtbase.dll+0x7bb04)
#2 0x00007ffd159bcad1 (C:\Windows\System32\ucrtbase.dll+0x7cad1)
#3 0x00007ffd159be4a1 (C:\Windows\System32\ucrtbase.dll+0x7e4a1)
#4 0x00007ffd159be6e1 (C:\Windows\System32\ucrtbase.dll+0x7e6e1)
#5 0x00007ff64e753cc8 (C:\_work\llvm-project\llvm-project\build\bin\clang-tblgen.exe+0xa3cc8)
#6 0x00007ff64e751e0a (C:\_work\llvm-project\llvm-project\build\bin\clang-tblgen.exe+0xa1e0a)
#7 0x00007ff64e80488b (C:\_work\llvm-project\llvm-project\build\bin\clang-tblgen.exe+0x15488b)
#8 0x00007ff64e86972c (C:\_work\llvm-project\llvm-project\build\bin\clang-tblgen.exe+0x1b972c)
#9 0x00007ff64e866228 (C:\_work\llvm-project\llvm-project\build\bin\clang-tblgen.exe+0x1b6228)
#10 0x00007ff64e867928 (C:\_work\llvm-project\llvm-project\build\bin\clang-tblgen.exe+0x1b7928)
#11 0x00007ff64e8041d3 (C:\_work\llvm-project\llvm-project\build\bin\clang-tblgen.exe+0x1541d3)
#12 0x00007ff64e8c6ee0 (C:\_work\llvm-project\llvm-project\build\bin\clang-tblgen.exe+0x216ee0)
#13 0x00007ffd21064cb0 (C:\Windows\System32\KERNEL32.DLL+0x14cb0)
#14 0x00007ffd2d65edeb (C:\Windows\SYSTEM32\ntdll.dll+0x7edeb)
```
</details>
<details>
<summary>[code=3221225501] tools/clang/include/clang/Basic/DiagnosticTrapKinds.inc C:/_work/llvm-project/llvm-project/build/tools/clang/include/clang/Basic/DiagnosticTrapKinds.inc</summary>
```
FAILED: [code=3221225501] tools/clang/include/clang/Basic/DiagnosticTrapKinds.inc C:/_work/llvm-project/llvm-project/build/tools/clang/include/clang/Basic/DiagnosticTrapKinds.inc
C:\Windows\system32\cmd.exe /C "cd /D C:\_work\llvm-project\llvm-project\build\tools\clang\include\clang\Basic && C:\_work\llvm-project\llvm-project\build\bin\clang-tblgen.exe -gen-clang-diags-defs -clang-component=Trap -IC:/_work/llvm-project/llvm-project/clang/include/clang/Basic -IC:/_work/llvm-project/llvm-project/clang/include -IC:/_work/llvm-project/llvm-project/build/tools/clang/include -IC:/_work/llvm-project/llvm-project/build/include -IC:/_work/llvm-project/llvm-project/llvm/include --long-string-literals=0 C:/_work/llvm-project/llvm-project/clang/include/clang/Basic/Diagnostic.td --write-if-changed -o DiagnosticTrapKinds.inc -d DiagnosticTrapKinds.inc.d && C:\BuildTools\Common7\IDE\CommonExtensions\Microsoft\CMake\CMake\bin\cmake.exe -E cmake_transform_depfile Ninja gccdepfile C:/_work/llvm-project/llvm-project/llvm C:/_work/llvm-project/llvm-project/clang/include/clang/Basic C:/_work/llvm-project/llvm-project/build C:/_work/llvm-project/llvm-project/build/tools/clang/include/clang/Basic C:/_work/llvm-project/llvm-project/build/tools/clang/include/clang/Basic/DiagnosticTrapKinds.inc.d C:/_work/llvm-project/llvm-project/build/CMakeFiles/d/9f805f398d82de9906f0c0bc2e24bb33f5691777ddad10cf2560a6b24428c7ef.d"
Assertion failed: R->getValueAsDef("Class")->getName() != "CLASS_NOTE" && "Note can't be in a DiagGroup", file C:\_work\llvm-project\llvm-project\clang\utils\TableGen\ClangDiagnosticsEmitter.cpp, line 156
PLEASE submit a bug report to https://github.com/llvm/llvm-project/issues/ and include the crash backtrace and instructions to reproduce the bug.
Stack dump:
0. Program arguments: C:\\_work\\llvm-project\\llvm-project\\build\\bin\\clang-tblgen.exe -gen-clang-diags-defs -clang-component=Trap -IC:/_work/llvm-project/llvm-project/clang/include/clang/Basic -IC:/_work/llvm-project/llvm-project/clang/include -IC:/_work/llvm-project/llvm-project/build/tools/clang/include -IC:/_work/llvm-project/llvm-project/build/include -IC:/_work/llvm-project/llvm-project/llvm/include --long-string-literals=0 C:/_work/llvm-project/llvm-project/clang/include/clang/Basic/Diagnostic.td --write-if-changed -o DiagnosticTrapKinds.inc -d DiagnosticTrapKinds.inc.d
Exception Code: 0xC000001D
#0 0x00007ff64e82e176 (C:\_work\llvm-project\llvm-project\build\bin\clang-tblgen.exe+0x17e176)
#1 0x00007ffd159bbb04 (C:\Windows\System32\ucrtbase.dll+0x7bb04)
#2 0x00007ffd159bcad1 (C:\Windows\System32\ucrtbase.dll+0x7cad1)
#3 0x00007ffd159be4a1 (C:\Windows\System32\ucrtbase.dll+0x7e4a1)
#4 0x00007ffd159be6e1 (C:\Windows\System32\ucrtbase.dll+0x7e6e1)
#5 0x00007ff64e753cc8 (C:\_work\llvm-project\llvm-project\build\bin\clang-tblgen.exe+0xa3cc8)
#6 0x00007ff64e751e0a (C:\_work\llvm-project\llvm-project\build\bin\clang-tblgen.exe+0xa1e0a)
#7 0x00007ff64e80488b (C:\_work\llvm-project\llvm-project\build\bin\clang-tblgen.exe+0x15488b)
#8 0x00007ff64e86972c (C:\_work\llvm-project\llvm-project\build\bin\clang-tblgen.exe+0x1b972c)
#9 0x00007ff64e866228 (C:\_work\llvm-project\llvm-project\build\bin\clang-tblgen.exe+0x1b6228)
#10 0x00007ff64e867928 (C:\_work\llvm-project\llvm-project\build\bin\clang-tblgen.exe+0x1b7928)
#11 0x00007ff64e8041d3 (C:\_work\llvm-project\llvm-project\build\bin\clang-tblgen.exe+0x1541d3)
#12 0x00007ff64e8c6ee0 (C:\_work\llvm-project\llvm-project\build\bin\clang-tblgen.exe+0x216ee0)
#13 0x00007ffd21064cb0 (C:\Windows\System32\KERNEL32.DLL+0x14cb0)
#14 0x00007ffd2d65edeb (C:\Windows\SYSTEM32\ntdll.dll+0x7edeb)
```
</details>
<details>
<summary>[code=3221225501] tools/clang/include/clang/Basic/DiagnosticGroups.inc C:/_work/llvm-project/llvm-project/build/tools/clang/include/clang/Basic/DiagnosticGroups.inc</summary>
```
FAILED: [code=3221225501] tools/clang/include/clang/Basic/DiagnosticGroups.inc C:/_work/llvm-project/llvm-project/build/tools/clang/include/clang/Basic/DiagnosticGroups.inc
C:\Windows\system32\cmd.exe /C "cd /D C:\_work\llvm-project\llvm-project\build\tools\clang\include\clang\Basic && C:\_work\llvm-project\llvm-project\build\bin\clang-tblgen.exe -gen-clang-diag-groups -IC:/_work/llvm-project/llvm-project/clang/include/clang/Basic -IC:/_work/llvm-project/llvm-project/clang/include -IC:/_work/llvm-project/llvm-project/build/tools/clang/include -IC:/_work/llvm-project/llvm-project/build/include -IC:/_work/llvm-project/llvm-project/llvm/include --long-string-literals=0 C:/_work/llvm-project/llvm-project/clang/include/clang/Basic/Diagnostic.td --write-if-changed -o DiagnosticGroups.inc -d DiagnosticGroups.inc.d && C:\BuildTools\Common7\IDE\CommonExtensions\Microsoft\CMake\CMake\bin\cmake.exe -E cmake_transform_depfile Ninja gccdepfile C:/_work/llvm-project/llvm-project/llvm C:/_work/llvm-project/llvm-project/clang/include/clang/Basic C:/_work/llvm-project/llvm-project/build C:/_work/llvm-project/llvm-project/build/tools/clang/include/clang/Basic C:/_work/llvm-project/llvm-project/build/tools/clang/include/clang/Basic/DiagnosticGroups.inc.d C:/_work/llvm-project/llvm-project/build/CMakeFiles/d/5d77c1748817a2093c0a7e69cac369f8dd3682810e8880da72dc35791325cd8c.d"
Assertion failed: R->getValueAsDef("Class")->getName() != "CLASS_NOTE" && "Note can't be in a DiagGroup", file C:\_work\llvm-project\llvm-project\clang\utils\TableGen\ClangDiagnosticsEmitter.cpp, line 156
PLEASE submit a bug report to https://github.com/llvm/llvm-project/issues/ and include the crash backtrace and instructions to reproduce the bug.
Stack dump:
0. Program arguments: C:\\_work\\llvm-project\\llvm-project\\build\\bin\\clang-tblgen.exe -gen-clang-diag-groups -IC:/_work/llvm-project/llvm-project/clang/include/clang/Basic -IC:/_work/llvm-project/llvm-project/clang/include -IC:/_work/llvm-project/llvm-project/build/tools/clang/include -IC:/_work/llvm-project/llvm-project/build/include -IC:/_work/llvm-project/llvm-project/llvm/include --long-string-literals=0 C:/_work/llvm-project/llvm-project/clang/include/clang/Basic/Diagnostic.td --write-if-changed -o DiagnosticGroups.inc -d DiagnosticGroups.inc.d
Exception Code: 0xC000001D
#0 0x00007ff64e82e176 (C:\_work\llvm-project\llvm-project\build\bin\clang-tblgen.exe+0x17e176)
#1 0x00007ffd159bbb04 (C:\Windows\System32\ucrtbase.dll+0x7bb04)
#2 0x00007ffd159bcad1 (C:\Windows\System32\ucrtbase.dll+0x7cad1)
#3 0x00007ffd159be4a1 (C:\Windows\System32\ucrtbase.dll+0x7e4a1)
#4 0x00007ffd159be6e1 (C:\Windows\System32\ucrtbase.dll+0x7e6e1)
#5 0x00007ff64e753cc8 (C:\_work\llvm-project\llvm-project\build\bin\clang-tblgen.exe+0xa3cc8)
#6 0x00007ff64e755a28 (C:\_work\llvm-project\llvm-project\build\bin\clang-tblgen.exe+0xa5a28)
#7 0x00007ff64e8046b6 (C:\_work\llvm-project\llvm-project\build\bin\clang-tblgen.exe+0x1546b6)
#8 0x00007ff64e86972c (C:\_work\llvm-project\llvm-project\build\bin\clang-tblgen.exe+0x1b972c)
#9 0x00007ff64e866228 (C:\_work\llvm-project\llvm-project\build\bin\clang-tblgen.exe+0x1b6228)
#10 0x00007ff64e867928 (C:\_work\llvm-project\llvm-project\build\bin\clang-tblgen.exe+0x1b7928)
#11 0x00007ff64e8041d3 (C:\_work\llvm-project\llvm-project\build\bin\clang-tblgen.exe+0x1541d3)
#12 0x00007ff64e8c6ee0 (C:\_work\llvm-project\llvm-project\build\bin\clang-tblgen.exe+0x216ee0)
#13 0x00007ffd21064cb0 (C:\Windows\System32\KERNEL32.DLL+0x14cb0)
#14 0x00007ffd2d65edeb (C:\Windows\SYSTEM32\ntdll.dll+0x7edeb)
```
</details>
If these failures are unrelated to your changes (for example tests are broken or flaky at HEAD), please open an issue at https://github.com/llvm/llvm-project/issues and add the `infrastructure` label.
https://github.com/llvm/llvm-project/pull/225748
More information about the cfe-commits
mailing list