[clang] [clang][ssaf] Add --ssaf-extract-summaries= and --ssaf-tu-summary-file= options (PR #184421)
LLVM Continuous Integration via cfe-commits
cfe-commits at lists.llvm.org
Mon Mar 9 03:44:39 PDT 2026
llvm-ci wrote:
LLVM Buildbot has detected a new failure on builder `amdgpu-offload-build-only` running on `AMD-bb-w-02` while building `clang` at step 4 "annotate".
Full details are available at: https://lab.llvm.org/buildbot/#/builders/226/builds/252
<details>
<summary>Here is the relevant piece of the build log for the reference</summary>
```
Step 4 (annotate) failure: '../llvm-zorg/zorg/buildbot/builders/annotated/amdgpu-offload-cmake.py --jobs=32' (failure)
...
[7509/8486] Creating library symlink lib/libMLIRSPIRVToLLVMIRTranslation.so
[7510/8486] Creating library symlink lib/libMLIRTestDialect.so
[7511/8486] Building CXX object tools/clang/lib/Tooling/CMakeFiles/obj.clangTooling.dir/ArgumentsAdjusters.cpp.o
[7512/8486] Linking CXX shared library lib/libMLIRVCIXToLLVMIRTranslation.so.23.0git
[7513/8486] Creating library symlink lib/libMLIRVCIXToLLVMIRTranslation.so
[7514/8486] Linking CXX shared library lib/libMLIRToLLVMIRTranslationRegistration.so.23.0git
[7515/8486] Building CXX object tools/clang/lib/Frontend/Rewrite/CMakeFiles/obj.clangRewriteFrontend.dir/RewriteModernObjC.cpp.o
[7516/8486] Building CXX object tools/clang/tools/driver/CMakeFiles/clang.dir/cc1gen_reproducer_main.cpp.o
[7517/8486] Building CXX object tools/clang/lib/Analysis/Scalable/CMakeFiles/obj.clangAnalysisScalable.dir/Frontend/TUSummaryExtractorFrontendAction.cpp.o
[7518/8486] Linking CXX shared library lib/libclangAnalysisScalable.so.23.0git
FAILED: lib/libclangAnalysisScalable.so.23.0git
: && /opt/rh/gcc-toolset-13/root/usr/bin/c++ -fPIC -fPIC -fno-semantic-interposition -fvisibility-inlines-hidden -Werror=date-time -Wall -Wextra -Wno-unused-parameter -Wwrite-strings -Wcast-qual -Wno-missing-field-initializers -pedantic -Wno-long-long -Wimplicit-fallthrough -Wno-uninitialized -Wno-nonnull -Wno-class-memaccess -Wno-dangling-reference -Wno-redundant-move -Wno-pessimizing-move -Wno-array-bounds -Wno-stringop-overread -Wno-dangling-pointer -Wno-noexcept-type -Wdelete-non-virtual-dtor -Wsuggest-override -Wno-comment -Wno-misleading-indentation -Wctad-maybe-unsupported -fdiagnostics-color -ffunction-sections -fdata-sections -fno-common -Woverloaded-virtual -O3 -DNDEBUG -Wl,-z,defs -Wl,-z,nodelete -Wl,-rpath-link,/home/botworker/bbot/amdgpu-offload-build-only/build/./lib -Wl,--gc-sections -shared -Wl,-soname,libclangAnalysisScalable.so.23.0git -o lib/libclangAnalysisScalable.so.23.0git tools/clang/lib/Analysis/Scalable/CMakeFiles/obj.clangAnalysisScalable.dir/ASTEntityMapping.cpp.o tools/clang/lib/Analysis/Scalable/CMakeFiles/obj.clangAnalysisScalable.dir/EntityLinker/EntityLinker.cpp.o tools/clang/lib/Analysis/Scalable/CMakeFiles/obj.clangAnalysisScalable.dir/Frontend/TUSummaryExtractorFrontendAction.cpp.o tools/clang/lib/Analysis/Scalable/CMakeFiles/obj.clangAnalysisScalable.dir/Model/BuildNamespace.cpp.o tools/clang/lib/Analysis/Scalable/CMakeFiles/obj.clangAnalysisScalable.dir/Model/EntityId.cpp.o tools/clang/lib/Analysis/Scalable/CMakeFiles/obj.clangAnalysisScalable.dir/Model/EntityIdTable.cpp.o tools/clang/lib/Analysis/Scalable/CMakeFiles/obj.clangAnalysisScalable.dir/Model/EntityLinkage.cpp.o tools/clang/lib/Analysis/Scalable/CMakeFiles/obj.clangAnalysisScalable.dir/Model/EntityName.cpp.o tools/clang/lib/Analysis/Scalable/CMakeFiles/obj.clangAnalysisScalable.dir/Model/SummaryName.cpp.o tools/clang/lib/Analysis/Scalable/CMakeFiles/obj.clangAnalysisScalable.dir/Serialization/JSONFormat/JSONFormatImpl.cpp.o tools/clang/lib/Analysis/Scalable/CMakeFiles/obj.clangAnalysisScalable.dir/Serialization/JSONFormat/LUSummary.cpp.o tools/clang/lib/Analysis/Scalable/CMakeFiles/obj.clangAnalysisScalable.dir/Serialization/JSONFormat/LUSummaryEncoding.cpp.o tools/clang/lib/Analysis/Scalable/CMakeFiles/obj.clangAnalysisScalable.dir/Serialization/JSONFormat/TUSummary.cpp.o tools/clang/lib/Analysis/Scalable/CMakeFiles/obj.clangAnalysisScalable.dir/Serialization/JSONFormat/TUSummaryEncoding.cpp.o tools/clang/lib/Analysis/Scalable/CMakeFiles/obj.clangAnalysisScalable.dir/Serialization/SerializationFormatRegistry.cpp.o tools/clang/lib/Analysis/Scalable/CMakeFiles/obj.clangAnalysisScalable.dir/Support/ErrorBuilder.cpp.o tools/clang/lib/Analysis/Scalable/CMakeFiles/obj.clangAnalysisScalable.dir/TUSummary/ExtractorRegistry.cpp.o tools/clang/lib/Analysis/Scalable/CMakeFiles/obj.clangAnalysisScalable.dir/TUSummary/TUSummaryBuilder.cpp.o -Wl,-rpath,"\$ORIGIN/../lib:/home/botworker/bbot/amdgpu-offload-build-only/build/lib:" lib/libclangIndex.so.23.0git lib/libclangFrontend.so.23.0git lib/libclangASTMatchers.so.23.0git lib/libclangAST.so.23.0git lib/libclangLex.so.23.0git lib/libclangBasic.so.23.0git lib/libLLVMSupport.so.23.0git -Wl,-rpath-link,/home/botworker/bbot/amdgpu-offload-build-only/build/lib && :
/opt/rh/gcc-toolset-13/root/usr/libexec/gcc/x86_64-redhat-linux/13/ld: tools/clang/lib/Analysis/Scalable/CMakeFiles/obj.clangAnalysisScalable.dir/Frontend/TUSummaryExtractorFrontendAction.cpp.o:(.data.rel.ro._ZTVN12_GLOBAL__N_115TUSummaryRunnerE+0xc0): undefined reference to `clang::SemaConsumer::anchor()'
collect2: error: ld returned 1 exit status
[7519/8486] Building CXX object tools/clang/lib/CodeGen/CMakeFiles/obj.clangCodeGen.dir/Targets/X86.cpp.o
[7520/8486] Building CXX object tools/clang/lib/CodeGen/CMakeFiles/obj.clangCodeGen.dir/Targets/XCore.cpp.o
[7521/8486] Building CXX object tools/clang/lib/StaticAnalyzer/Frontend/CMakeFiles/obj.clangStaticAnalyzerFrontend.dir/CreateCheckerManager.cpp.o
[7522/8486] Building CXX object tools/clang/tools/driver/CMakeFiles/clang.dir/cc1as_main.cpp.o
[7523/8486] Building CXX object tools/clang/lib/StaticAnalyzer/Frontend/CMakeFiles/obj.clangStaticAnalyzerFrontend.dir/CheckerRegistry.cpp.o
[7524/8486] Building CXX object tools/clang/lib/Frontend/Rewrite/CMakeFiles/obj.clangRewriteFrontend.dir/FrontendActions.cpp.o
[7525/8486] Building CXX object tools/clang/lib/StaticAnalyzer/Frontend/CMakeFiles/obj.clangStaticAnalyzerFrontend.dir/AnalyzerHelpFlags.cpp.o
[7526/8486] Building CXX object tools/clang/lib/CodeGen/CMakeFiles/obj.clangCodeGen.dir/TargetBuiltins/ARM.cpp.o
[7527/8486] Building CXX object tools/clang/tools/driver/CMakeFiles/clang.dir/driver.cpp.o
[7528/8486] Building CXX object tools/clang/lib/StaticAnalyzer/Frontend/CMakeFiles/obj.clangStaticAnalyzerFrontend.dir/AnalysisConsumer.cpp.o
[7529/8486] Building CXX object tools/clang/lib/StaticAnalyzer/Frontend/CMakeFiles/obj.clangStaticAnalyzerFrontend.dir/FrontendActions.cpp.o
[7530/8486] Building CXX object tools/clang/lib/StaticAnalyzer/Frontend/CMakeFiles/obj.clangStaticAnalyzerFrontend.dir/ModelInjector.cpp.o
[7531/8486] Building CXX object tools/clang/tools/driver/CMakeFiles/clang.dir/cc1_main.cpp.o
[7532/8486] Building CXX object tools/clang/lib/FrontendTool/CMakeFiles/obj.clangFrontendTool.dir/ExecuteCompilerInvocation.cpp.o
[7533/8486] Building CXX object tools/clang/lib/CodeGen/CMakeFiles/obj.clangCodeGen.dir/CodeGenModule.cpp.o
[7534/8486] Building CXX object tools/clang/lib/Tooling/CMakeFiles/obj.clangTooling.dir/CommonOptionsParser.cpp.o
[7535/8486] Building CXX object tools/clang/lib/DependencyScanning/CMakeFiles/obj.clangDependencyScanning.dir/DependencyScanningWorker.cpp.o
[7536/8486] Building CXX object tools/clang/lib/Tooling/CMakeFiles/obj.clangTooling.dir/AllTUsExecution.cpp.o
[7537/8486] Building CXX object tools/clang/lib/Tooling/CMakeFiles/obj.clangTooling.dir/Execution.cpp.o
[7538/8486] Building CXX object tools/clang/lib/DependencyScanning/CMakeFiles/obj.clangDependencyScanning.dir/DependencyScanningUtils.cpp.o
[7539/8486] Building CXX object tools/clang/lib/Tooling/CMakeFiles/obj.clangTooling.dir/CompilationDatabase.cpp.o
[7540/8486] Building CXX object tools/clang/lib/DependencyScanning/CMakeFiles/obj.clangDependencyScanning.dir/DependencyScannerImpl.cpp.o
[7541/8486] Building CXX object tools/clang/lib/DependencyScanning/CMakeFiles/obj.clangDependencyScanning.dir/ModuleDepCollector.cpp.o
[7542/8486] Building CXX object tools/clang/lib/Tooling/CMakeFiles/obj.clangTooling.dir/DependencyScanningTool.cpp.o
[7543/8486] Building CXX object tools/flang/tools/flang-driver/CMakeFiles/flang.dir/fc1_main.cpp.o
[7544/8486] Building CXX object tools/clang/lib/ExtractAPI/CMakeFiles/obj.clangExtractAPI.dir/ExtractAPIConsumer.cpp.o
[7545/8486] Building CXX object tools/flang/lib/Frontend/CMakeFiles/flangFrontend.dir/CompilerInstance.cpp.o
[7546/8486] Building CXX object tools/flang/tools/flang-driver/CMakeFiles/flang.dir/driver.cpp.o
[7547/8486] Building CXX object tools/flang/lib/Frontend/CMakeFiles/flangFrontend.dir/CompilerInvocation.cpp.o
[7548/8486] Building CXX object tools/flang/lib/Frontend/CMakeFiles/flangFrontend.dir/FrontendAction.cpp.o
[7549/8486] Building CXX object tools/flang/lib/FrontendTool/CMakeFiles/flangFrontendTool.dir/ExecuteCompilerInvocation.cpp.o
[7550/8486] Building CXX object tools/flang/lib/Frontend/CMakeFiles/flangFrontend.dir/FrontendActions.cpp.o
[7551/8486] Building CXX object tools/flang/lib/Frontend/CMakeFiles/flangFrontend.dir/ParserActions.cpp.o
ninja: build stopped: subcommand failed.
['ninja'] exited with return code 1.
Step 7 (build cmake config) failure: build cmake config (failure)
...
[7509/8486] Creating library symlink lib/libMLIRSPIRVToLLVMIRTranslation.so
[7510/8486] Creating library symlink lib/libMLIRTestDialect.so
[7511/8486] Building CXX object tools/clang/lib/Tooling/CMakeFiles/obj.clangTooling.dir/ArgumentsAdjusters.cpp.o
[7512/8486] Linking CXX shared library lib/libMLIRVCIXToLLVMIRTranslation.so.23.0git
[7513/8486] Creating library symlink lib/libMLIRVCIXToLLVMIRTranslation.so
[7514/8486] Linking CXX shared library lib/libMLIRToLLVMIRTranslationRegistration.so.23.0git
[7515/8486] Building CXX object tools/clang/lib/Frontend/Rewrite/CMakeFiles/obj.clangRewriteFrontend.dir/RewriteModernObjC.cpp.o
[7516/8486] Building CXX object tools/clang/tools/driver/CMakeFiles/clang.dir/cc1gen_reproducer_main.cpp.o
[7517/8486] Building CXX object tools/clang/lib/Analysis/Scalable/CMakeFiles/obj.clangAnalysisScalable.dir/Frontend/TUSummaryExtractorFrontendAction.cpp.o
[7518/8486] Linking CXX shared library lib/libclangAnalysisScalable.so.23.0git
FAILED: lib/libclangAnalysisScalable.so.23.0git
: && /opt/rh/gcc-toolset-13/root/usr/bin/c++ -fPIC -fPIC -fno-semantic-interposition -fvisibility-inlines-hidden -Werror=date-time -Wall -Wextra -Wno-unused-parameter -Wwrite-strings -Wcast-qual -Wno-missing-field-initializers -pedantic -Wno-long-long -Wimplicit-fallthrough -Wno-uninitialized -Wno-nonnull -Wno-class-memaccess -Wno-dangling-reference -Wno-redundant-move -Wno-pessimizing-move -Wno-array-bounds -Wno-stringop-overread -Wno-dangling-pointer -Wno-noexcept-type -Wdelete-non-virtual-dtor -Wsuggest-override -Wno-comment -Wno-misleading-indentation -Wctad-maybe-unsupported -fdiagnostics-color -ffunction-sections -fdata-sections -fno-common -Woverloaded-virtual -O3 -DNDEBUG -Wl,-z,defs -Wl,-z,nodelete -Wl,-rpath-link,/home/botworker/bbot/amdgpu-offload-build-only/build/./lib -Wl,--gc-sections -shared -Wl,-soname,libclangAnalysisScalable.so.23.0git -o lib/libclangAnalysisScalable.so.23.0git tools/clang/lib/Analysis/Scalable/CMakeFiles/obj.clangAnalysisScalable.dir/ASTEntityMapping.cpp.o tools/clang/lib/Analysis/Scalable/CMakeFiles/obj.clangAnalysisScalable.dir/EntityLinker/EntityLinker.cpp.o tools/clang/lib/Analysis/Scalable/CMakeFiles/obj.clangAnalysisScalable.dir/Frontend/TUSummaryExtractorFrontendAction.cpp.o tools/clang/lib/Analysis/Scalable/CMakeFiles/obj.clangAnalysisScalable.dir/Model/BuildNamespace.cpp.o tools/clang/lib/Analysis/Scalable/CMakeFiles/obj.clangAnalysisScalable.dir/Model/EntityId.cpp.o tools/clang/lib/Analysis/Scalable/CMakeFiles/obj.clangAnalysisScalable.dir/Model/EntityIdTable.cpp.o tools/clang/lib/Analysis/Scalable/CMakeFiles/obj.clangAnalysisScalable.dir/Model/EntityLinkage.cpp.o tools/clang/lib/Analysis/Scalable/CMakeFiles/obj.clangAnalysisScalable.dir/Model/EntityName.cpp.o tools/clang/lib/Analysis/Scalable/CMakeFiles/obj.clangAnalysisScalable.dir/Model/SummaryName.cpp.o tools/clang/lib/Analysis/Scalable/CMakeFiles/obj.clangAnalysisScalable.dir/Serialization/JSONFormat/JSONFormatImpl.cpp.o tools/clang/lib/Analysis/Scalable/CMakeFiles/obj.clangAnalysisScalable.dir/Serialization/JSONFormat/LUSummary.cpp.o tools/clang/lib/Analysis/Scalable/CMakeFiles/obj.clangAnalysisScalable.dir/Serialization/JSONFormat/LUSummaryEncoding.cpp.o tools/clang/lib/Analysis/Scalable/CMakeFiles/obj.clangAnalysisScalable.dir/Serialization/JSONFormat/TUSummary.cpp.o tools/clang/lib/Analysis/Scalable/CMakeFiles/obj.clangAnalysisScalable.dir/Serialization/JSONFormat/TUSummaryEncoding.cpp.o tools/clang/lib/Analysis/Scalable/CMakeFiles/obj.clangAnalysisScalable.dir/Serialization/SerializationFormatRegistry.cpp.o tools/clang/lib/Analysis/Scalable/CMakeFiles/obj.clangAnalysisScalable.dir/Support/ErrorBuilder.cpp.o tools/clang/lib/Analysis/Scalable/CMakeFiles/obj.clangAnalysisScalable.dir/TUSummary/ExtractorRegistry.cpp.o tools/clang/lib/Analysis/Scalable/CMakeFiles/obj.clangAnalysisScalable.dir/TUSummary/TUSummaryBuilder.cpp.o -Wl,-rpath,"\$ORIGIN/../lib:/home/botworker/bbot/amdgpu-offload-build-only/build/lib:" lib/libclangIndex.so.23.0git lib/libclangFrontend.so.23.0git lib/libclangASTMatchers.so.23.0git lib/libclangAST.so.23.0git lib/libclangLex.so.23.0git lib/libclangBasic.so.23.0git lib/libLLVMSupport.so.23.0git -Wl,-rpath-link,/home/botworker/bbot/amdgpu-offload-build-only/build/lib && :
/opt/rh/gcc-toolset-13/root/usr/libexec/gcc/x86_64-redhat-linux/13/ld: tools/clang/lib/Analysis/Scalable/CMakeFiles/obj.clangAnalysisScalable.dir/Frontend/TUSummaryExtractorFrontendAction.cpp.o:(.data.rel.ro._ZTVN12_GLOBAL__N_115TUSummaryRunnerE+0xc0): undefined reference to `clang::SemaConsumer::anchor()'
collect2: error: ld returned 1 exit status
[7519/8486] Building CXX object tools/clang/lib/CodeGen/CMakeFiles/obj.clangCodeGen.dir/Targets/X86.cpp.o
[7520/8486] Building CXX object tools/clang/lib/CodeGen/CMakeFiles/obj.clangCodeGen.dir/Targets/XCore.cpp.o
[7521/8486] Building CXX object tools/clang/lib/StaticAnalyzer/Frontend/CMakeFiles/obj.clangStaticAnalyzerFrontend.dir/CreateCheckerManager.cpp.o
[7522/8486] Building CXX object tools/clang/tools/driver/CMakeFiles/clang.dir/cc1as_main.cpp.o
[7523/8486] Building CXX object tools/clang/lib/StaticAnalyzer/Frontend/CMakeFiles/obj.clangStaticAnalyzerFrontend.dir/CheckerRegistry.cpp.o
[7524/8486] Building CXX object tools/clang/lib/Frontend/Rewrite/CMakeFiles/obj.clangRewriteFrontend.dir/FrontendActions.cpp.o
[7525/8486] Building CXX object tools/clang/lib/StaticAnalyzer/Frontend/CMakeFiles/obj.clangStaticAnalyzerFrontend.dir/AnalyzerHelpFlags.cpp.o
[7526/8486] Building CXX object tools/clang/lib/CodeGen/CMakeFiles/obj.clangCodeGen.dir/TargetBuiltins/ARM.cpp.o
[7527/8486] Building CXX object tools/clang/tools/driver/CMakeFiles/clang.dir/driver.cpp.o
[7528/8486] Building CXX object tools/clang/lib/StaticAnalyzer/Frontend/CMakeFiles/obj.clangStaticAnalyzerFrontend.dir/AnalysisConsumer.cpp.o
[7529/8486] Building CXX object tools/clang/lib/StaticAnalyzer/Frontend/CMakeFiles/obj.clangStaticAnalyzerFrontend.dir/FrontendActions.cpp.o
[7530/8486] Building CXX object tools/clang/lib/StaticAnalyzer/Frontend/CMakeFiles/obj.clangStaticAnalyzerFrontend.dir/ModelInjector.cpp.o
[7531/8486] Building CXX object tools/clang/tools/driver/CMakeFiles/clang.dir/cc1_main.cpp.o
[7532/8486] Building CXX object tools/clang/lib/FrontendTool/CMakeFiles/obj.clangFrontendTool.dir/ExecuteCompilerInvocation.cpp.o
[7533/8486] Building CXX object tools/clang/lib/CodeGen/CMakeFiles/obj.clangCodeGen.dir/CodeGenModule.cpp.o
[7534/8486] Building CXX object tools/clang/lib/Tooling/CMakeFiles/obj.clangTooling.dir/CommonOptionsParser.cpp.o
[7535/8486] Building CXX object tools/clang/lib/DependencyScanning/CMakeFiles/obj.clangDependencyScanning.dir/DependencyScanningWorker.cpp.o
[7536/8486] Building CXX object tools/clang/lib/Tooling/CMakeFiles/obj.clangTooling.dir/AllTUsExecution.cpp.o
[7537/8486] Building CXX object tools/clang/lib/Tooling/CMakeFiles/obj.clangTooling.dir/Execution.cpp.o
[7538/8486] Building CXX object tools/clang/lib/DependencyScanning/CMakeFiles/obj.clangDependencyScanning.dir/DependencyScanningUtils.cpp.o
[7539/8486] Building CXX object tools/clang/lib/Tooling/CMakeFiles/obj.clangTooling.dir/CompilationDatabase.cpp.o
[7540/8486] Building CXX object tools/clang/lib/DependencyScanning/CMakeFiles/obj.clangDependencyScanning.dir/DependencyScannerImpl.cpp.o
[7541/8486] Building CXX object tools/clang/lib/DependencyScanning/CMakeFiles/obj.clangDependencyScanning.dir/ModuleDepCollector.cpp.o
[7542/8486] Building CXX object tools/clang/lib/Tooling/CMakeFiles/obj.clangTooling.dir/DependencyScanningTool.cpp.o
[7543/8486] Building CXX object tools/flang/tools/flang-driver/CMakeFiles/flang.dir/fc1_main.cpp.o
[7544/8486] Building CXX object tools/clang/lib/ExtractAPI/CMakeFiles/obj.clangExtractAPI.dir/ExtractAPIConsumer.cpp.o
[7545/8486] Building CXX object tools/flang/lib/Frontend/CMakeFiles/flangFrontend.dir/CompilerInstance.cpp.o
[7546/8486] Building CXX object tools/flang/tools/flang-driver/CMakeFiles/flang.dir/driver.cpp.o
[7547/8486] Building CXX object tools/flang/lib/Frontend/CMakeFiles/flangFrontend.dir/CompilerInvocation.cpp.o
[7548/8486] Building CXX object tools/flang/lib/Frontend/CMakeFiles/flangFrontend.dir/FrontendAction.cpp.o
[7549/8486] Building CXX object tools/flang/lib/FrontendTool/CMakeFiles/flangFrontendTool.dir/ExecuteCompilerInvocation.cpp.o
[7550/8486] Building CXX object tools/flang/lib/Frontend/CMakeFiles/flangFrontend.dir/FrontendActions.cpp.o
[7551/8486] Building CXX object tools/flang/lib/Frontend/CMakeFiles/flangFrontend.dir/ParserActions.cpp.o
ninja: build stopped: subcommand failed.
['ninja'] exited with return code 1.
```
</details>
https://github.com/llvm/llvm-project/pull/184421
More information about the cfe-commits
mailing list