[clang] [clang] Improve move-assign and move-constructor for NestedNameSpecif… (PR #180484)

via cfe-commits cfe-commits at lists.llvm.org
Mon Feb 9 00:44:31 PST 2026


github-actions[bot] wrote:

<!--PREMERGE ADVISOR COMMENT: Windows-->
# :window: Windows x64 Test Results

The build failed before running any tests. Click on a failure below to see the details.

<details>
<summary>[code=1] tools/clang/lib/AST/CMakeFiles/obj.clangAST.dir/NestedNameSpecifier.cpp.obj</summary>

```
FAILED: [code=1] tools/clang/lib/AST/CMakeFiles/obj.clangAST.dir/NestedNameSpecifier.cpp.obj
sccache C:\clang\clang-msvc\bin\clang-cl.exe  /nologo -TP -DCLANG_BUILD_STATIC -DUNICODE -D_CRT_NONSTDC_NO_DEPRECATE -D_CRT_NONSTDC_NO_WARNINGS -D_CRT_SECURE_NO_DEPRECATE -D_CRT_SECURE_NO_WARNINGS -D_GLIBCXX_ASSERTIONS -D_HAS_EXCEPTIONS=0 -D_SCL_SECURE_NO_DEPRECATE -D_SCL_SECURE_NO_WARNINGS -D_UNICODE -D__STDC_CONSTANT_MACROS -D__STDC_FORMAT_MACROS -D__STDC_LIMIT_MACROS -Itools\clang\lib\AST -IC:\_work\llvm-project\llvm-project\clang\lib\AST -IC:\_work\llvm-project\llvm-project\clang\include -Itools\clang\include -Iinclude -IC:\_work\llvm-project\llvm-project\llvm\include /DWIN32 /D_WINDOWS   /Zc:inline /Zc:__cplusplus /Oi /Brepro /bigobj /permissive- -Werror=unguarded-availability-new /W4  -Wextra -Wno-unused-parameter -Wwrite-strings -Wcast-qual -Wmissing-field-initializers -Wimplicit-fallthrough -Wcovered-switch-default -Wno-noexcept-type -Wnon-virtual-dtor -Wdelete-non-virtual-dtor -Wsuggest-override -Wstring-conversion -Wno-pass-failed -Wmisleading-indentation -Wctad-maybe-unsupported /Gw /O2 /Ob2  -MD -UNDEBUG /EHs-c- /GR- -std:c++17 /showIncludes /Fotools\clang\lib\AST\CMakeFiles\obj.clangAST.dir\NestedNameSpecifier.cpp.obj /Fdtools\clang\lib\AST\CMakeFiles\obj.clangAST.dir\ -c -- C:\_work\llvm-project\llvm-project\clang\lib\AST\NestedNameSpecifier.cpp
C:\_work\llvm-project\llvm-project\clang\lib\AST\NestedNameSpecifier.cpp(215,9): error: no member named 'buffer' in 'clang::NestedNameSpecifierLocBuilder'
215 |   Other.buffer = nullptr;
|   ~~~~~ ^
C:\_work\llvm-project\llvm-project\clang\lib\AST\NestedNameSpecifier.cpp(216,32): error: no member named 'size' in 'clang::NestedNameSpecifierLocBuilder'
216 |   Other.BufferCapacity = Other.size = 0;
|                          ~~~~~ ^
2 errors generated.
```
</details>

If these failures are unrelated to your changes (for example tests are broken or flaky at HEAD), please open an issue at https://github.com/llvm/llvm-project/issues and add the `infrastructure` label.

https://github.com/llvm/llvm-project/pull/180484


More information about the cfe-commits mailing list