[clang-tools-extra] [clang-tidy] Add ranges-style view for tokenizing source code (PR #172508)

via cfe-commits cfe-commits at lists.llvm.org
Tue Dec 16 08:13:24 PST 2025


github-actions[bot] wrote:

<!--PREMERGE ADVISOR COMMENT: Linux-->
# :penguin: Linux x64 Test Results

The build failed before running any tests. Click on a failure below to see the details.

<details>
<summary>tools/clang/tools/extra/clang-tidy/bugprone/CMakeFiles/obj.clangTidyBugproneModule.dir/ArgumentCommentCheck.cpp.o</summary>

```
FAILED: tools/clang/tools/extra/clang-tidy/bugprone/CMakeFiles/obj.clangTidyBugproneModule.dir/ArgumentCommentCheck.cpp.o
sccache /opt/llvm/bin/clang++ -DGTEST_HAS_RTTI=0 -D_DEBUG -D_GLIBCXX_ASSERTIONS -D_GLIBCXX_USE_CXX11_ABI=1 -D_GNU_SOURCE -D__STDC_CONSTANT_MACROS -D__STDC_FORMAT_MACROS -D__STDC_LIMIT_MACROS -I/home/gha/actions-runner/_work/llvm-project/llvm-project/build/tools/clang/tools/extra/clang-tidy/bugprone -I/home/gha/actions-runner/_work/llvm-project/llvm-project/clang-tools-extra/clang-tidy/bugprone -I/home/gha/actions-runner/_work/llvm-project/llvm-project/build/tools/clang/tools/extra/clang-tidy -I/home/gha/actions-runner/_work/llvm-project/llvm-project/clang/include -I/home/gha/actions-runner/_work/llvm-project/llvm-project/build/tools/clang/include -I/home/gha/actions-runner/_work/llvm-project/llvm-project/build/include -I/home/gha/actions-runner/_work/llvm-project/llvm-project/llvm/include -gmlt -fPIC -fno-semantic-interposition -fvisibility-inlines-hidden -Werror -Werror=date-time -Werror=unguarded-availability-new -Wall -Wextra -Wno-unused-parameter -Wwrite-strings -Wcast-qual -Wmissing-field-initializers -pedantic -Wno-long-long -Wc++98-compat-extra-semi -Wimplicit-fallthrough -Wcovered-switch-default -Wno-noexcept-type -Wnon-virtual-dtor -Wdelete-non-virtual-dtor -Wsuggest-override -Wstring-conversion -Wno-pass-failed -Wmisleading-indentation -Wctad-maybe-unsupported -fdiagnostics-color -ffunction-sections -fdata-sections -fno-common -Woverloaded-virtual -Wno-nested-anon-types -O3 -DNDEBUG -std=c++17  -fno-exceptions -funwind-tables -fno-rtti -UNDEBUG -MD -MT tools/clang/tools/extra/clang-tidy/bugprone/CMakeFiles/obj.clangTidyBugproneModule.dir/ArgumentCommentCheck.cpp.o -MF tools/clang/tools/extra/clang-tidy/bugprone/CMakeFiles/obj.clangTidyBugproneModule.dir/ArgumentCommentCheck.cpp.o.d -o tools/clang/tools/extra/clang-tidy/bugprone/CMakeFiles/obj.clangTidyBugproneModule.dir/ArgumentCommentCheck.cpp.o -c /home/gha/actions-runner/_work/llvm-project/llvm-project/clang-tools-extra/clang-tidy/bugprone/ArgumentCommentCheck.cpp
In file included from /home/gha/actions-runner/_work/llvm-project/llvm-project/clang-tools-extra/clang-tidy/bugprone/ArgumentCommentCheck.cpp:15:
/home/gha/actions-runner/_work/llvm-project/llvm-project/clang-tools-extra/clang-tidy/bugprone/../utils/LexerUtils.h:15:10: fatal error: 'clang/basic/SourceManager.h' file not found
15 | #include "clang/basic/SourceManager.h"
|          ^~~~~~~~~~~~~~~~~~~~~~~~~~~~~
1 error generated.
```
</details>
<details>
<summary>tools/clang/tools/extra/clang-tidy/bugprone/CMakeFiles/obj.clangTidyBugproneModule.dir/CrtpConstructorAccessibilityCheck.cpp.o</summary>

```
FAILED: tools/clang/tools/extra/clang-tidy/bugprone/CMakeFiles/obj.clangTidyBugproneModule.dir/CrtpConstructorAccessibilityCheck.cpp.o
sccache /opt/llvm/bin/clang++ -DGTEST_HAS_RTTI=0 -D_DEBUG -D_GLIBCXX_ASSERTIONS -D_GLIBCXX_USE_CXX11_ABI=1 -D_GNU_SOURCE -D__STDC_CONSTANT_MACROS -D__STDC_FORMAT_MACROS -D__STDC_LIMIT_MACROS -I/home/gha/actions-runner/_work/llvm-project/llvm-project/build/tools/clang/tools/extra/clang-tidy/bugprone -I/home/gha/actions-runner/_work/llvm-project/llvm-project/clang-tools-extra/clang-tidy/bugprone -I/home/gha/actions-runner/_work/llvm-project/llvm-project/build/tools/clang/tools/extra/clang-tidy -I/home/gha/actions-runner/_work/llvm-project/llvm-project/clang/include -I/home/gha/actions-runner/_work/llvm-project/llvm-project/build/tools/clang/include -I/home/gha/actions-runner/_work/llvm-project/llvm-project/build/include -I/home/gha/actions-runner/_work/llvm-project/llvm-project/llvm/include -gmlt -fPIC -fno-semantic-interposition -fvisibility-inlines-hidden -Werror -Werror=date-time -Werror=unguarded-availability-new -Wall -Wextra -Wno-unused-parameter -Wwrite-strings -Wcast-qual -Wmissing-field-initializers -pedantic -Wno-long-long -Wc++98-compat-extra-semi -Wimplicit-fallthrough -Wcovered-switch-default -Wno-noexcept-type -Wnon-virtual-dtor -Wdelete-non-virtual-dtor -Wsuggest-override -Wstring-conversion -Wno-pass-failed -Wmisleading-indentation -Wctad-maybe-unsupported -fdiagnostics-color -ffunction-sections -fdata-sections -fno-common -Woverloaded-virtual -Wno-nested-anon-types -O3 -DNDEBUG -std=c++17  -fno-exceptions -funwind-tables -fno-rtti -UNDEBUG -MD -MT tools/clang/tools/extra/clang-tidy/bugprone/CMakeFiles/obj.clangTidyBugproneModule.dir/CrtpConstructorAccessibilityCheck.cpp.o -MF tools/clang/tools/extra/clang-tidy/bugprone/CMakeFiles/obj.clangTidyBugproneModule.dir/CrtpConstructorAccessibilityCheck.cpp.o.d -o tools/clang/tools/extra/clang-tidy/bugprone/CMakeFiles/obj.clangTidyBugproneModule.dir/CrtpConstructorAccessibilityCheck.cpp.o -c /home/gha/actions-runner/_work/llvm-project/llvm-project/clang-tools-extra/clang-tidy/bugprone/CrtpConstructorAccessibilityCheck.cpp
In file included from /home/gha/actions-runner/_work/llvm-project/llvm-project/clang-tools-extra/clang-tidy/bugprone/CrtpConstructorAccessibilityCheck.cpp:10:
/home/gha/actions-runner/_work/llvm-project/llvm-project/clang-tools-extra/clang-tidy/bugprone/../utils/LexerUtils.h:15:10: fatal error: 'clang/basic/SourceManager.h' file not found
15 | #include "clang/basic/SourceManager.h"
|          ^~~~~~~~~~~~~~~~~~~~~~~~~~~~~
1 error generated.
```
</details>
<details>
<summary>tools/clang/tools/extra/clang-tidy/bugprone/CMakeFiles/obj.clangTidyBugproneModule.dir/OptionalValueConversionCheck.cpp.o</summary>

```
FAILED: tools/clang/tools/extra/clang-tidy/bugprone/CMakeFiles/obj.clangTidyBugproneModule.dir/OptionalValueConversionCheck.cpp.o
sccache /opt/llvm/bin/clang++ -DGTEST_HAS_RTTI=0 -D_DEBUG -D_GLIBCXX_ASSERTIONS -D_GLIBCXX_USE_CXX11_ABI=1 -D_GNU_SOURCE -D__STDC_CONSTANT_MACROS -D__STDC_FORMAT_MACROS -D__STDC_LIMIT_MACROS -I/home/gha/actions-runner/_work/llvm-project/llvm-project/build/tools/clang/tools/extra/clang-tidy/bugprone -I/home/gha/actions-runner/_work/llvm-project/llvm-project/clang-tools-extra/clang-tidy/bugprone -I/home/gha/actions-runner/_work/llvm-project/llvm-project/build/tools/clang/tools/extra/clang-tidy -I/home/gha/actions-runner/_work/llvm-project/llvm-project/clang/include -I/home/gha/actions-runner/_work/llvm-project/llvm-project/build/tools/clang/include -I/home/gha/actions-runner/_work/llvm-project/llvm-project/build/include -I/home/gha/actions-runner/_work/llvm-project/llvm-project/llvm/include -gmlt -fPIC -fno-semantic-interposition -fvisibility-inlines-hidden -Werror -Werror=date-time -Werror=unguarded-availability-new -Wall -Wextra -Wno-unused-parameter -Wwrite-strings -Wcast-qual -Wmissing-field-initializers -pedantic -Wno-long-long -Wc++98-compat-extra-semi -Wimplicit-fallthrough -Wcovered-switch-default -Wno-noexcept-type -Wnon-virtual-dtor -Wdelete-non-virtual-dtor -Wsuggest-override -Wstring-conversion -Wno-pass-failed -Wmisleading-indentation -Wctad-maybe-unsupported -fdiagnostics-color -ffunction-sections -fdata-sections -fno-common -Woverloaded-virtual -Wno-nested-anon-types -O3 -DNDEBUG -std=c++17  -fno-exceptions -funwind-tables -fno-rtti -UNDEBUG -MD -MT tools/clang/tools/extra/clang-tidy/bugprone/CMakeFiles/obj.clangTidyBugproneModule.dir/OptionalValueConversionCheck.cpp.o -MF tools/clang/tools/extra/clang-tidy/bugprone/CMakeFiles/obj.clangTidyBugproneModule.dir/OptionalValueConversionCheck.cpp.o.d -o tools/clang/tools/extra/clang-tidy/bugprone/CMakeFiles/obj.clangTidyBugproneModule.dir/OptionalValueConversionCheck.cpp.o -c /home/gha/actions-runner/_work/llvm-project/llvm-project/clang-tools-extra/clang-tidy/bugprone/OptionalValueConversionCheck.cpp
In file included from /home/gha/actions-runner/_work/llvm-project/llvm-project/clang-tools-extra/clang-tidy/bugprone/OptionalValueConversionCheck.cpp:10:
/home/gha/actions-runner/_work/llvm-project/llvm-project/clang-tools-extra/clang-tidy/bugprone/../utils/LexerUtils.h:15:10: fatal error: 'clang/basic/SourceManager.h' file not found
15 | #include "clang/basic/SourceManager.h"
|          ^~~~~~~~~~~~~~~~~~~~~~~~~~~~~
1 error generated.
```
</details>
<details>
<summary>tools/clang/tools/extra/clang-tidy/bugprone/CMakeFiles/obj.clangTidyBugproneModule.dir/SuspiciousSemicolonCheck.cpp.o</summary>

```
FAILED: tools/clang/tools/extra/clang-tidy/bugprone/CMakeFiles/obj.clangTidyBugproneModule.dir/SuspiciousSemicolonCheck.cpp.o
sccache /opt/llvm/bin/clang++ -DGTEST_HAS_RTTI=0 -D_DEBUG -D_GLIBCXX_ASSERTIONS -D_GLIBCXX_USE_CXX11_ABI=1 -D_GNU_SOURCE -D__STDC_CONSTANT_MACROS -D__STDC_FORMAT_MACROS -D__STDC_LIMIT_MACROS -I/home/gha/actions-runner/_work/llvm-project/llvm-project/build/tools/clang/tools/extra/clang-tidy/bugprone -I/home/gha/actions-runner/_work/llvm-project/llvm-project/clang-tools-extra/clang-tidy/bugprone -I/home/gha/actions-runner/_work/llvm-project/llvm-project/build/tools/clang/tools/extra/clang-tidy -I/home/gha/actions-runner/_work/llvm-project/llvm-project/clang/include -I/home/gha/actions-runner/_work/llvm-project/llvm-project/build/tools/clang/include -I/home/gha/actions-runner/_work/llvm-project/llvm-project/build/include -I/home/gha/actions-runner/_work/llvm-project/llvm-project/llvm/include -gmlt -fPIC -fno-semantic-interposition -fvisibility-inlines-hidden -Werror -Werror=date-time -Werror=unguarded-availability-new -Wall -Wextra -Wno-unused-parameter -Wwrite-strings -Wcast-qual -Wmissing-field-initializers -pedantic -Wno-long-long -Wc++98-compat-extra-semi -Wimplicit-fallthrough -Wcovered-switch-default -Wno-noexcept-type -Wnon-virtual-dtor -Wdelete-non-virtual-dtor -Wsuggest-override -Wstring-conversion -Wno-pass-failed -Wmisleading-indentation -Wctad-maybe-unsupported -fdiagnostics-color -ffunction-sections -fdata-sections -fno-common -Woverloaded-virtual -Wno-nested-anon-types -O3 -DNDEBUG -std=c++17  -fno-exceptions -funwind-tables -fno-rtti -UNDEBUG -MD -MT tools/clang/tools/extra/clang-tidy/bugprone/CMakeFiles/obj.clangTidyBugproneModule.dir/SuspiciousSemicolonCheck.cpp.o -MF tools/clang/tools/extra/clang-tidy/bugprone/CMakeFiles/obj.clangTidyBugproneModule.dir/SuspiciousSemicolonCheck.cpp.o.d -o tools/clang/tools/extra/clang-tidy/bugprone/CMakeFiles/obj.clangTidyBugproneModule.dir/SuspiciousSemicolonCheck.cpp.o -c /home/gha/actions-runner/_work/llvm-project/llvm-project/clang-tools-extra/clang-tidy/bugprone/SuspiciousSemicolonCheck.cpp
In file included from /home/gha/actions-runner/_work/llvm-project/llvm-project/clang-tools-extra/clang-tidy/bugprone/SuspiciousSemicolonCheck.cpp:10:
/home/gha/actions-runner/_work/llvm-project/llvm-project/clang-tools-extra/clang-tidy/bugprone/../utils/LexerUtils.h:15:10: fatal error: 'clang/basic/SourceManager.h' file not found
15 | #include "clang/basic/SourceManager.h"
|          ^~~~~~~~~~~~~~~~~~~~~~~~~~~~~
1 error generated.
```
</details>
<details>
<summary>tools/clang/tools/extra/clang-tidy/cppcoreguidelines/CMakeFiles/obj.clangTidyCppCoreGuidelinesModule.dir/MisleadingCaptureDefaultByValueCheck.cpp.o</summary>

```
FAILED: tools/clang/tools/extra/clang-tidy/cppcoreguidelines/CMakeFiles/obj.clangTidyCppCoreGuidelinesModule.dir/MisleadingCaptureDefaultByValueCheck.cpp.o
sccache /opt/llvm/bin/clang++ -DGTEST_HAS_RTTI=0 -D_DEBUG -D_GLIBCXX_ASSERTIONS -D_GLIBCXX_USE_CXX11_ABI=1 -D_GNU_SOURCE -D__STDC_CONSTANT_MACROS -D__STDC_FORMAT_MACROS -D__STDC_LIMIT_MACROS -I/home/gha/actions-runner/_work/llvm-project/llvm-project/build/tools/clang/tools/extra/clang-tidy/cppcoreguidelines -I/home/gha/actions-runner/_work/llvm-project/llvm-project/clang-tools-extra/clang-tidy/cppcoreguidelines -I/home/gha/actions-runner/_work/llvm-project/llvm-project/build/tools/clang/tools/extra/clang-tidy -I/home/gha/actions-runner/_work/llvm-project/llvm-project/clang/include -I/home/gha/actions-runner/_work/llvm-project/llvm-project/build/tools/clang/include -I/home/gha/actions-runner/_work/llvm-project/llvm-project/build/include -I/home/gha/actions-runner/_work/llvm-project/llvm-project/llvm/include -gmlt -fPIC -fno-semantic-interposition -fvisibility-inlines-hidden -Werror -Werror=date-time -Werror=unguarded-availability-new -Wall -Wextra -Wno-unused-parameter -Wwrite-strings -Wcast-qual -Wmissing-field-initializers -pedantic -Wno-long-long -Wc++98-compat-extra-semi -Wimplicit-fallthrough -Wcovered-switch-default -Wno-noexcept-type -Wnon-virtual-dtor -Wdelete-non-virtual-dtor -Wsuggest-override -Wstring-conversion -Wno-pass-failed -Wmisleading-indentation -Wctad-maybe-unsupported -fdiagnostics-color -ffunction-sections -fdata-sections -fno-common -Woverloaded-virtual -Wno-nested-anon-types -O3 -DNDEBUG -std=c++17  -fno-exceptions -funwind-tables -fno-rtti -UNDEBUG -MD -MT tools/clang/tools/extra/clang-tidy/cppcoreguidelines/CMakeFiles/obj.clangTidyCppCoreGuidelinesModule.dir/MisleadingCaptureDefaultByValueCheck.cpp.o -MF tools/clang/tools/extra/clang-tidy/cppcoreguidelines/CMakeFiles/obj.clangTidyCppCoreGuidelinesModule.dir/MisleadingCaptureDefaultByValueCheck.cpp.o.d -o tools/clang/tools/extra/clang-tidy/cppcoreguidelines/CMakeFiles/obj.clangTidyCppCoreGuidelinesModule.dir/MisleadingCaptureDefaultByValueCheck.cpp.o -c /home/gha/actions-runner/_work/llvm-project/llvm-project/clang-tools-extra/clang-tidy/cppcoreguidelines/MisleadingCaptureDefaultByValueCheck.cpp
In file included from /home/gha/actions-runner/_work/llvm-project/llvm-project/clang-tools-extra/clang-tidy/cppcoreguidelines/MisleadingCaptureDefaultByValueCheck.cpp:10:
/home/gha/actions-runner/_work/llvm-project/llvm-project/clang-tools-extra/clang-tidy/cppcoreguidelines/../utils/LexerUtils.h:15:10: fatal error: 'clang/basic/SourceManager.h' file not found
15 | #include "clang/basic/SourceManager.h"
|          ^~~~~~~~~~~~~~~~~~~~~~~~~~~~~
1 error generated.
```
</details>
<details>
<summary>tools/clang/tools/extra/clang-tidy/cppcoreguidelines/CMakeFiles/obj.clangTidyCppCoreGuidelinesModule.dir/InitVariablesCheck.cpp.o</summary>

```
FAILED: tools/clang/tools/extra/clang-tidy/cppcoreguidelines/CMakeFiles/obj.clangTidyCppCoreGuidelinesModule.dir/InitVariablesCheck.cpp.o
sccache /opt/llvm/bin/clang++ -DGTEST_HAS_RTTI=0 -D_DEBUG -D_GLIBCXX_ASSERTIONS -D_GLIBCXX_USE_CXX11_ABI=1 -D_GNU_SOURCE -D__STDC_CONSTANT_MACROS -D__STDC_FORMAT_MACROS -D__STDC_LIMIT_MACROS -I/home/gha/actions-runner/_work/llvm-project/llvm-project/build/tools/clang/tools/extra/clang-tidy/cppcoreguidelines -I/home/gha/actions-runner/_work/llvm-project/llvm-project/clang-tools-extra/clang-tidy/cppcoreguidelines -I/home/gha/actions-runner/_work/llvm-project/llvm-project/build/tools/clang/tools/extra/clang-tidy -I/home/gha/actions-runner/_work/llvm-project/llvm-project/clang/include -I/home/gha/actions-runner/_work/llvm-project/llvm-project/build/tools/clang/include -I/home/gha/actions-runner/_work/llvm-project/llvm-project/build/include -I/home/gha/actions-runner/_work/llvm-project/llvm-project/llvm/include -gmlt -fPIC -fno-semantic-interposition -fvisibility-inlines-hidden -Werror -Werror=date-time -Werror=unguarded-availability-new -Wall -Wextra -Wno-unused-parameter -Wwrite-strings -Wcast-qual -Wmissing-field-initializers -pedantic -Wno-long-long -Wc++98-compat-extra-semi -Wimplicit-fallthrough -Wcovered-switch-default -Wno-noexcept-type -Wnon-virtual-dtor -Wdelete-non-virtual-dtor -Wsuggest-override -Wstring-conversion -Wno-pass-failed -Wmisleading-indentation -Wctad-maybe-unsupported -fdiagnostics-color -ffunction-sections -fdata-sections -fno-common -Woverloaded-virtual -Wno-nested-anon-types -O3 -DNDEBUG -std=c++17  -fno-exceptions -funwind-tables -fno-rtti -UNDEBUG -MD -MT tools/clang/tools/extra/clang-tidy/cppcoreguidelines/CMakeFiles/obj.clangTidyCppCoreGuidelinesModule.dir/InitVariablesCheck.cpp.o -MF tools/clang/tools/extra/clang-tidy/cppcoreguidelines/CMakeFiles/obj.clangTidyCppCoreGuidelinesModule.dir/InitVariablesCheck.cpp.o.d -o tools/clang/tools/extra/clang-tidy/cppcoreguidelines/CMakeFiles/obj.clangTidyCppCoreGuidelinesModule.dir/InitVariablesCheck.cpp.o -c /home/gha/actions-runner/_work/llvm-project/llvm-project/clang-tools-extra/clang-tidy/cppcoreguidelines/InitVariablesCheck.cpp
In file included from /home/gha/actions-runner/_work/llvm-project/llvm-project/clang-tools-extra/clang-tidy/cppcoreguidelines/InitVariablesCheck.cpp:11:
/home/gha/actions-runner/_work/llvm-project/llvm-project/clang-tools-extra/clang-tidy/cppcoreguidelines/../utils/LexerUtils.h:15:10: fatal error: 'clang/basic/SourceManager.h' file not found
15 | #include "clang/basic/SourceManager.h"
|          ^~~~~~~~~~~~~~~~~~~~~~~~~~~~~
1 error generated.
```
</details>
<details>
<summary>tools/clang/tools/extra/clang-tidy/cppcoreguidelines/CMakeFiles/obj.clangTidyCppCoreGuidelinesModule.dir/ProTypeMemberInitCheck.cpp.o</summary>

```
FAILED: tools/clang/tools/extra/clang-tidy/cppcoreguidelines/CMakeFiles/obj.clangTidyCppCoreGuidelinesModule.dir/ProTypeMemberInitCheck.cpp.o
sccache /opt/llvm/bin/clang++ -DGTEST_HAS_RTTI=0 -D_DEBUG -D_GLIBCXX_ASSERTIONS -D_GLIBCXX_USE_CXX11_ABI=1 -D_GNU_SOURCE -D__STDC_CONSTANT_MACROS -D__STDC_FORMAT_MACROS -D__STDC_LIMIT_MACROS -I/home/gha/actions-runner/_work/llvm-project/llvm-project/build/tools/clang/tools/extra/clang-tidy/cppcoreguidelines -I/home/gha/actions-runner/_work/llvm-project/llvm-project/clang-tools-extra/clang-tidy/cppcoreguidelines -I/home/gha/actions-runner/_work/llvm-project/llvm-project/build/tools/clang/tools/extra/clang-tidy -I/home/gha/actions-runner/_work/llvm-project/llvm-project/clang/include -I/home/gha/actions-runner/_work/llvm-project/llvm-project/build/tools/clang/include -I/home/gha/actions-runner/_work/llvm-project/llvm-project/build/include -I/home/gha/actions-runner/_work/llvm-project/llvm-project/llvm/include -gmlt -fPIC -fno-semantic-interposition -fvisibility-inlines-hidden -Werror -Werror=date-time -Werror=unguarded-availability-new -Wall -Wextra -Wno-unused-parameter -Wwrite-strings -Wcast-qual -Wmissing-field-initializers -pedantic -Wno-long-long -Wc++98-compat-extra-semi -Wimplicit-fallthrough -Wcovered-switch-default -Wno-noexcept-type -Wnon-virtual-dtor -Wdelete-non-virtual-dtor -Wsuggest-override -Wstring-conversion -Wno-pass-failed -Wmisleading-indentation -Wctad-maybe-unsupported -fdiagnostics-color -ffunction-sections -fdata-sections -fno-common -Woverloaded-virtual -Wno-nested-anon-types -O3 -DNDEBUG -std=c++17  -fno-exceptions -funwind-tables -fno-rtti -UNDEBUG -MD -MT tools/clang/tools/extra/clang-tidy/cppcoreguidelines/CMakeFiles/obj.clangTidyCppCoreGuidelinesModule.dir/ProTypeMemberInitCheck.cpp.o -MF tools/clang/tools/extra/clang-tidy/cppcoreguidelines/CMakeFiles/obj.clangTidyCppCoreGuidelinesModule.dir/ProTypeMemberInitCheck.cpp.o.d -o tools/clang/tools/extra/clang-tidy/cppcoreguidelines/CMakeFiles/obj.clangTidyCppCoreGuidelinesModule.dir/ProTypeMemberInitCheck.cpp.o -c /home/gha/actions-runner/_work/llvm-project/llvm-project/clang-tools-extra/clang-tidy/cppcoreguidelines/ProTypeMemberInitCheck.cpp
In file included from /home/gha/actions-runner/_work/llvm-project/llvm-project/clang-tools-extra/clang-tidy/cppcoreguidelines/ProTypeMemberInitCheck.cpp:10:
/home/gha/actions-runner/_work/llvm-project/llvm-project/clang-tools-extra/clang-tidy/cppcoreguidelines/../utils/LexerUtils.h:15:10: fatal error: 'clang/basic/SourceManager.h' file not found
15 | #include "clang/basic/SourceManager.h"
|          ^~~~~~~~~~~~~~~~~~~~~~~~~~~~~
1 error generated.
```
</details>
<details>
<summary>tools/clang/tools/extra/clang-tidy/cppcoreguidelines/CMakeFiles/obj.clangTidyCppCoreGuidelinesModule.dir/VirtualClassDestructorCheck.cpp.o</summary>

```
FAILED: tools/clang/tools/extra/clang-tidy/cppcoreguidelines/CMakeFiles/obj.clangTidyCppCoreGuidelinesModule.dir/VirtualClassDestructorCheck.cpp.o
sccache /opt/llvm/bin/clang++ -DGTEST_HAS_RTTI=0 -D_DEBUG -D_GLIBCXX_ASSERTIONS -D_GLIBCXX_USE_CXX11_ABI=1 -D_GNU_SOURCE -D__STDC_CONSTANT_MACROS -D__STDC_FORMAT_MACROS -D__STDC_LIMIT_MACROS -I/home/gha/actions-runner/_work/llvm-project/llvm-project/build/tools/clang/tools/extra/clang-tidy/cppcoreguidelines -I/home/gha/actions-runner/_work/llvm-project/llvm-project/clang-tools-extra/clang-tidy/cppcoreguidelines -I/home/gha/actions-runner/_work/llvm-project/llvm-project/build/tools/clang/tools/extra/clang-tidy -I/home/gha/actions-runner/_work/llvm-project/llvm-project/clang/include -I/home/gha/actions-runner/_work/llvm-project/llvm-project/build/tools/clang/include -I/home/gha/actions-runner/_work/llvm-project/llvm-project/build/include -I/home/gha/actions-runner/_work/llvm-project/llvm-project/llvm/include -gmlt -fPIC -fno-semantic-interposition -fvisibility-inlines-hidden -Werror -Werror=date-time -Werror=unguarded-availability-new -Wall -Wextra -Wno-unused-parameter -Wwrite-strings -Wcast-qual -Wmissing-field-initializers -pedantic -Wno-long-long -Wc++98-compat-extra-semi -Wimplicit-fallthrough -Wcovered-switch-default -Wno-noexcept-type -Wnon-virtual-dtor -Wdelete-non-virtual-dtor -Wsuggest-override -Wstring-conversion -Wno-pass-failed -Wmisleading-indentation -Wctad-maybe-unsupported -fdiagnostics-color -ffunction-sections -fdata-sections -fno-common -Woverloaded-virtual -Wno-nested-anon-types -O3 -DNDEBUG -std=c++17  -fno-exceptions -funwind-tables -fno-rtti -UNDEBUG -MD -MT tools/clang/tools/extra/clang-tidy/cppcoreguidelines/CMakeFiles/obj.clangTidyCppCoreGuidelinesModule.dir/VirtualClassDestructorCheck.cpp.o -MF tools/clang/tools/extra/clang-tidy/cppcoreguidelines/CMakeFiles/obj.clangTidyCppCoreGuidelinesModule.dir/VirtualClassDestructorCheck.cpp.o.d -o tools/clang/tools/extra/clang-tidy/cppcoreguidelines/CMakeFiles/obj.clangTidyCppCoreGuidelinesModule.dir/VirtualClassDestructorCheck.cpp.o -c /home/gha/actions-runner/_work/llvm-project/llvm-project/clang-tools-extra/clang-tidy/cppcoreguidelines/VirtualClassDestructorCheck.cpp
In file included from /home/gha/actions-runner/_work/llvm-project/llvm-project/clang-tools-extra/clang-tidy/cppcoreguidelines/VirtualClassDestructorCheck.cpp:10:
/home/gha/actions-runner/_work/llvm-project/llvm-project/clang-tools-extra/clang-tidy/cppcoreguidelines/../utils/LexerUtils.h:15:10: fatal error: 'clang/basic/SourceManager.h' file not found
15 | #include "clang/basic/SourceManager.h"
|          ^~~~~~~~~~~~~~~~~~~~~~~~~~~~~
1 error generated.
```
</details>
<details>
<summary>tools/clang/tools/extra/clang-tidy/llvmlibc/CMakeFiles/obj.clangTidyLLVMLibcModule.dir/InlineFunctionDeclCheck.cpp.o</summary>

```
FAILED: tools/clang/tools/extra/clang-tidy/llvmlibc/CMakeFiles/obj.clangTidyLLVMLibcModule.dir/InlineFunctionDeclCheck.cpp.o
sccache /opt/llvm/bin/clang++ -DGTEST_HAS_RTTI=0 -D_DEBUG -D_GLIBCXX_ASSERTIONS -D_GLIBCXX_USE_CXX11_ABI=1 -D_GNU_SOURCE -D__STDC_CONSTANT_MACROS -D__STDC_FORMAT_MACROS -D__STDC_LIMIT_MACROS -I/home/gha/actions-runner/_work/llvm-project/llvm-project/build/tools/clang/tools/extra/clang-tidy/llvmlibc -I/home/gha/actions-runner/_work/llvm-project/llvm-project/clang-tools-extra/clang-tidy/llvmlibc -I/home/gha/actions-runner/_work/llvm-project/llvm-project/build/tools/clang/tools/extra/clang-tidy -I/home/gha/actions-runner/_work/llvm-project/llvm-project/clang/include -I/home/gha/actions-runner/_work/llvm-project/llvm-project/build/tools/clang/include -I/home/gha/actions-runner/_work/llvm-project/llvm-project/build/include -I/home/gha/actions-runner/_work/llvm-project/llvm-project/llvm/include -gmlt -fPIC -fno-semantic-interposition -fvisibility-inlines-hidden -Werror -Werror=date-time -Werror=unguarded-availability-new -Wall -Wextra -Wno-unused-parameter -Wwrite-strings -Wcast-qual -Wmissing-field-initializers -pedantic -Wno-long-long -Wc++98-compat-extra-semi -Wimplicit-fallthrough -Wcovered-switch-default -Wno-noexcept-type -Wnon-virtual-dtor -Wdelete-non-virtual-dtor -Wsuggest-override -Wstring-conversion -Wno-pass-failed -Wmisleading-indentation -Wctad-maybe-unsupported -fdiagnostics-color -ffunction-sections -fdata-sections -fno-common -Woverloaded-virtual -Wno-nested-anon-types -O3 -DNDEBUG -std=c++17  -fno-exceptions -funwind-tables -fno-rtti -UNDEBUG -MD -MT tools/clang/tools/extra/clang-tidy/llvmlibc/CMakeFiles/obj.clangTidyLLVMLibcModule.dir/InlineFunctionDeclCheck.cpp.o -MF tools/clang/tools/extra/clang-tidy/llvmlibc/CMakeFiles/obj.clangTidyLLVMLibcModule.dir/InlineFunctionDeclCheck.cpp.o.d -o tools/clang/tools/extra/clang-tidy/llvmlibc/CMakeFiles/obj.clangTidyLLVMLibcModule.dir/InlineFunctionDeclCheck.cpp.o -c /home/gha/actions-runner/_work/llvm-project/llvm-project/clang-tools-extra/clang-tidy/llvmlibc/InlineFunctionDeclCheck.cpp
In file included from /home/gha/actions-runner/_work/llvm-project/llvm-project/clang-tools-extra/clang-tidy/llvmlibc/InlineFunctionDeclCheck.cpp:11:
/home/gha/actions-runner/_work/llvm-project/llvm-project/clang-tools-extra/clang-tidy/llvmlibc/../utils/LexerUtils.h:15:10: fatal error: 'clang/basic/SourceManager.h' file not found
15 | #include "clang/basic/SourceManager.h"
|          ^~~~~~~~~~~~~~~~~~~~~~~~~~~~~
1 error generated.
```
</details>
<details>
<summary>tools/clang/tools/extra/clang-tidy/modernize/CMakeFiles/obj.clangTidyModernizeModule.dir/ConcatNestedNamespacesCheck.cpp.o</summary>

```
FAILED: tools/clang/tools/extra/clang-tidy/modernize/CMakeFiles/obj.clangTidyModernizeModule.dir/ConcatNestedNamespacesCheck.cpp.o
sccache /opt/llvm/bin/clang++ -DGTEST_HAS_RTTI=0 -D_DEBUG -D_GLIBCXX_ASSERTIONS -D_GLIBCXX_USE_CXX11_ABI=1 -D_GNU_SOURCE -D__STDC_CONSTANT_MACROS -D__STDC_FORMAT_MACROS -D__STDC_LIMIT_MACROS -I/home/gha/actions-runner/_work/llvm-project/llvm-project/build/tools/clang/tools/extra/clang-tidy/modernize -I/home/gha/actions-runner/_work/llvm-project/llvm-project/clang-tools-extra/clang-tidy/modernize -I/home/gha/actions-runner/_work/llvm-project/llvm-project/build/tools/clang/tools/extra/clang-tidy -I/home/gha/actions-runner/_work/llvm-project/llvm-project/clang/include -I/home/gha/actions-runner/_work/llvm-project/llvm-project/build/tools/clang/include -I/home/gha/actions-runner/_work/llvm-project/llvm-project/build/include -I/home/gha/actions-runner/_work/llvm-project/llvm-project/llvm/include -gmlt -fPIC -fno-semantic-interposition -fvisibility-inlines-hidden -Werror -Werror=date-time -Werror=unguarded-availability-new -Wall -Wextra -Wno-unused-parameter -Wwrite-strings -Wcast-qual -Wmissing-field-initializers -pedantic -Wno-long-long -Wc++98-compat-extra-semi -Wimplicit-fallthrough -Wcovered-switch-default -Wno-noexcept-type -Wnon-virtual-dtor -Wdelete-non-virtual-dtor -Wsuggest-override -Wstring-conversion -Wno-pass-failed -Wmisleading-indentation -Wctad-maybe-unsupported -fdiagnostics-color -ffunction-sections -fdata-sections -fno-common -Woverloaded-virtual -Wno-nested-anon-types -O3 -DNDEBUG -std=c++17  -fno-exceptions -funwind-tables -fno-rtti -UNDEBUG -MD -MT tools/clang/tools/extra/clang-tidy/modernize/CMakeFiles/obj.clangTidyModernizeModule.dir/ConcatNestedNamespacesCheck.cpp.o -MF tools/clang/tools/extra/clang-tidy/modernize/CMakeFiles/obj.clangTidyModernizeModule.dir/ConcatNestedNamespacesCheck.cpp.o.d -o tools/clang/tools/extra/clang-tidy/modernize/CMakeFiles/obj.clangTidyModernizeModule.dir/ConcatNestedNamespacesCheck.cpp.o -c /home/gha/actions-runner/_work/llvm-project/llvm-project/clang-tools-extra/clang-tidy/modernize/ConcatNestedNamespacesCheck.cpp
In file included from /home/gha/actions-runner/_work/llvm-project/llvm-project/clang-tools-extra/clang-tidy/modernize/ConcatNestedNamespacesCheck.cpp:10:
/home/gha/actions-runner/_work/llvm-project/llvm-project/clang-tools-extra/clang-tidy/modernize/../utils/LexerUtils.h:15:10: fatal error: 'clang/basic/SourceManager.h' file not found
15 | #include "clang/basic/SourceManager.h"
|          ^~~~~~~~~~~~~~~~~~~~~~~~~~~~~
1 error generated.
```
</details>
<details>
<summary>tools/clang/tools/extra/clang-tidy/modernize/CMakeFiles/obj.clangTidyModernizeModule.dir/MacroToEnumCheck.cpp.o</summary>

```
FAILED: tools/clang/tools/extra/clang-tidy/modernize/CMakeFiles/obj.clangTidyModernizeModule.dir/MacroToEnumCheck.cpp.o
sccache /opt/llvm/bin/clang++ -DGTEST_HAS_RTTI=0 -D_DEBUG -D_GLIBCXX_ASSERTIONS -D_GLIBCXX_USE_CXX11_ABI=1 -D_GNU_SOURCE -D__STDC_CONSTANT_MACROS -D__STDC_FORMAT_MACROS -D__STDC_LIMIT_MACROS -I/home/gha/actions-runner/_work/llvm-project/llvm-project/build/tools/clang/tools/extra/clang-tidy/modernize -I/home/gha/actions-runner/_work/llvm-project/llvm-project/clang-tools-extra/clang-tidy/modernize -I/home/gha/actions-runner/_work/llvm-project/llvm-project/build/tools/clang/tools/extra/clang-tidy -I/home/gha/actions-runner/_work/llvm-project/llvm-project/clang/include -I/home/gha/actions-runner/_work/llvm-project/llvm-project/build/tools/clang/include -I/home/gha/actions-runner/_work/llvm-project/llvm-project/build/include -I/home/gha/actions-runner/_work/llvm-project/llvm-project/llvm/include -gmlt -fPIC -fno-semantic-interposition -fvisibility-inlines-hidden -Werror -Werror=date-time -Werror=unguarded-availability-new -Wall -Wextra -Wno-unused-parameter -Wwrite-strings -Wcast-qual -Wmissing-field-initializers -pedantic -Wno-long-long -Wc++98-compat-extra-semi -Wimplicit-fallthrough -Wcovered-switch-default -Wno-noexcept-type -Wnon-virtual-dtor -Wdelete-non-virtual-dtor -Wsuggest-override -Wstring-conversion -Wno-pass-failed -Wmisleading-indentation -Wctad-maybe-unsupported -fdiagnostics-color -ffunction-sections -fdata-sections -fno-common -Woverloaded-virtual -Wno-nested-anon-types -O3 -DNDEBUG -std=c++17  -fno-exceptions -funwind-tables -fno-rtti -UNDEBUG -MD -MT tools/clang/tools/extra/clang-tidy/modernize/CMakeFiles/obj.clangTidyModernizeModule.dir/MacroToEnumCheck.cpp.o -MF tools/clang/tools/extra/clang-tidy/modernize/CMakeFiles/obj.clangTidyModernizeModule.dir/MacroToEnumCheck.cpp.o.d -o tools/clang/tools/extra/clang-tidy/modernize/CMakeFiles/obj.clangTidyModernizeModule.dir/MacroToEnumCheck.cpp.o -c /home/gha/actions-runner/_work/llvm-project/llvm-project/clang-tools-extra/clang-tidy/modernize/MacroToEnumCheck.cpp
In file included from /home/gha/actions-runner/_work/llvm-project/llvm-project/clang-tools-extra/clang-tidy/modernize/MacroToEnumCheck.cpp:10:
/home/gha/actions-runner/_work/llvm-project/llvm-project/clang-tools-extra/clang-tidy/modernize/../utils/LexerUtils.h:15:10: fatal error: 'clang/basic/SourceManager.h' file not found
15 | #include "clang/basic/SourceManager.h"
|          ^~~~~~~~~~~~~~~~~~~~~~~~~~~~~
1 error generated.
```
</details>
<details>
<summary>tools/clang/tools/extra/clang-tidy/modernize/CMakeFiles/obj.clangTidyModernizeModule.dir/RedundantVoidArgCheck.cpp.o</summary>

```
FAILED: tools/clang/tools/extra/clang-tidy/modernize/CMakeFiles/obj.clangTidyModernizeModule.dir/RedundantVoidArgCheck.cpp.o
sccache /opt/llvm/bin/clang++ -DGTEST_HAS_RTTI=0 -D_DEBUG -D_GLIBCXX_ASSERTIONS -D_GLIBCXX_USE_CXX11_ABI=1 -D_GNU_SOURCE -D__STDC_CONSTANT_MACROS -D__STDC_FORMAT_MACROS -D__STDC_LIMIT_MACROS -I/home/gha/actions-runner/_work/llvm-project/llvm-project/build/tools/clang/tools/extra/clang-tidy/modernize -I/home/gha/actions-runner/_work/llvm-project/llvm-project/clang-tools-extra/clang-tidy/modernize -I/home/gha/actions-runner/_work/llvm-project/llvm-project/build/tools/clang/tools/extra/clang-tidy -I/home/gha/actions-runner/_work/llvm-project/llvm-project/clang/include -I/home/gha/actions-runner/_work/llvm-project/llvm-project/build/tools/clang/include -I/home/gha/actions-runner/_work/llvm-project/llvm-project/build/include -I/home/gha/actions-runner/_work/llvm-project/llvm-project/llvm/include -gmlt -fPIC -fno-semantic-interposition -fvisibility-inlines-hidden -Werror -Werror=date-time -Werror=unguarded-availability-new -Wall -Wextra -Wno-unused-parameter -Wwrite-strings -Wcast-qual -Wmissing-field-initializers -pedantic -Wno-long-long -Wc++98-compat-extra-semi -Wimplicit-fallthrough -Wcovered-switch-default -Wno-noexcept-type -Wnon-virtual-dtor -Wdelete-non-virtual-dtor -Wsuggest-override -Wstring-conversion -Wno-pass-failed -Wmisleading-indentation -Wctad-maybe-unsupported -fdiagnostics-color -ffunction-sections -fdata-sections -fno-common -Woverloaded-virtual -Wno-nested-anon-types -O3 -DNDEBUG -std=c++17  -fno-exceptions -funwind-tables -fno-rtti -UNDEBUG -MD -MT tools/clang/tools/extra/clang-tidy/modernize/CMakeFiles/obj.clangTidyModernizeModule.dir/RedundantVoidArgCheck.cpp.o -MF tools/clang/tools/extra/clang-tidy/modernize/CMakeFiles/obj.clangTidyModernizeModule.dir/RedundantVoidArgCheck.cpp.o.d -o tools/clang/tools/extra/clang-tidy/modernize/CMakeFiles/obj.clangTidyModernizeModule.dir/RedundantVoidArgCheck.cpp.o -c /home/gha/actions-runner/_work/llvm-project/llvm-project/clang-tools-extra/clang-tidy/modernize/RedundantVoidArgCheck.cpp
In file included from /home/gha/actions-runner/_work/llvm-project/llvm-project/clang-tools-extra/clang-tidy/modernize/RedundantVoidArgCheck.cpp:10:
/home/gha/actions-runner/_work/llvm-project/llvm-project/clang-tools-extra/clang-tidy/modernize/../utils/LexerUtils.h:15:10: fatal error: 'clang/basic/SourceManager.h' file not found
15 | #include "clang/basic/SourceManager.h"
|          ^~~~~~~~~~~~~~~~~~~~~~~~~~~~~
1 error generated.
```
</details>
<details>
<summary>tools/clang/tools/extra/clang-tidy/modernize/CMakeFiles/obj.clangTidyModernizeModule.dir/MinMaxUseInitializerListCheck.cpp.o</summary>

```
FAILED: tools/clang/tools/extra/clang-tidy/modernize/CMakeFiles/obj.clangTidyModernizeModule.dir/MinMaxUseInitializerListCheck.cpp.o
sccache /opt/llvm/bin/clang++ -DGTEST_HAS_RTTI=0 -D_DEBUG -D_GLIBCXX_ASSERTIONS -D_GLIBCXX_USE_CXX11_ABI=1 -D_GNU_SOURCE -D__STDC_CONSTANT_MACROS -D__STDC_FORMAT_MACROS -D__STDC_LIMIT_MACROS -I/home/gha/actions-runner/_work/llvm-project/llvm-project/build/tools/clang/tools/extra/clang-tidy/modernize -I/home/gha/actions-runner/_work/llvm-project/llvm-project/clang-tools-extra/clang-tidy/modernize -I/home/gha/actions-runner/_work/llvm-project/llvm-project/build/tools/clang/tools/extra/clang-tidy -I/home/gha/actions-runner/_work/llvm-project/llvm-project/clang/include -I/home/gha/actions-runner/_work/llvm-project/llvm-project/build/tools/clang/include -I/home/gha/actions-runner/_work/llvm-project/llvm-project/build/include -I/home/gha/actions-runner/_work/llvm-project/llvm-project/llvm/include -gmlt -fPIC -fno-semantic-interposition -fvisibility-inlines-hidden -Werror -Werror=date-time -Werror=unguarded-availability-new -Wall -Wextra -Wno-unused-parameter -Wwrite-strings -Wcast-qual -Wmissing-field-initializers -pedantic -Wno-long-long -Wc++98-compat-extra-semi -Wimplicit-fallthrough -Wcovered-switch-default -Wno-noexcept-type -Wnon-virtual-dtor -Wdelete-non-virtual-dtor -Wsuggest-override -Wstring-conversion -Wno-pass-failed -Wmisleading-indentation -Wctad-maybe-unsupported -fdiagnostics-color -ffunction-sections -fdata-sections -fno-common -Woverloaded-virtual -Wno-nested-anon-types -O3 -DNDEBUG -std=c++17  -fno-exceptions -funwind-tables -fno-rtti -UNDEBUG -MD -MT tools/clang/tools/extra/clang-tidy/modernize/CMakeFiles/obj.clangTidyModernizeModule.dir/MinMaxUseInitializerListCheck.cpp.o -MF tools/clang/tools/extra/clang-tidy/modernize/CMakeFiles/obj.clangTidyModernizeModule.dir/MinMaxUseInitializerListCheck.cpp.o.d -o tools/clang/tools/extra/clang-tidy/modernize/CMakeFiles/obj.clangTidyModernizeModule.dir/MinMaxUseInitializerListCheck.cpp.o -c /home/gha/actions-runner/_work/llvm-project/llvm-project/clang-tools-extra/clang-tidy/modernize/MinMaxUseInitializerListCheck.cpp
In file included from /home/gha/actions-runner/_work/llvm-project/llvm-project/clang-tools-extra/clang-tidy/modernize/MinMaxUseInitializerListCheck.cpp:11:
/home/gha/actions-runner/_work/llvm-project/llvm-project/clang-tools-extra/clang-tidy/modernize/../utils/LexerUtils.h:15:10: fatal error: 'clang/basic/SourceManager.h' file not found
15 | #include "clang/basic/SourceManager.h"
|          ^~~~~~~~~~~~~~~~~~~~~~~~~~~~~
1 error generated.
```
</details>
<details>
<summary>tools/clang/tools/extra/clang-tidy/modernize/CMakeFiles/obj.clangTidyModernizeModule.dir/UseConstraintsCheck.cpp.o</summary>

```
FAILED: tools/clang/tools/extra/clang-tidy/modernize/CMakeFiles/obj.clangTidyModernizeModule.dir/UseConstraintsCheck.cpp.o
sccache /opt/llvm/bin/clang++ -DGTEST_HAS_RTTI=0 -D_DEBUG -D_GLIBCXX_ASSERTIONS -D_GLIBCXX_USE_CXX11_ABI=1 -D_GNU_SOURCE -D__STDC_CONSTANT_MACROS -D__STDC_FORMAT_MACROS -D__STDC_LIMIT_MACROS -I/home/gha/actions-runner/_work/llvm-project/llvm-project/build/tools/clang/tools/extra/clang-tidy/modernize -I/home/gha/actions-runner/_work/llvm-project/llvm-project/clang-tools-extra/clang-tidy/modernize -I/home/gha/actions-runner/_work/llvm-project/llvm-project/build/tools/clang/tools/extra/clang-tidy -I/home/gha/actions-runner/_work/llvm-project/llvm-project/clang/include -I/home/gha/actions-runner/_work/llvm-project/llvm-project/build/tools/clang/include -I/home/gha/actions-runner/_work/llvm-project/llvm-project/build/include -I/home/gha/actions-runner/_work/llvm-project/llvm-project/llvm/include -gmlt -fPIC -fno-semantic-interposition -fvisibility-inlines-hidden -Werror -Werror=date-time -Werror=unguarded-availability-new -Wall -Wextra -Wno-unused-parameter -Wwrite-strings -Wcast-qual -Wmissing-field-initializers -pedantic -Wno-long-long -Wc++98-compat-extra-semi -Wimplicit-fallthrough -Wcovered-switch-default -Wno-noexcept-type -Wnon-virtual-dtor -Wdelete-non-virtual-dtor -Wsuggest-override -Wstring-conversion -Wno-pass-failed -Wmisleading-indentation -Wctad-maybe-unsupported -fdiagnostics-color -ffunction-sections -fdata-sections -fno-common -Woverloaded-virtual -Wno-nested-anon-types -O3 -DNDEBUG -std=c++17  -fno-exceptions -funwind-tables -fno-rtti -UNDEBUG -MD -MT tools/clang/tools/extra/clang-tidy/modernize/CMakeFiles/obj.clangTidyModernizeModule.dir/UseConstraintsCheck.cpp.o -MF tools/clang/tools/extra/clang-tidy/modernize/CMakeFiles/obj.clangTidyModernizeModule.dir/UseConstraintsCheck.cpp.o.d -o tools/clang/tools/extra/clang-tidy/modernize/CMakeFiles/obj.clangTidyModernizeModule.dir/UseConstraintsCheck.cpp.o -c /home/gha/actions-runner/_work/llvm-project/llvm-project/clang-tools-extra/clang-tidy/modernize/UseConstraintsCheck.cpp
In file included from /home/gha/actions-runner/_work/llvm-project/llvm-project/clang-tools-extra/clang-tidy/modernize/UseConstraintsCheck.cpp:15:
/home/gha/actions-runner/_work/llvm-project/llvm-project/clang-tools-extra/clang-tidy/modernize/../utils/LexerUtils.h:15:10: fatal error: 'clang/basic/SourceManager.h' file not found
15 | #include "clang/basic/SourceManager.h"
|          ^~~~~~~~~~~~~~~~~~~~~~~~~~~~~
1 error generated.
```
</details>
<details>
<summary>tools/clang/tools/extra/clang-tidy/modernize/CMakeFiles/obj.clangTidyModernizeModule.dir/UseEqualsDefaultCheck.cpp.o</summary>

```
FAILED: tools/clang/tools/extra/clang-tidy/modernize/CMakeFiles/obj.clangTidyModernizeModule.dir/UseEqualsDefaultCheck.cpp.o
sccache /opt/llvm/bin/clang++ -DGTEST_HAS_RTTI=0 -D_DEBUG -D_GLIBCXX_ASSERTIONS -D_GLIBCXX_USE_CXX11_ABI=1 -D_GNU_SOURCE -D__STDC_CONSTANT_MACROS -D__STDC_FORMAT_MACROS -D__STDC_LIMIT_MACROS -I/home/gha/actions-runner/_work/llvm-project/llvm-project/build/tools/clang/tools/extra/clang-tidy/modernize -I/home/gha/actions-runner/_work/llvm-project/llvm-project/clang-tools-extra/clang-tidy/modernize -I/home/gha/actions-runner/_work/llvm-project/llvm-project/build/tools/clang/tools/extra/clang-tidy -I/home/gha/actions-runner/_work/llvm-project/llvm-project/clang/include -I/home/gha/actions-runner/_work/llvm-project/llvm-project/build/tools/clang/include -I/home/gha/actions-runner/_work/llvm-project/llvm-project/build/include -I/home/gha/actions-runner/_work/llvm-project/llvm-project/llvm/include -gmlt -fPIC -fno-semantic-interposition -fvisibility-inlines-hidden -Werror -Werror=date-time -Werror=unguarded-availability-new -Wall -Wextra -Wno-unused-parameter -Wwrite-strings -Wcast-qual -Wmissing-field-initializers -pedantic -Wno-long-long -Wc++98-compat-extra-semi -Wimplicit-fallthrough -Wcovered-switch-default -Wno-noexcept-type -Wnon-virtual-dtor -Wdelete-non-virtual-dtor -Wsuggest-override -Wstring-conversion -Wno-pass-failed -Wmisleading-indentation -Wctad-maybe-unsupported -fdiagnostics-color -ffunction-sections -fdata-sections -fno-common -Woverloaded-virtual -Wno-nested-anon-types -O3 -DNDEBUG -std=c++17  -fno-exceptions -funwind-tables -fno-rtti -UNDEBUG -MD -MT tools/clang/tools/extra/clang-tidy/modernize/CMakeFiles/obj.clangTidyModernizeModule.dir/UseEqualsDefaultCheck.cpp.o -MF tools/clang/tools/extra/clang-tidy/modernize/CMakeFiles/obj.clangTidyModernizeModule.dir/UseEqualsDefaultCheck.cpp.o.d -o tools/clang/tools/extra/clang-tidy/modernize/CMakeFiles/obj.clangTidyModernizeModule.dir/UseEqualsDefaultCheck.cpp.o -c /home/gha/actions-runner/_work/llvm-project/llvm-project/clang-tools-extra/clang-tidy/modernize/UseEqualsDefaultCheck.cpp
In file included from /home/gha/actions-runner/_work/llvm-project/llvm-project/clang-tools-extra/clang-tidy/modernize/UseEqualsDefaultCheck.cpp:10:
/home/gha/actions-runner/_work/llvm-project/llvm-project/clang-tools-extra/clang-tidy/modernize/../utils/LexerUtils.h:15:10: fatal error: 'clang/basic/SourceManager.h' file not found
15 | #include "clang/basic/SourceManager.h"
|          ^~~~~~~~~~~~~~~~~~~~~~~~~~~~~
1 error generated.
```
</details>
<details>
<summary>tools/clang/tools/extra/clang-tidy/modernize/CMakeFiles/obj.clangTidyModernizeModule.dir/UseOverrideCheck.cpp.o</summary>

```
FAILED: tools/clang/tools/extra/clang-tidy/modernize/CMakeFiles/obj.clangTidyModernizeModule.dir/UseOverrideCheck.cpp.o
sccache /opt/llvm/bin/clang++ -DGTEST_HAS_RTTI=0 -D_DEBUG -D_GLIBCXX_ASSERTIONS -D_GLIBCXX_USE_CXX11_ABI=1 -D_GNU_SOURCE -D__STDC_CONSTANT_MACROS -D__STDC_FORMAT_MACROS -D__STDC_LIMIT_MACROS -I/home/gha/actions-runner/_work/llvm-project/llvm-project/build/tools/clang/tools/extra/clang-tidy/modernize -I/home/gha/actions-runner/_work/llvm-project/llvm-project/clang-tools-extra/clang-tidy/modernize -I/home/gha/actions-runner/_work/llvm-project/llvm-project/build/tools/clang/tools/extra/clang-tidy -I/home/gha/actions-runner/_work/llvm-project/llvm-project/clang/include -I/home/gha/actions-runner/_work/llvm-project/llvm-project/build/tools/clang/include -I/home/gha/actions-runner/_work/llvm-project/llvm-project/build/include -I/home/gha/actions-runner/_work/llvm-project/llvm-project/llvm/include -gmlt -fPIC -fno-semantic-interposition -fvisibility-inlines-hidden -Werror -Werror=date-time -Werror=unguarded-availability-new -Wall -Wextra -Wno-unused-parameter -Wwrite-strings -Wcast-qual -Wmissing-field-initializers -pedantic -Wno-long-long -Wc++98-compat-extra-semi -Wimplicit-fallthrough -Wcovered-switch-default -Wno-noexcept-type -Wnon-virtual-dtor -Wdelete-non-virtual-dtor -Wsuggest-override -Wstring-conversion -Wno-pass-failed -Wmisleading-indentation -Wctad-maybe-unsupported -fdiagnostics-color -ffunction-sections -fdata-sections -fno-common -Woverloaded-virtual -Wno-nested-anon-types -O3 -DNDEBUG -std=c++17  -fno-exceptions -funwind-tables -fno-rtti -UNDEBUG -MD -MT tools/clang/tools/extra/clang-tidy/modernize/CMakeFiles/obj.clangTidyModernizeModule.dir/UseOverrideCheck.cpp.o -MF tools/clang/tools/extra/clang-tidy/modernize/CMakeFiles/obj.clangTidyModernizeModule.dir/UseOverrideCheck.cpp.o.d -o tools/clang/tools/extra/clang-tidy/modernize/CMakeFiles/obj.clangTidyModernizeModule.dir/UseOverrideCheck.cpp.o -c /home/gha/actions-runner/_work/llvm-project/llvm-project/clang-tools-extra/clang-tidy/modernize/UseOverrideCheck.cpp
In file included from /home/gha/actions-runner/_work/llvm-project/llvm-project/clang-tools-extra/clang-tidy/modernize/UseOverrideCheck.cpp:10:
/home/gha/actions-runner/_work/llvm-project/llvm-project/clang-tools-extra/clang-tidy/modernize/../utils/LexerUtils.h:15:10: fatal error: 'clang/basic/SourceManager.h' file not found
15 | #include "clang/basic/SourceManager.h"
|          ^~~~~~~~~~~~~~~~~~~~~~~~~~~~~
1 error generated.
```
</details>
<details>
<summary>tools/clang/tools/extra/clang-tidy/modernize/CMakeFiles/obj.clangTidyModernizeModule.dir/UseUsingCheck.cpp.o</summary>

```
FAILED: tools/clang/tools/extra/clang-tidy/modernize/CMakeFiles/obj.clangTidyModernizeModule.dir/UseUsingCheck.cpp.o
sccache /opt/llvm/bin/clang++ -DGTEST_HAS_RTTI=0 -D_DEBUG -D_GLIBCXX_ASSERTIONS -D_GLIBCXX_USE_CXX11_ABI=1 -D_GNU_SOURCE -D__STDC_CONSTANT_MACROS -D__STDC_FORMAT_MACROS -D__STDC_LIMIT_MACROS -I/home/gha/actions-runner/_work/llvm-project/llvm-project/build/tools/clang/tools/extra/clang-tidy/modernize -I/home/gha/actions-runner/_work/llvm-project/llvm-project/clang-tools-extra/clang-tidy/modernize -I/home/gha/actions-runner/_work/llvm-project/llvm-project/build/tools/clang/tools/extra/clang-tidy -I/home/gha/actions-runner/_work/llvm-project/llvm-project/clang/include -I/home/gha/actions-runner/_work/llvm-project/llvm-project/build/tools/clang/include -I/home/gha/actions-runner/_work/llvm-project/llvm-project/build/include -I/home/gha/actions-runner/_work/llvm-project/llvm-project/llvm/include -gmlt -fPIC -fno-semantic-interposition -fvisibility-inlines-hidden -Werror -Werror=date-time -Werror=unguarded-availability-new -Wall -Wextra -Wno-unused-parameter -Wwrite-strings -Wcast-qual -Wmissing-field-initializers -pedantic -Wno-long-long -Wc++98-compat-extra-semi -Wimplicit-fallthrough -Wcovered-switch-default -Wno-noexcept-type -Wnon-virtual-dtor -Wdelete-non-virtual-dtor -Wsuggest-override -Wstring-conversion -Wno-pass-failed -Wmisleading-indentation -Wctad-maybe-unsupported -fdiagnostics-color -ffunction-sections -fdata-sections -fno-common -Woverloaded-virtual -Wno-nested-anon-types -O3 -DNDEBUG -std=c++17  -fno-exceptions -funwind-tables -fno-rtti -UNDEBUG -MD -MT tools/clang/tools/extra/clang-tidy/modernize/CMakeFiles/obj.clangTidyModernizeModule.dir/UseUsingCheck.cpp.o -MF tools/clang/tools/extra/clang-tidy/modernize/CMakeFiles/obj.clangTidyModernizeModule.dir/UseUsingCheck.cpp.o.d -o tools/clang/tools/extra/clang-tidy/modernize/CMakeFiles/obj.clangTidyModernizeModule.dir/UseUsingCheck.cpp.o -c /home/gha/actions-runner/_work/llvm-project/llvm-project/clang-tools-extra/clang-tidy/modernize/UseUsingCheck.cpp
In file included from /home/gha/actions-runner/_work/llvm-project/llvm-project/clang-tools-extra/clang-tidy/modernize/UseUsingCheck.cpp:10:
/home/gha/actions-runner/_work/llvm-project/llvm-project/clang-tools-extra/clang-tidy/modernize/../utils/LexerUtils.h:15:10: fatal error: 'clang/basic/SourceManager.h' file not found
15 | #include "clang/basic/SourceManager.h"
|          ^~~~~~~~~~~~~~~~~~~~~~~~~~~~~
1 error generated.
```
</details>
<details>
<summary>tools/clang/tools/extra/clang-tidy/modernize/CMakeFiles/obj.clangTidyModernizeModule.dir/UseTrailingReturnTypeCheck.cpp.o</summary>

```
FAILED: tools/clang/tools/extra/clang-tidy/modernize/CMakeFiles/obj.clangTidyModernizeModule.dir/UseTrailingReturnTypeCheck.cpp.o
sccache /opt/llvm/bin/clang++ -DGTEST_HAS_RTTI=0 -D_DEBUG -D_GLIBCXX_ASSERTIONS -D_GLIBCXX_USE_CXX11_ABI=1 -D_GNU_SOURCE -D__STDC_CONSTANT_MACROS -D__STDC_FORMAT_MACROS -D__STDC_LIMIT_MACROS -I/home/gha/actions-runner/_work/llvm-project/llvm-project/build/tools/clang/tools/extra/clang-tidy/modernize -I/home/gha/actions-runner/_work/llvm-project/llvm-project/clang-tools-extra/clang-tidy/modernize -I/home/gha/actions-runner/_work/llvm-project/llvm-project/build/tools/clang/tools/extra/clang-tidy -I/home/gha/actions-runner/_work/llvm-project/llvm-project/clang/include -I/home/gha/actions-runner/_work/llvm-project/llvm-project/build/tools/clang/include -I/home/gha/actions-runner/_work/llvm-project/llvm-project/build/include -I/home/gha/actions-runner/_work/llvm-project/llvm-project/llvm/include -gmlt -fPIC -fno-semantic-interposition -fvisibility-inlines-hidden -Werror -Werror=date-time -Werror=unguarded-availability-new -Wall -Wextra -Wno-unused-parameter -Wwrite-strings -Wcast-qual -Wmissing-field-initializers -pedantic -Wno-long-long -Wc++98-compat-extra-semi -Wimplicit-fallthrough -Wcovered-switch-default -Wno-noexcept-type -Wnon-virtual-dtor -Wdelete-non-virtual-dtor -Wsuggest-override -Wstring-conversion -Wno-pass-failed -Wmisleading-indentation -Wctad-maybe-unsupported -fdiagnostics-color -ffunction-sections -fdata-sections -fno-common -Woverloaded-virtual -Wno-nested-anon-types -O3 -DNDEBUG -std=c++17  -fno-exceptions -funwind-tables -fno-rtti -UNDEBUG -MD -MT tools/clang/tools/extra/clang-tidy/modernize/CMakeFiles/obj.clangTidyModernizeModule.dir/UseTrailingReturnTypeCheck.cpp.o -MF tools/clang/tools/extra/clang-tidy/modernize/CMakeFiles/obj.clangTidyModernizeModule.dir/UseTrailingReturnTypeCheck.cpp.o.d -o tools/clang/tools/extra/clang-tidy/modernize/CMakeFiles/obj.clangTidyModernizeModule.dir/UseTrailingReturnTypeCheck.cpp.o -c /home/gha/actions-runner/_work/llvm-project/llvm-project/clang-tools-extra/clang-tidy/modernize/UseTrailingReturnTypeCheck.cpp
In file included from /home/gha/actions-runner/_work/llvm-project/llvm-project/clang-tools-extra/clang-tidy/modernize/UseTrailingReturnTypeCheck.cpp:10:
/home/gha/actions-runner/_work/llvm-project/llvm-project/clang-tools-extra/clang-tidy/modernize/../utils/LexerUtils.h:15:10: fatal error: 'clang/basic/SourceManager.h' file not found
15 | #include "clang/basic/SourceManager.h"
|          ^~~~~~~~~~~~~~~~~~~~~~~~~~~~~
1 error generated.
```
</details>
<details>
<summary>tools/clang/tools/extra/clang-tidy/performance/CMakeFiles/obj.clangTidyPerformanceModule.dir/NoexceptFunctionBaseCheck.cpp.o</summary>

```
FAILED: tools/clang/tools/extra/clang-tidy/performance/CMakeFiles/obj.clangTidyPerformanceModule.dir/NoexceptFunctionBaseCheck.cpp.o
sccache /opt/llvm/bin/clang++ -DGTEST_HAS_RTTI=0 -D_DEBUG -D_GLIBCXX_ASSERTIONS -D_GLIBCXX_USE_CXX11_ABI=1 -D_GNU_SOURCE -D__STDC_CONSTANT_MACROS -D__STDC_FORMAT_MACROS -D__STDC_LIMIT_MACROS -I/home/gha/actions-runner/_work/llvm-project/llvm-project/build/tools/clang/tools/extra/clang-tidy/performance -I/home/gha/actions-runner/_work/llvm-project/llvm-project/clang-tools-extra/clang-tidy/performance -I/home/gha/actions-runner/_work/llvm-project/llvm-project/build/tools/clang/tools/extra/clang-tidy -I/home/gha/actions-runner/_work/llvm-project/llvm-project/clang/include -I/home/gha/actions-runner/_work/llvm-project/llvm-project/build/tools/clang/include -I/home/gha/actions-runner/_work/llvm-project/llvm-project/build/include -I/home/gha/actions-runner/_work/llvm-project/llvm-project/llvm/include -gmlt -fPIC -fno-semantic-interposition -fvisibility-inlines-hidden -Werror -Werror=date-time -Werror=unguarded-availability-new -Wall -Wextra -Wno-unused-parameter -Wwrite-strings -Wcast-qual -Wmissing-field-initializers -pedantic -Wno-long-long -Wc++98-compat-extra-semi -Wimplicit-fallthrough -Wcovered-switch-default -Wno-noexcept-type -Wnon-virtual-dtor -Wdelete-non-virtual-dtor -Wsuggest-override -Wstring-conversion -Wno-pass-failed -Wmisleading-indentation -Wctad-maybe-unsupported -fdiagnostics-color -ffunction-sections -fdata-sections -fno-common -Woverloaded-virtual -Wno-nested-anon-types -O3 -DNDEBUG -std=c++17  -fno-exceptions -funwind-tables -fno-rtti -UNDEBUG -MD -MT tools/clang/tools/extra/clang-tidy/performance/CMakeFiles/obj.clangTidyPerformanceModule.dir/NoexceptFunctionBaseCheck.cpp.o -MF tools/clang/tools/extra/clang-tidy/performance/CMakeFiles/obj.clangTidyPerformanceModule.dir/NoexceptFunctionBaseCheck.cpp.o.d -o tools/clang/tools/extra/clang-tidy/performance/CMakeFiles/obj.clangTidyPerformanceModule.dir/NoexceptFunctionBaseCheck.cpp.o -c /home/gha/actions-runner/_work/llvm-project/llvm-project/clang-tools-extra/clang-tidy/performance/NoexceptFunctionBaseCheck.cpp
In file included from /home/gha/actions-runner/_work/llvm-project/llvm-project/clang-tools-extra/clang-tidy/performance/NoexceptFunctionBaseCheck.cpp:10:
/home/gha/actions-runner/_work/llvm-project/llvm-project/clang-tools-extra/clang-tidy/performance/../utils/LexerUtils.h:15:10: fatal error: 'clang/basic/SourceManager.h' file not found
15 | #include "clang/basic/SourceManager.h"
|          ^~~~~~~~~~~~~~~~~~~~~~~~~~~~~
1 error generated.
```
</details>
<details>
<summary>tools/clang/tools/extra/clang-tidy/performance/CMakeFiles/obj.clangTidyPerformanceModule.dir/UnnecessaryCopyInitializationCheck.cpp.o</summary>

```
FAILED: tools/clang/tools/extra/clang-tidy/performance/CMakeFiles/obj.clangTidyPerformanceModule.dir/UnnecessaryCopyInitializationCheck.cpp.o
sccache /opt/llvm/bin/clang++ -DGTEST_HAS_RTTI=0 -D_DEBUG -D_GLIBCXX_ASSERTIONS -D_GLIBCXX_USE_CXX11_ABI=1 -D_GNU_SOURCE -D__STDC_CONSTANT_MACROS -D__STDC_FORMAT_MACROS -D__STDC_LIMIT_MACROS -I/home/gha/actions-runner/_work/llvm-project/llvm-project/build/tools/clang/tools/extra/clang-tidy/performance -I/home/gha/actions-runner/_work/llvm-project/llvm-project/clang-tools-extra/clang-tidy/performance -I/home/gha/actions-runner/_work/llvm-project/llvm-project/build/tools/clang/tools/extra/clang-tidy -I/home/gha/actions-runner/_work/llvm-project/llvm-project/clang/include -I/home/gha/actions-runner/_work/llvm-project/llvm-project/build/tools/clang/include -I/home/gha/actions-runner/_work/llvm-project/llvm-project/build/include -I/home/gha/actions-runner/_work/llvm-project/llvm-project/llvm/include -gmlt -fPIC -fno-semantic-interposition -fvisibility-inlines-hidden -Werror -Werror=date-time -Werror=unguarded-availability-new -Wall -Wextra -Wno-unused-parameter -Wwrite-strings -Wcast-qual -Wmissing-field-initializers -pedantic -Wno-long-long -Wc++98-compat-extra-semi -Wimplicit-fallthrough -Wcovered-switch-default -Wno-noexcept-type -Wnon-virtual-dtor -Wdelete-non-virtual-dtor -Wsuggest-override -Wstring-conversion -Wno-pass-failed -Wmisleading-indentation -Wctad-maybe-unsupported -fdiagnostics-color -ffunction-sections -fdata-sections -fno-common -Woverloaded-virtual -Wno-nested-anon-types -O3 -DNDEBUG -std=c++17  -fno-exceptions -funwind-tables -fno-rtti -UNDEBUG -MD -MT tools/clang/tools/extra/clang-tidy/performance/CMakeFiles/obj.clangTidyPerformanceModule.dir/UnnecessaryCopyInitializationCheck.cpp.o -MF tools/clang/tools/extra/clang-tidy/performance/CMakeFiles/obj.clangTidyPerformanceModule.dir/UnnecessaryCopyInitializationCheck.cpp.o.d -o tools/clang/tools/extra/clang-tidy/performance/CMakeFiles/obj.clangTidyPerformanceModule.dir/UnnecessaryCopyInitializationCheck.cpp.o -c /home/gha/actions-runner/_work/llvm-project/llvm-project/clang-tools-extra/clang-tidy/performance/UnnecessaryCopyInitializationCheck.cpp
In file included from /home/gha/actions-runner/_work/llvm-project/llvm-project/clang-tools-extra/clang-tidy/performance/UnnecessaryCopyInitializationCheck.cpp:12:
/home/gha/actions-runner/_work/llvm-project/llvm-project/clang-tools-extra/clang-tidy/performance/../utils/LexerUtils.h:15:10: fatal error: 'clang/basic/SourceManager.h' file not found
15 | #include "clang/basic/SourceManager.h"
|          ^~~~~~~~~~~~~~~~~~~~~~~~~~~~~
1 error generated.
```
</details>
<details>
<summary>tools/clang/tools/extra/clang-tidy/performance/CMakeFiles/obj.clangTidyPerformanceModule.dir/TriviallyDestructibleCheck.cpp.o</summary>

```
FAILED: tools/clang/tools/extra/clang-tidy/performance/CMakeFiles/obj.clangTidyPerformanceModule.dir/TriviallyDestructibleCheck.cpp.o
sccache /opt/llvm/bin/clang++ -DGTEST_HAS_RTTI=0 -D_DEBUG -D_GLIBCXX_ASSERTIONS -D_GLIBCXX_USE_CXX11_ABI=1 -D_GNU_SOURCE -D__STDC_CONSTANT_MACROS -D__STDC_FORMAT_MACROS -D__STDC_LIMIT_MACROS -I/home/gha/actions-runner/_work/llvm-project/llvm-project/build/tools/clang/tools/extra/clang-tidy/performance -I/home/gha/actions-runner/_work/llvm-project/llvm-project/clang-tools-extra/clang-tidy/performance -I/home/gha/actions-runner/_work/llvm-project/llvm-project/build/tools/clang/tools/extra/clang-tidy -I/home/gha/actions-runner/_work/llvm-project/llvm-project/clang/include -I/home/gha/actions-runner/_work/llvm-project/llvm-project/build/tools/clang/include -I/home/gha/actions-runner/_work/llvm-project/llvm-project/build/include -I/home/gha/actions-runner/_work/llvm-project/llvm-project/llvm/include -gmlt -fPIC -fno-semantic-interposition -fvisibility-inlines-hidden -Werror -Werror=date-time -Werror=unguarded-availability-new -Wall -Wextra -Wno-unused-parameter -Wwrite-strings -Wcast-qual -Wmissing-field-initializers -pedantic -Wno-long-long -Wc++98-compat-extra-semi -Wimplicit-fallthrough -Wcovered-switch-default -Wno-noexcept-type -Wnon-virtual-dtor -Wdelete-non-virtual-dtor -Wsuggest-override -Wstring-conversion -Wno-pass-failed -Wmisleading-indentation -Wctad-maybe-unsupported -fdiagnostics-color -ffunction-sections -fdata-sections -fno-common -Woverloaded-virtual -Wno-nested-anon-types -O3 -DNDEBUG -std=c++17  -fno-exceptions -funwind-tables -fno-rtti -UNDEBUG -MD -MT tools/clang/tools/extra/clang-tidy/performance/CMakeFiles/obj.clangTidyPerformanceModule.dir/TriviallyDestructibleCheck.cpp.o -MF tools/clang/tools/extra/clang-tidy/performance/CMakeFiles/obj.clangTidyPerformanceModule.dir/TriviallyDestructibleCheck.cpp.o.d -o tools/clang/tools/extra/clang-tidy/performance/CMakeFiles/obj.clangTidyPerformanceModule.dir/TriviallyDestructibleCheck.cpp.o -c /home/gha/actions-runner/_work/llvm-project/llvm-project/clang-tools-extra/clang-tidy/performance/TriviallyDestructibleCheck.cpp
In file included from /home/gha/actions-runner/_work/llvm-project/llvm-project/clang-tools-extra/clang-tidy/performance/TriviallyDestructibleCheck.cpp:10:
/home/gha/actions-runner/_work/llvm-project/llvm-project/clang-tools-extra/clang-tidy/performance/../utils/LexerUtils.h:15:10: fatal error: 'clang/basic/SourceManager.h' file not found
15 | #include "clang/basic/SourceManager.h"
|          ^~~~~~~~~~~~~~~~~~~~~~~~~~~~~
1 error generated.
```
</details>
<details>
<summary>tools/clang/tools/extra/clang-tidy/readability/CMakeFiles/obj.clangTidyReadabilityModule.dir/AvoidReturnWithVoidValueCheck.cpp.o</summary>

```
FAILED: tools/clang/tools/extra/clang-tidy/readability/CMakeFiles/obj.clangTidyReadabilityModule.dir/AvoidReturnWithVoidValueCheck.cpp.o
sccache /opt/llvm/bin/clang++ -DGTEST_HAS_RTTI=0 -D_DEBUG -D_GLIBCXX_ASSERTIONS -D_GLIBCXX_USE_CXX11_ABI=1 -D_GNU_SOURCE -D__STDC_CONSTANT_MACROS -D__STDC_FORMAT_MACROS -D__STDC_LIMIT_MACROS -I/home/gha/actions-runner/_work/llvm-project/llvm-project/build/tools/clang/tools/extra/clang-tidy/readability -I/home/gha/actions-runner/_work/llvm-project/llvm-project/clang-tools-extra/clang-tidy/readability -I/home/gha/actions-runner/_work/llvm-project/llvm-project/build/tools/clang/tools/extra/clang-tidy -I/home/gha/actions-runner/_work/llvm-project/llvm-project/clang/include -I/home/gha/actions-runner/_work/llvm-project/llvm-project/build/tools/clang/include -I/home/gha/actions-runner/_work/llvm-project/llvm-project/build/include -I/home/gha/actions-runner/_work/llvm-project/llvm-project/llvm/include -gmlt -fPIC -fno-semantic-interposition -fvisibility-inlines-hidden -Werror -Werror=date-time -Werror=unguarded-availability-new -Wall -Wextra -Wno-unused-parameter -Wwrite-strings -Wcast-qual -Wmissing-field-initializers -pedantic -Wno-long-long -Wc++98-compat-extra-semi -Wimplicit-fallthrough -Wcovered-switch-default -Wno-noexcept-type -Wnon-virtual-dtor -Wdelete-non-virtual-dtor -Wsuggest-override -Wstring-conversion -Wno-pass-failed -Wmisleading-indentation -Wctad-maybe-unsupported -fdiagnostics-color -ffunction-sections -fdata-sections -fno-common -Woverloaded-virtual -Wno-nested-anon-types -O3 -DNDEBUG -std=c++17  -fno-exceptions -funwind-tables -fno-rtti -UNDEBUG -MD -MT tools/clang/tools/extra/clang-tidy/readability/CMakeFiles/obj.clangTidyReadabilityModule.dir/AvoidReturnWithVoidValueCheck.cpp.o -MF tools/clang/tools/extra/clang-tidy/readability/CMakeFiles/obj.clangTidyReadabilityModule.dir/AvoidReturnWithVoidValueCheck.cpp.o.d -o tools/clang/tools/extra/clang-tidy/readability/CMakeFiles/obj.clangTidyReadabilityModule.dir/AvoidReturnWithVoidValueCheck.cpp.o -c /home/gha/actions-runner/_work/llvm-project/llvm-project/clang-tools-extra/clang-tidy/readability/AvoidReturnWithVoidValueCheck.cpp
In file included from /home/gha/actions-runner/_work/llvm-project/llvm-project/clang-tools-extra/clang-tidy/readability/AvoidReturnWithVoidValueCheck.cpp:11:
/home/gha/actions-runner/_work/llvm-project/llvm-project/clang-tools-extra/clang-tidy/readability/../utils/LexerUtils.h:15:10: fatal error: 'clang/basic/SourceManager.h' file not found
15 | #include "clang/basic/SourceManager.h"
|          ^~~~~~~~~~~~~~~~~~~~~~~~~~~~~
1 error generated.
```
</details>
<details>
<summary>tools/clang/tools/extra/clang-tidy/readability/CMakeFiles/obj.clangTidyReadabilityModule.dir/AvoidConstParamsInDeclsCheck.cpp.o</summary>

```
FAILED: tools/clang/tools/extra/clang-tidy/readability/CMakeFiles/obj.clangTidyReadabilityModule.dir/AvoidConstParamsInDeclsCheck.cpp.o
sccache /opt/llvm/bin/clang++ -DGTEST_HAS_RTTI=0 -D_DEBUG -D_GLIBCXX_ASSERTIONS -D_GLIBCXX_USE_CXX11_ABI=1 -D_GNU_SOURCE -D__STDC_CONSTANT_MACROS -D__STDC_FORMAT_MACROS -D__STDC_LIMIT_MACROS -I/home/gha/actions-runner/_work/llvm-project/llvm-project/build/tools/clang/tools/extra/clang-tidy/readability -I/home/gha/actions-runner/_work/llvm-project/llvm-project/clang-tools-extra/clang-tidy/readability -I/home/gha/actions-runner/_work/llvm-project/llvm-project/build/tools/clang/tools/extra/clang-tidy -I/home/gha/actions-runner/_work/llvm-project/llvm-project/clang/include -I/home/gha/actions-runner/_work/llvm-project/llvm-project/build/tools/clang/include -I/home/gha/actions-runner/_work/llvm-project/llvm-project/build/include -I/home/gha/actions-runner/_work/llvm-project/llvm-project/llvm/include -gmlt -fPIC -fno-semantic-interposition -fvisibility-inlines-hidden -Werror -Werror=date-time -Werror=unguarded-availability-new -Wall -Wextra -Wno-unused-parameter -Wwrite-strings -Wcast-qual -Wmissing-field-initializers -pedantic -Wno-long-long -Wc++98-compat-extra-semi -Wimplicit-fallthrough -Wcovered-switch-default -Wno-noexcept-type -Wnon-virtual-dtor -Wdelete-non-virtual-dtor -Wsuggest-override -Wstring-conversion -Wno-pass-failed -Wmisleading-indentation -Wctad-maybe-unsupported -fdiagnostics-color -ffunction-sections -fdata-sections -fno-common -Woverloaded-virtual -Wno-nested-anon-types -O3 -DNDEBUG -std=c++17  -fno-exceptions -funwind-tables -fno-rtti -UNDEBUG -MD -MT tools/clang/tools/extra/clang-tidy/readability/CMakeFiles/obj.clangTidyReadabilityModule.dir/AvoidConstParamsInDeclsCheck.cpp.o -MF tools/clang/tools/extra/clang-tidy/readability/CMakeFiles/obj.clangTidyReadabilityModule.dir/AvoidConstParamsInDeclsCheck.cpp.o.d -o tools/clang/tools/extra/clang-tidy/readability/CMakeFiles/obj.clangTidyReadabilityModule.dir/AvoidConstParamsInDeclsCheck.cpp.o -c /home/gha/actions-runner/_work/llvm-project/llvm-project/clang-tools-extra/clang-tidy/readability/AvoidConstParamsInDeclsCheck.cpp
In file included from /home/gha/actions-runner/_work/llvm-project/llvm-project/clang-tools-extra/clang-tidy/readability/AvoidConstParamsInDeclsCheck.cpp:10:
/home/gha/actions-runner/_work/llvm-project/llvm-project/clang-tools-extra/clang-tidy/readability/../utils/LexerUtils.h:15:10: fatal error: 'clang/basic/SourceManager.h' file not found
15 | #include "clang/basic/SourceManager.h"
|          ^~~~~~~~~~~~~~~~~~~~~~~~~~~~~
1 error generated.
```
</details>
<details>
<summary>tools/clang/tools/extra/clang-tidy/readability/CMakeFiles/obj.clangTidyReadabilityModule.dir/BracesAroundStatementsCheck.cpp.o</summary>

```
FAILED: tools/clang/tools/extra/clang-tidy/readability/CMakeFiles/obj.clangTidyReadabilityModule.dir/BracesAroundStatementsCheck.cpp.o
sccache /opt/llvm/bin/clang++ -DGTEST_HAS_RTTI=0 -D_DEBUG -D_GLIBCXX_ASSERTIONS -D_GLIBCXX_USE_CXX11_ABI=1 -D_GNU_SOURCE -D__STDC_CONSTANT_MACROS -D__STDC_FORMAT_MACROS -D__STDC_LIMIT_MACROS -I/home/gha/actions-runner/_work/llvm-project/llvm-project/build/tools/clang/tools/extra/clang-tidy/readability -I/home/gha/actions-runner/_work/llvm-project/llvm-project/clang-tools-extra/clang-tidy/readability -I/home/gha/actions-runner/_work/llvm-project/llvm-project/build/tools/clang/tools/extra/clang-tidy -I/home/gha/actions-runner/_work/llvm-project/llvm-project/clang/include -I/home/gha/actions-runner/_work/llvm-project/llvm-project/build/tools/clang/include -I/home/gha/actions-runner/_work/llvm-project/llvm-project/build/include -I/home/gha/actions-runner/_work/llvm-project/llvm-project/llvm/include -gmlt -fPIC -fno-semantic-interposition -fvisibility-inlines-hidden -Werror -Werror=date-time -Werror=unguarded-availability-new -Wall -Wextra -Wno-unused-parameter -Wwrite-strings -Wcast-qual -Wmissing-field-initializers -pedantic -Wno-long-long -Wc++98-compat-extra-semi -Wimplicit-fallthrough -Wcovered-switch-default -Wno-noexcept-type -Wnon-virtual-dtor -Wdelete-non-virtual-dtor -Wsuggest-override -Wstring-conversion -Wno-pass-failed -Wmisleading-indentation -Wctad-maybe-unsupported -fdiagnostics-color -ffunction-sections -fdata-sections -fno-common -Woverloaded-virtual -Wno-nested-anon-types -O3 -DNDEBUG -std=c++17  -fno-exceptions -funwind-tables -fno-rtti -UNDEBUG -MD -MT tools/clang/tools/extra/clang-tidy/readability/CMakeFiles/obj.clangTidyReadabilityModule.dir/BracesAroundStatementsCheck.cpp.o -MF tools/clang/tools/extra/clang-tidy/readability/CMakeFiles/obj.clangTidyReadabilityModule.dir/BracesAroundStatementsCheck.cpp.o.d -o tools/clang/tools/extra/clang-tidy/readability/CMakeFiles/obj.clangTidyReadabilityModule.dir/BracesAroundStatementsCheck.cpp.o -c /home/gha/actions-runner/_work/llvm-project/llvm-project/clang-tools-extra/clang-tidy/readability/BracesAroundStatementsCheck.cpp
In file included from /home/gha/actions-runner/_work/llvm-project/llvm-project/clang-tools-extra/clang-tidy/readability/BracesAroundStatementsCheck.cpp:11:
/home/gha/actions-runner/_work/llvm-project/llvm-project/clang-tools-extra/clang-tidy/readability/../utils/LexerUtils.h:15:10: fatal error: 'clang/basic/SourceManager.h' file not found
15 | #include "clang/basic/SourceManager.h"
|          ^~~~~~~~~~~~~~~~~~~~~~~~~~~~~
1 error generated.
```
</details>
<details>
<summary>tools/clang/tools/extra/clang-tidy/readability/CMakeFiles/obj.clangTidyReadabilityModule.dir/ConstReturnTypeCheck.cpp.o</summary>

```
FAILED: tools/clang/tools/extra/clang-tidy/readability/CMakeFiles/obj.clangTidyReadabilityModule.dir/ConstReturnTypeCheck.cpp.o
sccache /opt/llvm/bin/clang++ -DGTEST_HAS_RTTI=0 -D_DEBUG -D_GLIBCXX_ASSERTIONS -D_GLIBCXX_USE_CXX11_ABI=1 -D_GNU_SOURCE -D__STDC_CONSTANT_MACROS -D__STDC_FORMAT_MACROS -D__STDC_LIMIT_MACROS -I/home/gha/actions-runner/_work/llvm-project/llvm-project/build/tools/clang/tools/extra/clang-tidy/readability -I/home/gha/actions-runner/_work/llvm-project/llvm-project/clang-tools-extra/clang-tidy/readability -I/home/gha/actions-runner/_work/llvm-project/llvm-project/build/tools/clang/tools/extra/clang-tidy -I/home/gha/actions-runner/_work/llvm-project/llvm-project/clang/include -I/home/gha/actions-runner/_work/llvm-project/llvm-project/build/tools/clang/include -I/home/gha/actions-runner/_work/llvm-project/llvm-project/build/include -I/home/gha/actions-runner/_work/llvm-project/llvm-project/llvm/include -gmlt -fPIC -fno-semantic-interposition -fvisibility-inlines-hidden -Werror -Werror=date-time -Werror=unguarded-availability-new -Wall -Wextra -Wno-unused-parameter -Wwrite-strings -Wcast-qual -Wmissing-field-initializers -pedantic -Wno-long-long -Wc++98-compat-extra-semi -Wimplicit-fallthrough -Wcovered-switch-default -Wno-noexcept-type -Wnon-virtual-dtor -Wdelete-non-virtual-dtor -Wsuggest-override -Wstring-conversion -Wno-pass-failed -Wmisleading-indentation -Wctad-maybe-unsupported -fdiagnostics-color -ffunction-sections -fdata-sections -fno-common -Woverloaded-virtual -Wno-nested-anon-types -O3 -DNDEBUG -std=c++17  -fno-exceptions -funwind-tables -fno-rtti -UNDEBUG -MD -MT tools/clang/tools/extra/clang-tidy/readability/CMakeFiles/obj.clangTidyReadabilityModule.dir/ConstReturnTypeCheck.cpp.o -MF tools/clang/tools/extra/clang-tidy/readability/CMakeFiles/obj.clangTidyReadabilityModule.dir/ConstReturnTypeCheck.cpp.o.d -o tools/clang/tools/extra/clang-tidy/readability/CMakeFiles/obj.clangTidyReadabilityModule.dir/ConstReturnTypeCheck.cpp.o -c /home/gha/actions-runner/_work/llvm-project/llvm-project/clang-tools-extra/clang-tidy/readability/ConstReturnTypeCheck.cpp
In file included from /home/gha/actions-runner/_work/llvm-project/llvm-project/clang-tools-extra/clang-tidy/readability/ConstReturnTypeCheck.cpp:10:
/home/gha/actions-runner/_work/llvm-project/llvm-project/clang-tools-extra/clang-tidy/readability/../utils/LexerUtils.h:15:10: fatal error: 'clang/basic/SourceManager.h' file not found
15 | #include "clang/basic/SourceManager.h"
|          ^~~~~~~~~~~~~~~~~~~~~~~~~~~~~
1 error generated.
```
</details>
<details>
<summary>tools/clang/tools/extra/clang-tidy/readability/CMakeFiles/obj.clangTidyReadabilityModule.dir/DeleteNullPointerCheck.cpp.o</summary>

```
FAILED: tools/clang/tools/extra/clang-tidy/readability/CMakeFiles/obj.clangTidyReadabilityModule.dir/DeleteNullPointerCheck.cpp.o
sccache /opt/llvm/bin/clang++ -DGTEST_HAS_RTTI=0 -D_DEBUG -D_GLIBCXX_ASSERTIONS -D_GLIBCXX_USE_CXX11_ABI=1 -D_GNU_SOURCE -D__STDC_CONSTANT_MACROS -D__STDC_FORMAT_MACROS -D__STDC_LIMIT_MACROS -I/home/gha/actions-runner/_work/llvm-project/llvm-project/build/tools/clang/tools/extra/clang-tidy/readability -I/home/gha/actions-runner/_work/llvm-project/llvm-project/clang-tools-extra/clang-tidy/readability -I/home/gha/actions-runner/_work/llvm-project/llvm-project/build/tools/clang/tools/extra/clang-tidy -I/home/gha/actions-runner/_work/llvm-project/llvm-project/clang/include -I/home/gha/actions-runner/_work/llvm-project/llvm-project/build/tools/clang/include -I/home/gha/actions-runner/_work/llvm-project/llvm-project/build/include -I/home/gha/actions-runner/_work/llvm-project/llvm-project/llvm/include -gmlt -fPIC -fno-semantic-interposition -fvisibility-inlines-hidden -Werror -Werror=date-time -Werror=unguarded-availability-new -Wall -Wextra -Wno-unused-parameter -Wwrite-strings -Wcast-qual -Wmissing-field-initializers -pedantic -Wno-long-long -Wc++98-compat-extra-semi -Wimplicit-fallthrough -Wcovered-switch-default -Wno-noexcept-type -Wnon-virtual-dtor -Wdelete-non-virtual-dtor -Wsuggest-override -Wstring-conversion -Wno-pass-failed -Wmisleading-indentation -Wctad-maybe-unsupported -fdiagnostics-color -ffunction-sections -fdata-sections -fno-common -Woverloaded-virtual -Wno-nested-anon-types -O3 -DNDEBUG -std=c++17  -fno-exceptions -funwind-tables -fno-rtti -UNDEBUG -MD -MT tools/clang/tools/extra/clang-tidy/readability/CMakeFiles/obj.clangTidyReadabilityModule.dir/DeleteNullPointerCheck.cpp.o -MF tools/clang/tools/extra/clang-tidy/readability/CMakeFiles/obj.clangTidyReadabilityModule.dir/DeleteNullPointerCheck.cpp.o.d -o tools/clang/tools/extra/clang-tidy/readability/CMakeFiles/obj.clangTidyReadabilityModule.dir/DeleteNullPointerCheck.cpp.o -c /home/gha/actions-runner/_work/llvm-project/llvm-project/clang-tools-extra/clang-tidy/readability/DeleteNullPointerCheck.cpp
In file included from /home/gha/actions-runner/_work/llvm-project/llvm-project/clang-tools-extra/clang-tidy/readability/DeleteNullPointerCheck.cpp:10:
/home/gha/actions-runner/_work/llvm-project/llvm-project/clang-tools-extra/clang-tidy/readability/../utils/LexerUtils.h:15:10: fatal error: 'clang/basic/SourceManager.h' file not found
15 | #include "clang/basic/SourceManager.h"
|          ^~~~~~~~~~~~~~~~~~~~~~~~~~~~~
1 error generated.
```
</details>
<details>
<summary>tools/clang/tools/extra/clang-tidy/readability/CMakeFiles/obj.clangTidyReadabilityModule.dir/EnumInitialValueCheck.cpp.o</summary>

```
FAILED: tools/clang/tools/extra/clang-tidy/readability/CMakeFiles/obj.clangTidyReadabilityModule.dir/EnumInitialValueCheck.cpp.o
sccache /opt/llvm/bin/clang++ -DGTEST_HAS_RTTI=0 -D_DEBUG -D_GLIBCXX_ASSERTIONS -D_GLIBCXX_USE_CXX11_ABI=1 -D_GNU_SOURCE -D__STDC_CONSTANT_MACROS -D__STDC_FORMAT_MACROS -D__STDC_LIMIT_MACROS -I/home/gha/actions-runner/_work/llvm-project/llvm-project/build/tools/clang/tools/extra/clang-tidy/readability -I/home/gha/actions-runner/_work/llvm-project/llvm-project/clang-tools-extra/clang-tidy/readability -I/home/gha/actions-runner/_work/llvm-project/llvm-project/build/tools/clang/tools/extra/clang-tidy -I/home/gha/actions-runner/_work/llvm-project/llvm-project/clang/include -I/home/gha/actions-runner/_work/llvm-project/llvm-project/build/tools/clang/include -I/home/gha/actions-runner/_work/llvm-project/llvm-project/build/include -I/home/gha/actions-runner/_work/llvm-project/llvm-project/llvm/include -gmlt -fPIC -fno-semantic-interposition -fvisibility-inlines-hidden -Werror -Werror=date-time -Werror=unguarded-availability-new -Wall -Wextra -Wno-unused-parameter -Wwrite-strings -Wcast-qual -Wmissing-field-initializers -pedantic -Wno-long-long -Wc++98-compat-extra-semi -Wimplicit-fallthrough -Wcovered-switch-default -Wno-noexcept-type -Wnon-virtual-dtor -Wdelete-non-virtual-dtor -Wsuggest-override -Wstring-conversion -Wno-pass-failed -Wmisleading-indentation -Wctad-maybe-unsupported -fdiagnostics-color -ffunction-sections -fdata-sections -fno-common -Woverloaded-virtual -Wno-nested-anon-types -O3 -DNDEBUG -std=c++17  -fno-exceptions -funwind-tables -fno-rtti -UNDEBUG -MD -MT tools/clang/tools/extra/clang-tidy/readability/CMakeFiles/obj.clangTidyReadabilityModule.dir/EnumInitialValueCheck.cpp.o -MF tools/clang/tools/extra/clang-tidy/readability/CMakeFiles/obj.clangTidyReadabilityModule.dir/EnumInitialValueCheck.cpp.o.d -o tools/clang/tools/extra/clang-tidy/readability/CMakeFiles/obj.clangTidyReadabilityModule.dir/EnumInitialValueCheck.cpp.o -c /home/gha/actions-runner/_work/llvm-project/llvm-project/clang-tools-extra/clang-tidy/readability/EnumInitialValueCheck.cpp
In file included from /home/gha/actions-runner/_work/llvm-project/llvm-project/clang-tools-extra/clang-tidy/readability/EnumInitialValueCheck.cpp:10:
/home/gha/actions-runner/_work/llvm-project/llvm-project/clang-tools-extra/clang-tidy/readability/../utils/LexerUtils.h:15:10: fatal error: 'clang/basic/SourceManager.h' file not found
15 | #include "clang/basic/SourceManager.h"
|          ^~~~~~~~~~~~~~~~~~~~~~~~~~~~~
1 error generated.
```
</details>
<details>
<summary>tools/clang/tools/extra/clang-tidy/readability/CMakeFiles/obj.clangTidyReadabilityModule.dir/IsolateDeclarationCheck.cpp.o</summary>

```
FAILED: tools/clang/tools/extra/clang-tidy/readability/CMakeFiles/obj.clangTidyReadabilityModule.dir/IsolateDeclarationCheck.cpp.o
sccache /opt/llvm/bin/clang++ -DGTEST_HAS_RTTI=0 -D_DEBUG -D_GLIBCXX_ASSERTIONS -D_GLIBCXX_USE_CXX11_ABI=1 -D_GNU_SOURCE -D__STDC_CONSTANT_MACROS -D__STDC_FORMAT_MACROS -D__STDC_LIMIT_MACROS -I/home/gha/actions-runner/_work/llvm-project/llvm-project/build/tools/clang/tools/extra/clang-tidy/readability -I/home/gha/actions-runner/_work/llvm-project/llvm-project/clang-tools-extra/clang-tidy/readability -I/home/gha/actions-runner/_work/llvm-project/llvm-project/build/tools/clang/tools/extra/clang-tidy -I/home/gha/actions-runner/_work/llvm-project/llvm-project/clang/include -I/home/gha/actions-runner/_work/llvm-project/llvm-project/build/tools/clang/include -I/home/gha/actions-runner/_work/llvm-project/llvm-project/build/include -I/home/gha/actions-runner/_work/llvm-project/llvm-project/llvm/include -gmlt -fPIC -fno-semantic-interposition -fvisibility-inlines-hidden -Werror -Werror=date-time -Werror=unguarded-availability-new -Wall -Wextra -Wno-unused-parameter -Wwrite-strings -Wcast-qual -Wmissing-field-initializers -pedantic -Wno-long-long -Wc++98-compat-extra-semi -Wimplicit-fallthrough -Wcovered-switch-default -Wno-noexcept-type -Wnon-virtual-dtor -Wdelete-non-virtual-dtor -Wsuggest-override -Wstring-conversion -Wno-pass-failed -Wmisleading-indentation -Wctad-maybe-unsupported -fdiagnostics-color -ffunction-sections -fdata-sections -fno-common -Woverloaded-virtual -Wno-nested-anon-types -O3 -DNDEBUG -std=c++17  -fno-exceptions -funwind-tables -fno-rtti -UNDEBUG -MD -MT tools/clang/tools/extra/clang-tidy/readability/CMakeFiles/obj.clangTidyReadabilityModule.dir/IsolateDeclarationCheck.cpp.o -MF tools/clang/tools/extra/clang-tidy/readability/CMakeFiles/obj.clangTidyReadabilityModule.dir/IsolateDeclarationCheck.cpp.o.d -o tools/clang/tools/extra/clang-tidy/readability/CMakeFiles/obj.clangTidyReadabilityModule.dir/IsolateDeclarationCheck.cpp.o -c /home/gha/actions-runner/_work/llvm-project/llvm-project/clang-tools-extra/clang-tidy/readability/IsolateDeclarationCheck.cpp
In file included from /home/gha/actions-runner/_work/llvm-project/llvm-project/clang-tools-extra/clang-tidy/readability/IsolateDeclarationCheck.cpp:10:
/home/gha/actions-runner/_work/llvm-project/llvm-project/clang-tools-extra/clang-tidy/readability/../utils/LexerUtils.h:15:10: fatal error: 'clang/basic/SourceManager.h' file not found
15 | #include "clang/basic/SourceManager.h"
|          ^~~~~~~~~~~~~~~~~~~~~~~~~~~~~
1 error generated.
```
</details>
<details>
<summary>tools/clang/tools/extra/clang-tidy/readability/CMakeFiles/obj.clangTidyReadabilityModule.dir/NamespaceCommentCheck.cpp.o</summary>

```
FAILED: tools/clang/tools/extra/clang-tidy/readability/CMakeFiles/obj.clangTidyReadabilityModule.dir/NamespaceCommentCheck.cpp.o
sccache /opt/llvm/bin/clang++ -DGTEST_HAS_RTTI=0 -D_DEBUG -D_GLIBCXX_ASSERTIONS -D_GLIBCXX_USE_CXX11_ABI=1 -D_GNU_SOURCE -D__STDC_CONSTANT_MACROS -D__STDC_FORMAT_MACROS -D__STDC_LIMIT_MACROS -I/home/gha/actions-runner/_work/llvm-project/llvm-project/build/tools/clang/tools/extra/clang-tidy/readability -I/home/gha/actions-runner/_work/llvm-project/llvm-project/clang-tools-extra/clang-tidy/readability -I/home/gha/actions-runner/_work/llvm-project/llvm-project/build/tools/clang/tools/extra/clang-tidy -I/home/gha/actions-runner/_work/llvm-project/llvm-project/clang/include -I/home/gha/actions-runner/_work/llvm-project/llvm-project/build/tools/clang/include -I/home/gha/actions-runner/_work/llvm-project/llvm-project/build/include -I/home/gha/actions-runner/_work/llvm-project/llvm-project/llvm/include -gmlt -fPIC -fno-semantic-interposition -fvisibility-inlines-hidden -Werror -Werror=date-time -Werror=unguarded-availability-new -Wall -Wextra -Wno-unused-parameter -Wwrite-strings -Wcast-qual -Wmissing-field-initializers -pedantic -Wno-long-long -Wc++98-compat-extra-semi -Wimplicit-fallthrough -Wcovered-switch-default -Wno-noexcept-type -Wnon-virtual-dtor -Wdelete-non-virtual-dtor -Wsuggest-override -Wstring-conversion -Wno-pass-failed -Wmisleading-indentation -Wctad-maybe-unsupported -fdiagnostics-color -ffunction-sections -fdata-sections -fno-common -Woverloaded-virtual -Wno-nested-anon-types -O3 -DNDEBUG -std=c++17  -fno-exceptions -funwind-tables -fno-rtti -UNDEBUG -MD -MT tools/clang/tools/extra/clang-tidy/readability/CMakeFiles/obj.clangTidyReadabilityModule.dir/NamespaceCommentCheck.cpp.o -MF tools/clang/tools/extra/clang-tidy/readability/CMakeFiles/obj.clangTidyReadabilityModule.dir/NamespaceCommentCheck.cpp.o.d -o tools/clang/tools/extra/clang-tidy/readability/CMakeFiles/obj.clangTidyReadabilityModule.dir/NamespaceCommentCheck.cpp.o -c /home/gha/actions-runner/_work/llvm-project/llvm-project/clang-tools-extra/clang-tidy/readability/NamespaceCommentCheck.cpp
In file included from /home/gha/actions-runner/_work/llvm-project/llvm-project/clang-tools-extra/clang-tidy/readability/NamespaceCommentCheck.cpp:10:
/home/gha/actions-runner/_work/llvm-project/llvm-project/clang-tools-extra/clang-tidy/readability/../utils/LexerUtils.h:15:10: fatal error: 'clang/basic/SourceManager.h' file not found
15 | #include "clang/basic/SourceManager.h"
|          ^~~~~~~~~~~~~~~~~~~~~~~~~~~~~
1 error generated.
```
</details>
<details>
<summary>tools/clang/tools/extra/clang-tidy/readability/CMakeFiles/obj.clangTidyReadabilityModule.dir/MisleadingIndentationCheck.cpp.o</summary>

```
FAILED: tools/clang/tools/extra/clang-tidy/readability/CMakeFiles/obj.clangTidyReadabilityModule.dir/MisleadingIndentationCheck.cpp.o
sccache /opt/llvm/bin/clang++ -DGTEST_HAS_RTTI=0 -D_DEBUG -D_GLIBCXX_ASSERTIONS -D_GLIBCXX_USE_CXX11_ABI=1 -D_GNU_SOURCE -D__STDC_CONSTANT_MACROS -D__STDC_FORMAT_MACROS -D__STDC_LIMIT_MACROS -I/home/gha/actions-runner/_work/llvm-project/llvm-project/build/tools/clang/tools/extra/clang-tidy/readability -I/home/gha/actions-runner/_work/llvm-project/llvm-project/clang-tools-extra/clang-tidy/readability -I/home/gha/actions-runner/_work/llvm-project/llvm-project/build/tools/clang/tools/extra/clang-tidy -I/home/gha/actions-runner/_work/llvm-project/llvm-project/clang/include -I/home/gha/actions-runner/_work/llvm-project/llvm-project/build/tools/clang/include -I/home/gha/actions-runner/_work/llvm-project/llvm-project/build/include -I/home/gha/actions-runner/_work/llvm-project/llvm-project/llvm/include -gmlt -fPIC -fno-semantic-interposition -fvisibility-inlines-hidden -Werror -Werror=date-time -Werror=unguarded-availability-new -Wall -Wextra -Wno-unused-parameter -Wwrite-strings -Wcast-qual -Wmissing-field-initializers -pedantic -Wno-long-long -Wc++98-compat-extra-semi -Wimplicit-fallthrough -Wcovered-switch-default -Wno-noexcept-type -Wnon-virtual-dtor -Wdelete-non-virtual-dtor -Wsuggest-override -Wstring-conversion -Wno-pass-failed -Wmisleading-indentation -Wctad-maybe-unsupported -fdiagnostics-color -ffunction-sections -fdata-sections -fno-common -Woverloaded-virtual -Wno-nested-anon-types -O3 -DNDEBUG -std=c++17  -fno-exceptions -funwind-tables -fno-rtti -UNDEBUG -MD -MT tools/clang/tools/extra/clang-tidy/readability/CMakeFiles/obj.clangTidyReadabilityModule.dir/MisleadingIndentationCheck.cpp.o -MF tools/clang/tools/extra/clang-tidy/readability/CMakeFiles/obj.clangTidyReadabilityModule.dir/MisleadingIndentationCheck.cpp.o.d -o tools/clang/tools/extra/clang-tidy/readability/CMakeFiles/obj.clangTidyReadabilityModule.dir/MisleadingIndentationCheck.cpp.o -c /home/gha/actions-runner/_work/llvm-project/llvm-project/clang-tools-extra/clang-tidy/readability/MisleadingIndentationCheck.cpp
In file included from /home/gha/actions-runner/_work/llvm-project/llvm-project/clang-tools-extra/clang-tidy/readability/MisleadingIndentationCheck.cpp:10:
/home/gha/actions-runner/_work/llvm-project/llvm-project/clang-tools-extra/clang-tidy/readability/../utils/LexerUtils.h:15:10: fatal error: 'clang/basic/SourceManager.h' file not found
15 | #include "clang/basic/SourceManager.h"
|          ^~~~~~~~~~~~~~~~~~~~~~~~~~~~~
1 error generated.
```
</details>
<details>
<summary>tools/clang/tools/extra/clang-tidy/readability/CMakeFiles/obj.clangTidyReadabilityModule.dir/QualifiedAutoCheck.cpp.o</summary>

```
FAILED: tools/clang/tools/extra/clang-tidy/readability/CMakeFiles/obj.clangTidyReadabilityModule.dir/QualifiedAutoCheck.cpp.o
sccache /opt/llvm/bin/clang++ -DGTEST_HAS_RTTI=0 -D_DEBUG -D_GLIBCXX_ASSERTIONS -D_GLIBCXX_USE_CXX11_ABI=1 -D_GNU_SOURCE -D__STDC_CONSTANT_MACROS -D__STDC_FORMAT_MACROS -D__STDC_LIMIT_MACROS -I/home/gha/actions-runner/_work/llvm-project/llvm-project/build/tools/clang/tools/extra/clang-tidy/readability -I/home/gha/actions-runner/_work/llvm-project/llvm-project/clang-tools-extra/clang-tidy/readability -I/home/gha/actions-runner/_work/llvm-project/llvm-project/build/tools/clang/tools/extra/clang-tidy -I/home/gha/actions-runner/_work/llvm-project/llvm-project/clang/include -I/home/gha/actions-runner/_work/llvm-project/llvm-project/build/tools/clang/include -I/home/gha/actions-runner/_work/llvm-project/llvm-project/build/include -I/home/gha/actions-runner/_work/llvm-project/llvm-project/llvm/include -gmlt -fPIC -fno-semantic-interposition -fvisibility-inlines-hidden -Werror -Werror=date-time -Werror=unguarded-availability-new -Wall -Wextra -Wno-unused-parameter -Wwrite-strings -Wcast-qual -Wmissing-field-initializers -pedantic -Wno-long-long -Wc++98-compat-extra-semi -Wimplicit-fallthrough -Wcovered-switch-default -Wno-noexcept-type -Wnon-virtual-dtor -Wdelete-non-virtual-dtor -Wsuggest-override -Wstring-conversion -Wno-pass-failed -Wmisleading-indentation -Wctad-maybe-unsupported -fdiagnostics-color -ffunction-sections -fdata-sections -fno-common -Woverloaded-virtual -Wno-nested-anon-types -O3 -DNDEBUG -std=c++17  -fno-exceptions -funwind-tables -fno-rtti -UNDEBUG -MD -MT tools/clang/tools/extra/clang-tidy/readability/CMakeFiles/obj.clangTidyReadabilityModule.dir/QualifiedAutoCheck.cpp.o -MF tools/clang/tools/extra/clang-tidy/readability/CMakeFiles/obj.clangTidyReadabilityModule.dir/QualifiedAutoCheck.cpp.o.d -o tools/clang/tools/extra/clang-tidy/readability/CMakeFiles/obj.clangTidyReadabilityModule.dir/QualifiedAutoCheck.cpp.o -c /home/gha/actions-runner/_work/llvm-project/llvm-project/clang-tools-extra/clang-tidy/readability/QualifiedAutoCheck.cpp
In file included from /home/gha/actions-runner/_work/llvm-project/llvm-project/clang-tools-extra/clang-tidy/readability/QualifiedAutoCheck.cpp:10:
/home/gha/actions-runner/_work/llvm-project/llvm-project/clang-tools-extra/clang-tidy/readability/../utils/LexerUtils.h:15:10: fatal error: 'clang/basic/SourceManager.h' file not found
15 | #include "clang/basic/SourceManager.h"
|          ^~~~~~~~~~~~~~~~~~~~~~~~~~~~~
1 error generated.
```
</details>
<details>
<summary>tools/clang/tools/extra/clang-tidy/readability/CMakeFiles/obj.clangTidyReadabilityModule.dir/RedundantMemberInitCheck.cpp.o</summary>

```
FAILED: tools/clang/tools/extra/clang-tidy/readability/CMakeFiles/obj.clangTidyReadabilityModule.dir/RedundantMemberInitCheck.cpp.o
sccache /opt/llvm/bin/clang++ -DGTEST_HAS_RTTI=0 -D_DEBUG -D_GLIBCXX_ASSERTIONS -D_GLIBCXX_USE_CXX11_ABI=1 -D_GNU_SOURCE -D__STDC_CONSTANT_MACROS -D__STDC_FORMAT_MACROS -D__STDC_LIMIT_MACROS -I/home/gha/actions-runner/_work/llvm-project/llvm-project/build/tools/clang/tools/extra/clang-tidy/readability -I/home/gha/actions-runner/_work/llvm-project/llvm-project/clang-tools-extra/clang-tidy/readability -I/home/gha/actions-runner/_work/llvm-project/llvm-project/build/tools/clang/tools/extra/clang-tidy -I/home/gha/actions-runner/_work/llvm-project/llvm-project/clang/include -I/home/gha/actions-runner/_work/llvm-project/llvm-project/build/tools/clang/include -I/home/gha/actions-runner/_work/llvm-project/llvm-project/build/include -I/home/gha/actions-runner/_work/llvm-project/llvm-project/llvm/include -gmlt -fPIC -fno-semantic-interposition -fvisibility-inlines-hidden -Werror -Werror=date-time -Werror=unguarded-availability-new -Wall -Wextra -Wno-unused-parameter -Wwrite-strings -Wcast-qual -Wmissing-field-initializers -pedantic -Wno-long-long -Wc++98-compat-extra-semi -Wimplicit-fallthrough -Wcovered-switch-default -Wno-noexcept-type -Wnon-virtual-dtor -Wdelete-non-virtual-dtor -Wsuggest-override -Wstring-conversion -Wno-pass-failed -Wmisleading-indentation -Wctad-maybe-unsupported -fdiagnostics-color -ffunction-sections -fdata-sections -fno-common -Woverloaded-virtual -Wno-nested-anon-types -O3 -DNDEBUG -std=c++17  -fno-exceptions -funwind-tables -fno-rtti -UNDEBUG -MD -MT tools/clang/tools/extra/clang-tidy/readability/CMakeFiles/obj.clangTidyReadabilityModule.dir/RedundantMemberInitCheck.cpp.o -MF tools/clang/tools/extra/clang-tidy/readability/CMakeFiles/obj.clangTidyReadabilityModule.dir/RedundantMemberInitCheck.cpp.o.d -o tools/clang/tools/extra/clang-tidy/readability/CMakeFiles/obj.clangTidyReadabilityModule.dir/RedundantMemberInitCheck.cpp.o -c /home/gha/actions-runner/_work/llvm-project/llvm-project/clang-tools-extra/clang-tidy/readability/RedundantMemberInitCheck.cpp
In file included from /home/gha/actions-runner/_work/llvm-project/llvm-project/clang-tools-extra/clang-tidy/readability/RedundantMemberInitCheck.cpp:10:
/home/gha/actions-runner/_work/llvm-project/llvm-project/clang-tools-extra/clang-tidy/readability/../utils/LexerUtils.h:15:10: fatal error: 'clang/basic/SourceManager.h' file not found
15 | #include "clang/basic/SourceManager.h"
|          ^~~~~~~~~~~~~~~~~~~~~~~~~~~~~
1 error generated.
```
</details>
<details>
<summary>tools/clang/tools/extra/clang-tidy/utils/CMakeFiles/obj.clangTidyUtils.dir/BracesAroundStatement.cpp.o</summary>

```
FAILED: tools/clang/tools/extra/clang-tidy/utils/CMakeFiles/obj.clangTidyUtils.dir/BracesAroundStatement.cpp.o
sccache /opt/llvm/bin/clang++ -DGTEST_HAS_RTTI=0 -D_DEBUG -D_GLIBCXX_ASSERTIONS -D_GLIBCXX_USE_CXX11_ABI=1 -D_GNU_SOURCE -D__STDC_CONSTANT_MACROS -D__STDC_FORMAT_MACROS -D__STDC_LIMIT_MACROS -I/home/gha/actions-runner/_work/llvm-project/llvm-project/build/tools/clang/tools/extra/clang-tidy/utils -I/home/gha/actions-runner/_work/llvm-project/llvm-project/clang-tools-extra/clang-tidy/utils -I/home/gha/actions-runner/_work/llvm-project/llvm-project/build/tools/clang/tools/extra/clang-tidy -I/home/gha/actions-runner/_work/llvm-project/llvm-project/clang/include -I/home/gha/actions-runner/_work/llvm-project/llvm-project/build/tools/clang/include -I/home/gha/actions-runner/_work/llvm-project/llvm-project/build/include -I/home/gha/actions-runner/_work/llvm-project/llvm-project/llvm/include -gmlt -fPIC -fno-semantic-interposition -fvisibility-inlines-hidden -Werror -Werror=date-time -Werror=unguarded-availability-new -Wall -Wextra -Wno-unused-parameter -Wwrite-strings -Wcast-qual -Wmissing-field-initializers -pedantic -Wno-long-long -Wc++98-compat-extra-semi -Wimplicit-fallthrough -Wcovered-switch-default -Wno-noexcept-type -Wnon-virtual-dtor -Wdelete-non-virtual-dtor -Wsuggest-override -Wstring-conversion -Wno-pass-failed -Wmisleading-indentation -Wctad-maybe-unsupported -fdiagnostics-color -ffunction-sections -fdata-sections -fno-common -Woverloaded-virtual -Wno-nested-anon-types -O3 -DNDEBUG -std=c++17  -fno-exceptions -funwind-tables -fno-rtti -UNDEBUG -MD -MT tools/clang/tools/extra/clang-tidy/utils/CMakeFiles/obj.clangTidyUtils.dir/BracesAroundStatement.cpp.o -MF tools/clang/tools/extra/clang-tidy/utils/CMakeFiles/obj.clangTidyUtils.dir/BracesAroundStatement.cpp.o.d -o tools/clang/tools/extra/clang-tidy/utils/CMakeFiles/obj.clangTidyUtils.dir/BracesAroundStatement.cpp.o -c /home/gha/actions-runner/_work/llvm-project/llvm-project/clang-tools-extra/clang-tidy/utils/BracesAroundStatement.cpp
In file included from /home/gha/actions-runner/_work/llvm-project/llvm-project/clang-tools-extra/clang-tidy/utils/BracesAroundStatement.cpp:15:
/home/gha/actions-runner/_work/llvm-project/llvm-project/clang-tools-extra/clang-tidy/utils/../utils/LexerUtils.h:15:10: fatal error: 'clang/basic/SourceManager.h' file not found
15 | #include "clang/basic/SourceManager.h"
|          ^~~~~~~~~~~~~~~~~~~~~~~~~~~~~
1 error generated.
```
</details>
<details>
<summary>tools/clang/tools/extra/clang-tidy/utils/CMakeFiles/obj.clangTidyUtils.dir/FixItHintUtils.cpp.o</summary>

```
FAILED: tools/clang/tools/extra/clang-tidy/utils/CMakeFiles/obj.clangTidyUtils.dir/FixItHintUtils.cpp.o
sccache /opt/llvm/bin/clang++ -DGTEST_HAS_RTTI=0 -D_DEBUG -D_GLIBCXX_ASSERTIONS -D_GLIBCXX_USE_CXX11_ABI=1 -D_GNU_SOURCE -D__STDC_CONSTANT_MACROS -D__STDC_FORMAT_MACROS -D__STDC_LIMIT_MACROS -I/home/gha/actions-runner/_work/llvm-project/llvm-project/build/tools/clang/tools/extra/clang-tidy/utils -I/home/gha/actions-runner/_work/llvm-project/llvm-project/clang-tools-extra/clang-tidy/utils -I/home/gha/actions-runner/_work/llvm-project/llvm-project/build/tools/clang/tools/extra/clang-tidy -I/home/gha/actions-runner/_work/llvm-project/llvm-project/clang/include -I/home/gha/actions-runner/_work/llvm-project/llvm-project/build/tools/clang/include -I/home/gha/actions-runner/_work/llvm-project/llvm-project/build/include -I/home/gha/actions-runner/_work/llvm-project/llvm-project/llvm/include -gmlt -fPIC -fno-semantic-interposition -fvisibility-inlines-hidden -Werror -Werror=date-time -Werror=unguarded-availability-new -Wall -Wextra -Wno-unused-parameter -Wwrite-strings -Wcast-qual -Wmissing-field-initializers -pedantic -Wno-long-long -Wc++98-compat-extra-semi -Wimplicit-fallthrough -Wcovered-switch-default -Wno-noexcept-type -Wnon-virtual-dtor -Wdelete-non-virtual-dtor -Wsuggest-override -Wstring-conversion -Wno-pass-failed -Wmisleading-indentation -Wctad-maybe-unsupported -fdiagnostics-color -ffunction-sections -fdata-sections -fno-common -Woverloaded-virtual -Wno-nested-anon-types -O3 -DNDEBUG -std=c++17  -fno-exceptions -funwind-tables -fno-rtti -UNDEBUG -MD -MT tools/clang/tools/extra/clang-tidy/utils/CMakeFiles/obj.clangTidyUtils.dir/FixItHintUtils.cpp.o -MF tools/clang/tools/extra/clang-tidy/utils/CMakeFiles/obj.clangTidyUtils.dir/FixItHintUtils.cpp.o.d -o tools/clang/tools/extra/clang-tidy/utils/CMakeFiles/obj.clangTidyUtils.dir/FixItHintUtils.cpp.o -c /home/gha/actions-runner/_work/llvm-project/llvm-project/clang-tools-extra/clang-tidy/utils/FixItHintUtils.cpp
In file included from /home/gha/actions-runner/_work/llvm-project/llvm-project/clang-tools-extra/clang-tidy/utils/FixItHintUtils.cpp:10:
/home/gha/actions-runner/_work/llvm-project/llvm-project/clang-tools-extra/clang-tidy/utils/LexerUtils.h:15:10: fatal error: 'clang/basic/SourceManager.h' file not found
15 | #include "clang/basic/SourceManager.h"
|          ^~~~~~~~~~~~~~~~~~~~~~~~~~~~~
1 error generated.
```
</details>
<details>
<summary>tools/clang/tools/extra/clang-tidy/readability/CMakeFiles/obj.clangTidyReadabilityModule.dir/SimplifyBooleanExprCheck.cpp.o</summary>

```
FAILED: tools/clang/tools/extra/clang-tidy/readability/CMakeFiles/obj.clangTidyReadabilityModule.dir/SimplifyBooleanExprCheck.cpp.o
sccache /opt/llvm/bin/clang++ -DGTEST_HAS_RTTI=0 -D_DEBUG -D_GLIBCXX_ASSERTIONS -D_GLIBCXX_USE_CXX11_ABI=1 -D_GNU_SOURCE -D__STDC_CONSTANT_MACROS -D__STDC_FORMAT_MACROS -D__STDC_LIMIT_MACROS -I/home/gha/actions-runner/_work/llvm-project/llvm-project/build/tools/clang/tools/extra/clang-tidy/readability -I/home/gha/actions-runner/_work/llvm-project/llvm-project/clang-tools-extra/clang-tidy/readability -I/home/gha/actions-runner/_work/llvm-project/llvm-project/build/tools/clang/tools/extra/clang-tidy -I/home/gha/actions-runner/_work/llvm-project/llvm-project/clang/include -I/home/gha/actions-runner/_work/llvm-project/llvm-project/build/tools/clang/include -I/home/gha/actions-runner/_work/llvm-project/llvm-project/build/include -I/home/gha/actions-runner/_work/llvm-project/llvm-project/llvm/include -gmlt -fPIC -fno-semantic-interposition -fvisibility-inlines-hidden -Werror -Werror=date-time -Werror=unguarded-availability-new -Wall -Wextra -Wno-unused-parameter -Wwrite-strings -Wcast-qual -Wmissing-field-initializers -pedantic -Wno-long-long -Wc++98-compat-extra-semi -Wimplicit-fallthrough -Wcovered-switch-default -Wno-noexcept-type -Wnon-virtual-dtor -Wdelete-non-virtual-dtor -Wsuggest-override -Wstring-conversion -Wno-pass-failed -Wmisleading-indentation -Wctad-maybe-unsupported -fdiagnostics-color -ffunction-sections -fdata-sections -fno-common -Woverloaded-virtual -Wno-nested-anon-types -O3 -DNDEBUG -std=c++17  -fno-exceptions -funwind-tables -fno-rtti -UNDEBUG -MD -MT tools/clang/tools/extra/clang-tidy/readability/CMakeFiles/obj.clangTidyReadabilityModule.dir/SimplifyBooleanExprCheck.cpp.o -MF tools/clang/tools/extra/clang-tidy/readability/CMakeFiles/obj.clangTidyReadabilityModule.dir/SimplifyBooleanExprCheck.cpp.o.d -o tools/clang/tools/extra/clang-tidy/readability/CMakeFiles/obj.clangTidyReadabilityModule.dir/SimplifyBooleanExprCheck.cpp.o -c /home/gha/actions-runner/_work/llvm-project/llvm-project/clang-tools-extra/clang-tidy/readability/SimplifyBooleanExprCheck.cpp
In file included from /home/gha/actions-runner/_work/llvm-project/llvm-project/clang-tools-extra/clang-tidy/readability/SimplifyBooleanExprCheck.cpp:10:
/home/gha/actions-runner/_work/llvm-project/llvm-project/clang-tools-extra/clang-tidy/readability/../utils/LexerUtils.h:15:10: fatal error: 'clang/basic/SourceManager.h' file not found
15 | #include "clang/basic/SourceManager.h"
|          ^~~~~~~~~~~~~~~~~~~~~~~~~~~~~
1 error generated.
```
</details>
<details>
<summary>tools/clang/tools/extra/clang-tidy/utils/CMakeFiles/obj.clangTidyUtils.dir/LexerUtils.cpp.o</summary>

```
FAILED: tools/clang/tools/extra/clang-tidy/utils/CMakeFiles/obj.clangTidyUtils.dir/LexerUtils.cpp.o
sccache /opt/llvm/bin/clang++ -DGTEST_HAS_RTTI=0 -D_DEBUG -D_GLIBCXX_ASSERTIONS -D_GLIBCXX_USE_CXX11_ABI=1 -D_GNU_SOURCE -D__STDC_CONSTANT_MACROS -D__STDC_FORMAT_MACROS -D__STDC_LIMIT_MACROS -I/home/gha/actions-runner/_work/llvm-project/llvm-project/build/tools/clang/tools/extra/clang-tidy/utils -I/home/gha/actions-runner/_work/llvm-project/llvm-project/clang-tools-extra/clang-tidy/utils -I/home/gha/actions-runner/_work/llvm-project/llvm-project/build/tools/clang/tools/extra/clang-tidy -I/home/gha/actions-runner/_work/llvm-project/llvm-project/clang/include -I/home/gha/actions-runner/_work/llvm-project/llvm-project/build/tools/clang/include -I/home/gha/actions-runner/_work/llvm-project/llvm-project/build/include -I/home/gha/actions-runner/_work/llvm-project/llvm-project/llvm/include -gmlt -fPIC -fno-semantic-interposition -fvisibility-inlines-hidden -Werror -Werror=date-time -Werror=unguarded-availability-new -Wall -Wextra -Wno-unused-parameter -Wwrite-strings -Wcast-qual -Wmissing-field-initializers -pedantic -Wno-long-long -Wc++98-compat-extra-semi -Wimplicit-fallthrough -Wcovered-switch-default -Wno-noexcept-type -Wnon-virtual-dtor -Wdelete-non-virtual-dtor -Wsuggest-override -Wstring-conversion -Wno-pass-failed -Wmisleading-indentation -Wctad-maybe-unsupported -fdiagnostics-color -ffunction-sections -fdata-sections -fno-common -Woverloaded-virtual -Wno-nested-anon-types -O3 -DNDEBUG -std=c++17  -fno-exceptions -funwind-tables -fno-rtti -UNDEBUG -MD -MT tools/clang/tools/extra/clang-tidy/utils/CMakeFiles/obj.clangTidyUtils.dir/LexerUtils.cpp.o -MF tools/clang/tools/extra/clang-tidy/utils/CMakeFiles/obj.clangTidyUtils.dir/LexerUtils.cpp.o.d -o tools/clang/tools/extra/clang-tidy/utils/CMakeFiles/obj.clangTidyUtils.dir/LexerUtils.cpp.o -c /home/gha/actions-runner/_work/llvm-project/llvm-project/clang-tools-extra/clang-tidy/utils/LexerUtils.cpp
In file included from /home/gha/actions-runner/_work/llvm-project/llvm-project/clang-tools-extra/clang-tidy/utils/LexerUtils.cpp:9:
/home/gha/actions-runner/_work/llvm-project/llvm-project/clang-tools-extra/clang-tidy/utils/LexerUtils.h:15:10: fatal error: 'clang/basic/SourceManager.h' file not found
15 | #include "clang/basic/SourceManager.h"
|          ^~~~~~~~~~~~~~~~~~~~~~~~~~~~~
1 error generated.
```
</details>

If these failures are unrelated to your changes (for example tests are broken or flaky at HEAD), please open an issue at https://github.com/llvm/llvm-project/issues and add the `infrastructure` label.

https://github.com/llvm/llvm-project/pull/172508


More information about the cfe-commits mailing list