[llvm-testresults] buildbot failure in lab.llvm.org on clang-x86_64-darwin11-nobootstrap-RAincremental
llvmlab-buildmaster at lab.llvm.org
llvmlab-buildmaster at lab.llvm.org
Thu Mar 13 07:23:29 PDT 2014
The Buildbot has detected a failed build on builder clang-x86_64-darwin11-nobootstrap-RAincremental while building cfe.
Full details are available at:
http://lab.llvm.org:8013/builders/clang-x86_64-darwin11-nobootstrap-RAincremental/builds/13435
Buildbot URL: http://lab.llvm.org:8013/
Buildslave for this Build: xserve5
Build Reason: Triggerable(phase1-stage0)
Build Source Stamp: 203800
Blamelist:
BUILD FAILED: failed run.llvm.tests
sincerely,
-The Buildbot
================================================================================
CHANGES:
LOGS:
Last 15 lines of 'stdio':
1 warning(s) in tests.
Testing Time: 327.91s
********************
Failing Tests (4):
LLVM :: MC/AArch64/basic-a64-diagnostics.s
LLVM :: MC/AArch64/basic-a64-instructions.s
LLVM :: MC/AArch64/elf-extern.s
LLVM :: MC/AArch64/elf-globaladdress.ll
Expected Passes : 16948
Expected Failures : 91
Unsupported Tests : 40
Unexpected Failures: 4
make[1]: *** [check-local-all] Error 1
make: *** [check-all] Error 2
Last 15 lines of 'LLVM::elf-extern.s':
Script:
--
/Users/buildslave/zorg/buildbot/smooshlab/slave-0.8/build.clang-x86_64-darwin11-nobootstrap-RAincremental/clang-build/Release+Asserts/bin/llvm-mc < /Users/buildslave/zorg/buildbot/smooshlab/slave-0.8/build.clang-x86_64-darwin11-nobootstrap-RAincremental/llvm/test/MC/AArch64/elf-extern.s -triple=aarch64-none-linux-gnu -filetype=obj | /Users/buildslave/zorg/buildbot/smooshlab/slave-0.8/build.clang-x86_64-darwin11-nobootstrap-RAincremental/clang-build/Release+Asserts/bin/llvm-readobj -r | /Users/buildslave/zorg/buildbot/smooshlab/slave-0.8/build.clang-x86_64-darwin11-nobootstrap-RAincremental/clang-build/Release+Asserts/bin/FileCheck /Users/buildslave/zorg/buildbot/smooshlab/slave-0.8/build.clang-x86_64-darwin11-nobootstrap-RAincremental/llvm/test/MC/AArch64/elf-extern.s
--
Exit Code: 137
Command Output (stderr):
--
/Users/buildslave/zorg/buildbot/smooshlab/slave-0.8/build.clang-x86_64-darwin11-nobootstrap-RAincremental/clang-build/test/MC/AArch64/Output/elf-extern.s.script: line 1: 83659 Killed: 9 /Users/buildslave/zorg/buildbot/smooshlab/slave-0.8/build.clang-x86_64-darwin11-nobootstrap-RAincremental/clang-build/Release+Asserts/bin/llvm-mc -triple=aarch64-none-linux-gnu -filetype=obj < /Users/buildslave/zorg/buildbot/smooshlab/slave-0.8/build.clang-x86_64-darwin11-nobootstrap-RAincremental/llvm/test/MC/AArch64/elf-extern.s
83660 | /Users/buildslave/zorg/buildbot/smooshlab/slave-0.8/build.clang-x86_64-darwin11-nobootstrap-RAincremental/clang-build/Release+Asserts/bin/llvm-readobj -r
83661 | /Users/buildslave/zorg/buildbot/smooshlab/slave-0.8/build.clang-x86_64-darwin11-nobootstrap-RAincremental/clang-build/Release+Asserts/bin/FileCheck /Users/buildslave/zorg/buildbot/smooshlab/slave-0.8/build.clang-x86_64-darwin11-nobootstrap-RAincremental/llvm/test/MC/AArch64/elf-extern.s
--
********************
Last 15 lines of 'LLVM::basic-a64-diagnostics.s':
******************** TEST 'LLVM :: MC/AArch64/basic-a64-diagnostics.s' FAILED ********************
Script:
--
not /Users/buildslave/zorg/buildbot/smooshlab/slave-0.8/build.clang-x86_64-darwin11-nobootstrap-RAincremental/clang-build/Release+Asserts/bin/llvm-mc -triple aarch64-none-linux-gnu < /Users/buildslave/zorg/buildbot/smooshlab/slave-0.8/build.clang-x86_64-darwin11-nobootstrap-RAincremental/llvm/test/MC/AArch64/basic-a64-diagnostics.s 2> /Users/buildslave/zorg/buildbot/smooshlab/slave-0.8/build.clang-x86_64-darwin11-nobootstrap-RAincremental/clang-build/test/MC/AArch64/Output/basic-a64-diagnostics.s.tmp
/Users/buildslave/zorg/buildbot/smooshlab/slave-0.8/build.clang-x86_64-darwin11-nobootstrap-RAincremental/clang-build/Release+Asserts/bin/FileCheck --check-prefix=CHECK-ERROR < /Users/buildslave/zorg/buildbot/smooshlab/slave-0.8/build.clang-x86_64-darwin11-nobootstrap-RAincremental/clang-build/test/MC/AArch64/Output/basic-a64-diagnostics.s.tmp /Users/buildslave/zorg/buildbot/smooshlab/slave-0.8/build.clang-x86_64-darwin11-nobootstrap-RAincremental/llvm/test/MC/AArch64/basic-a64-diagnostics.s
--
Exit Code: 137
Command Output (stderr):
--
/Users/buildslave/zorg/buildbot/smooshlab/slave-0.8/build.clang-x86_64-darwin11-nobootstrap-RAincremental/clang-build/test/MC/AArch64/Output/basic-a64-diagnostics.s.script: line 2: 83658 Killed: 9 not /Users/buildslave/zorg/buildbot/smooshlab/slave-0.8/build.clang-x86_64-darwin11-nobootstrap-RAincremental/clang-build/Release+Asserts/bin/llvm-mc -triple aarch64-none-linux-gnu < /Users/buildslave/zorg/buildbot/smooshlab/slave-0.8/build.clang-x86_64-darwin11-nobootstrap-RAincremental/llvm/test/MC/AArch64/basic-a64-diagnostics.s 2> /Users/buildslave/zorg/buildbot/smooshlab/slave-0.8/build.clang-x86_64-darwin11-nobootstrap-RAincremental/clang-build/test/MC/AArch64/Output/basic-a64-diagnostics.s.tmp
--
********************
Last 15 lines of 'LLVM::basic-a64-instructions.s':
Script:
--
/Users/buildslave/zorg/buildbot/smooshlab/slave-0.8/build.clang-x86_64-darwin11-nobootstrap-RAincremental/clang-build/Release+Asserts/bin/llvm-mc -triple aarch64-none-linux-gnu -show-encoding -mattr=+fp-armv8 < /Users/buildslave/zorg/buildbot/smooshlab/slave-0.8/build.clang-x86_64-darwin11-nobootstrap-RAincremental/llvm/test/MC/AArch64/basic-a64-instructions.s | /Users/buildslave/zorg/buildbot/smooshlab/slave-0.8/build.clang-x86_64-darwin11-nobootstrap-RAincremental/clang-build/Release+Asserts/bin/FileCheck /Users/buildslave/zorg/buildbot/smooshlab/slave-0.8/build.clang-x86_64-darwin11-nobootstrap-RAincremental/llvm/test/MC/AArch64/basic-a64-instructions.s
--
Exit Code: 137
Command Output (stderr):
--
LLVM ERROR: IO failure on output stream.
/Users/buildslave/zorg/buildbot/smooshlab/slave-0.8/build.clang-x86_64-darwin11-nobootstrap-RAincremental/clang-build/test/MC/AArch64/Output/basic-a64-instructions.s.script: line 1: 83648 Exit 1 /Users/buildslave/zorg/buildbot/smooshlab/slave-0.8/build.clang-x86_64-darwin11-nobootstrap-RAincremental/clang-build/Release+Asserts/bin/llvm-mc -triple aarch64-none-linux-gnu -show-encoding -mattr=+fp-armv8 < /Users/buildslave/zorg/buildbot/smooshlab/slave-0.8/build.clang-x86_64-darwin11-nobootstrap-RAincremental/llvm/test/MC/AArch64/basic-a64-instructions.s
83649 Killed: 9 | /Users/buildslave/zorg/buildbot/smooshlab/slave-0.8/build.clang-x86_64-darwin11-nobootstrap-RAincremental/clang-build/Release+Asserts/bin/FileCheck /Users/buildslave/zorg/buildbot/smooshlab/slave-0.8/build.clang-x86_64-darwin11-nobootstrap-RAincremental/llvm/test/MC/AArch64/basic-a64-instructions.s
--
********************
Last 15 lines of 'LLVM::elf-globaladdress.ll':
/Users/buildslave/zorg/buildbot/smooshlab/slave-0.8/build.clang-x86_64-darwin11-nobootstrap-RAincremental/clang-build/Release+Asserts/bin/llc -mtriple=aarch64-none-linux-gnu -filetype=obj /Users/buildslave/zorg/buildbot/smooshlab/slave-0.8/build.clang-x86_64-darwin11-nobootstrap-RAincremental/llvm/test/MC/AArch64/elf-globaladdress.ll -o - | /Users/buildslave/zorg/buildbot/smooshlab/slave-0.8/build.clang-x86_64-darwin11-nobootstrap-RAincremental/clang-build/Release+Asserts/bin/llvm-readobj -h -r | /Users/buildslave/zorg/buildbot/smooshlab/slave-0.8/build.clang-x86_64-darwin11-nobootstrap-RAincremental/clang-build/Release+Asserts/bin/FileCheck -check-prefix=OBJ /Users/buildslave/zorg/buildbot/smooshlab/slave-0.8/build.clang-x86_64-darwin11-nobootstrap-RAincremental/llvm/test/MC/AArch64/elf-globaladdress.ll
/Users/buildslave/zorg/buildbot/smooshlab/slave-0.8/build.clang-x86_64-darwin11-nobootstrap-RAincremental/clang-build/Release+Asserts/bin/llc -mtriple=aarch64-none-linux-gnu /Users/buildslave/zorg/buildbot/smooshlab/slave-0.8/build.clang-x86_64-darwin11-nobootstrap-RAincremental/llvm/test/MC/AArch64/elf-globaladdress.ll -o - | /Users/buildslave/zorg/buildbot/smooshlab/slave-0.8/build.clang-x86_64-darwin11-nobootstrap-RAincremental/clang-build/Release+Asserts/bin/llvm-mc -triple=aarch64-none-linux-gnu -filetype=obj -o - | /Users/buildslave/zorg/buildbot/smooshlab/slave-0.8/build.clang-x86_64-darwin11-nobootstrap-RAincremental/clang-build/Release+Asserts/bin/llvm-readobj -h -r | /Users/buildslave/zorg/buildbot/smooshlab/slave-0.8/build.clang-x86_64-darwin11-nobootstrap-RAincremental/clang-build/Release+Asserts/bin/FileCheck -check-prefix=OBJ /Users/buildslave/zorg/buildbot/smooshlab/slave-0.8/build.clang-x86_64-darwin11-nobootstrap-RAincremental/llvm/test/MC/AArch64/elf-globaladdress.ll
--
Exit Code: 137
Command Output (stderr):
--
LLVM ERROR: IO failure on output stream.
/Users/buildslave/zorg/buildbot/smooshlab/slave-0.8/build.clang-x86_64-darwin11-nobootstrap-RAincremental/clang-build/test/MC/AArch64/Output/elf-globaladdress.ll.script: line 2: 83662 Exit 1 /Users/buildslave/zorg/buildbot/smooshlab/slave-0.8/build.clang-x86_64-darwin11-nobootstrap-RAincremental/clang-build/Release+Asserts/bin/llc -mtriple=aarch64-none-linux-gnu -filetype=obj /Users/buildslave/zorg/buildbot/smooshlab/slave-0.8/build.clang-x86_64-darwin11-nobootstrap-RAincremental/llvm/test/MC/AArch64/elf-globaladdress.ll -o -
83663 Killed: 9 | /Users/buildslave/zorg/buildbot/smooshlab/slave-0.8/build.clang-x86_64-darwin11-nobootstrap-RAincremental/clang-build/Release+Asserts/bin/llvm-readobj -h -r
83664 Killed: 9 | /Users/buildslave/zorg/buildbot/smooshlab/slave-0.8/build.clang-x86_64-darwin11-nobootstrap-RAincremental/clang-build/Release+Asserts/bin/FileCheck -check-prefix=OBJ /Users/buildslave/zorg/buildbot/smooshlab/slave-0.8/build.clang-x86_64-darwin11-nobootstrap-RAincremental/llvm/test/MC/AArch64/elf-globaladdress.ll
--
********************
Last 15 lines of 'warnings (1)':
lit.py: discovery.py:190: warning: test suite 'Extra Tools Unit Tests' contained no tests
More information about the llvm-testresults
mailing list