[llvm-testresults] buildbot failure in lab.llvm.org on clang-x86_64-darwin11-nobootstrap-RAincremental
llvmlab-buildmaster at lab.llvm.org
llvmlab-buildmaster at lab.llvm.org
Thu Jun 12 21:03:11 PDT 2014
The Buildbot has detected a failed build on builder clang-x86_64-darwin11-nobootstrap-RAincremental while building cfe.
Full details are available at:
http://lab.llvm.org:8013/builders/clang-x86_64-darwin11-nobootstrap-RAincremental/builds/828
Buildbot URL: http://lab.llvm.org:8013/
Buildslave for this Build: xserve5
Build Reason: Triggerable(phase1-stage0)
Build Source Stamp: 210883
Blamelist:
BUILD FAILED: failed run.llvm.tests
sincerely,
-The Buildbot
================================================================================
CHANGES:
LOGS:
Last 15 lines of 'stdio':
PASS: LLVM-Unit :: Support/Release+Asserts/SupportTests/ProgramTest.TestExecuteAndWaitTimeout (18338 of 18339)
PASS: LLVM-Unit :: Support/Release+Asserts/SupportTests/ProgramTest.TestExecuteNoWait (18339 of 18339)
1 warning(s) in tests.
Testing Time: 314.29s
********************
Failing Tests (1):
Clang :: Driver/clang-g-opts.c
Expected Passes : 18155
Expected Failures : 106
Unsupported Tests : 77
Unexpected Failures: 1
make[1]: *** [check-local-all] Error 1
make: *** [check-all] Error 2
Last 15 lines of 'Clang::clang-g-opts.c':
/Users/buildslave/zorg/buildbot/smooshlab/slave-0.8/build.clang-x86_64-darwin11-nobootstrap-RAincremental/clang-build/Release+Asserts/bin/clang -### -S /Users/buildslave/zorg/buildbot/smooshlab/slave-0.8/build.clang-x86_64-darwin11-nobootstrap-RAincremental/clang.src/test/Driver/clang-g-opts.c -g0 -g -target x86_64-pc-freebsd10.02>&1 | /Users/buildslave/zorg/buildbot/smooshlab/slave-0.8/build.clang-x86_64-darwin11-nobootstrap-RAincremental/clang-build/Release+Asserts/bin/FileCheck --check-prefix=CHECK-WITH-G-DWARF2 /Users/buildslave/zorg/buildbot/smooshlab/slave-0.8/build.clang-x86_64-darwin11-nobootstrap-RAincremental/clang.src/test/Driver/clang-g-opts.c
--
Exit Code: 2
Command Output (stderr):
--
clang version 3.5.0 (trunk 210883)
Target: x86_64-pc-freebsd10.02
Thread model: posix
"/Users/buildslave/zorg/buildbot/smooshlab/slave-0.8/build.clang-x86_64-darwin11-nobootstrap-RAincremental/clang-build/Release+Asserts/bin/clang" "-cc1" "-triple" "x86_64-pc-freebsd10.02" "-S" "-disable-free" "-main-file-name" "clang-g-opts.c" "-mrelocation-model" "static" "-mdisable-fp-elim" "-masm-verbose" "-mconstructor-aliases" "-munwind-tables" "-target-cpu" "x86-64" "-target-linker-version" "136" "-gdwarf-2" "-coverage-file" "/Users/buildslave/zorg/buildbot/smooshlab/slave-0.8/build.clang-x86_64-darwin11-nobootstrap-RAincremental/clang-build/tools/clang/test/Driver/clang-g-opts.s" "-resource-dir" "/Users/buildslave/zorg/buildbot/smooshlab/slave-0.8/build.clang-x86_64-darwin11-nobootstrap-RAincremental/clang-build/Release+Asserts/bin/../lib/clang/3.5.0" "-fdebug-compilation-dir" "/Users/buildslave/zorg/buildbot/smooshlab/slave-0.8/build.clang-x86_64-darwin11-nobootstrap-RAincremental/clang-build/tools/clang/test/Driver" "-ferror-limit" "19" "-fmessage-length" "0" "-mstackrealign" "-fobjc-runtime=gnustep" "-fdiagnostics-show-option" "-o" "clang-g-opts.s" "-x" "c" "/Users/buildslave/zorg/buildbot/smooshlab/slave-0.8/build.clang-x86_64-darwin11-nobootstrap-RAincremental/clang.src/test/Driver/clang-g-opts.c"
FileCheck error: '-' is empty.
--
********************
Last 15 lines of 'warnings (1)':
lit.py: discovery.py:190: warning: test suite 'Extra Tools Unit Tests' contained no tests
More information about the llvm-testresults
mailing list