[llvm-testresults] buildbot failure in lab.llvm.org on clang-x86_64-darwin11-nobootstrap-RAincremental
llvmlab-buildmaster at lab.llvm.org
llvmlab-buildmaster at lab.llvm.org
Sat Jan 4 18:34:17 PST 2014
The Buildbot has detected a new failure on builder clang-x86_64-darwin11-nobootstrap-RAincremental while building llvm.
Full details are available at:
http://lab.llvm.org:8013/builders/clang-x86_64-darwin11-nobootstrap-RAincremental/builds/10852
Buildbot URL: http://lab.llvm.org:8013/
Buildslave for this Build: xserve5
Build Reason: Triggerable(phase1-stage0)
Build Source Stamp: 198533
Blamelist:
BUILD FAILED: failed run.llvm.tests
sincerely,
-The Buildbot
================================================================================
CHANGES:
LOGS:
Last 15 lines of 'stdio':
PASS: LLVM-Unit :: Support/Release+Asserts/SupportTests/ProgramTest.TestExecuteNoWait (16453 of 16454)
PASS: LLVM-Unit :: ADT/Release+Asserts/ADTTests/APFloatTest.StringHexadecimalExponentDeath (16454 of 16454)
1 warning(s) in tests.
Testing Time: 266.33s
********************
Failing Tests (1):
LLVM :: MC/Sparc/sparc-alu-instructions.s
Expected Passes : 16331
Expected Failures : 81
Unsupported Tests : 41
Unexpected Failures: 1
make[1]: *** [check-local-all] Error 1
make: *** [check-all] Error 2
Last 15 lines of 'LLVM::sparc-alu-instructions.s':
Script:
--
/Users/buildslave/zorg/buildbot/smooshlab/slave-0.8/build.clang-x86_64-darwin11-nobootstrap-RAincremental/clang-build/Release+Asserts/bin/llvm-mc /Users/buildslave/zorg/buildbot/smooshlab/slave-0.8/build.clang-x86_64-darwin11-nobootstrap-RAincremental/llvm/test/MC/Sparc/sparc-alu-instructions.s -arch=sparc -show-encoding | /Users/buildslave/zorg/buildbot/smooshlab/slave-0.8/build.clang-x86_64-darwin11-nobootstrap-RAincremental/clang-build/Release+Asserts/bin/FileCheck /Users/buildslave/zorg/buildbot/smooshlab/slave-0.8/build.clang-x86_64-darwin11-nobootstrap-RAincremental/llvm/test/MC/Sparc/sparc-alu-instructions.s
/Users/buildslave/zorg/buildbot/smooshlab/slave-0.8/build.clang-x86_64-darwin11-nobootstrap-RAincremental/clang-build/Release+Asserts/bin/llvm-mc /Users/buildslave/zorg/buildbot/smooshlab/slave-0.8/build.clang-x86_64-darwin11-nobootstrap-RAincremental/llvm/test/MC/Sparc/sparc-alu-instructions.s -arch=sparcv9 -show-encoding | /Users/buildslave/zorg/buildbot/smooshlab/slave-0.8/build.clang-x86_64-darwin11-nobootstrap-RAincremental/clang-build/Release+Asserts/bin/FileCheck /Users/buildslave/zorg/buildbot/smooshlab/slave-0.8/build.clang-x86_64-darwin11-nobootstrap-RAincremental/llvm/test/MC/Sparc/sparc-alu-instructions.s
--
Exit Code: 2
Command Output (stderr):
--
/Users/buildslave/zorg/buildbot/smooshlab/slave-0.8/build.clang-x86_64-darwin11-nobootstrap-RAincremental/clang-build/Release+Asserts/bin/llvm-mc: error: this target does not support assembly parsing.
FileCheck error: '-' is empty.
--
********************
Last 15 lines of 'warnings (1)':
lit.py: discovery.py:190: warning: test suite 'Extra Tools Unit Tests' contained no tests
More information about the llvm-testresults
mailing list