[llvm-testresults] buildbot failure in lab.llvm.org on clang-x86_64-darwin11-nobootstrap-RAincremental

llvmlab-buildmaster at lab.llvm.org llvmlab-buildmaster at lab.llvm.org
Tue Aug 26 16:13:14 PDT 2014


The Buildbot has detected a failed build on builder clang-x86_64-darwin11-nobootstrap-RAincremental while building compiler-rt.
Full details are available at:
 http://lab.llvm.org:8013/builders/clang-x86_64-darwin11-nobootstrap-RAincremental/builds/4017

Buildbot URL: http://lab.llvm.org:8013/

Buildslave for this Build: xserve5

Build Reason: Triggerable(phase1-stage0)
Build Source Stamp: 216494
Blamelist: 

BUILD FAILED: failed run.llvm.tests

sincerely,
 -The Buildbot


================================================================================

CHANGES:


LOGS:
Last 15 lines of 'stdio':
	PASS: LLVM-Unit :: Transforms/Utils/Release+Asserts/UtilsTests/IntegerDivision.URem64 (19287 of 19290)
	PASS: LLVM-Unit :: Transforms/Utils/Release+Asserts/UtilsTests/IntegerDivision.UDiv64 (19288 of 19290)
	PASS: LLVM-Unit :: Transforms/Utils/Release+Asserts/UtilsTests/Local.RecursivelyDeleteDeadPHINodes (19289 of 19290)
	PASS: LLVM-Unit :: Support/Release+Asserts/SupportTests/ProgramTest.TestExecuteNoWait (19290 of 19290)
	Testing Time: 337.85s
	********************
	Failing Tests (1):
	    Clang :: CodeGenCXX/microsoft-abi-member-pointers.cpp
	
	  Expected Passes    : 16835
	  Expected Failures  : 63
	  Unsupported Tests  : 2391
	  Unexpected Failures: 1
	make[1]: *** [check-local-all] Error 1
	make: *** [check-all] Error 2

Last 15 lines of 'Clang::microsoft-abi-member-pointers.cpp':
	Command Output (stderr):
	--
	/Users/buildslave/zorg/buildbot/smooshlab/slave-0.8/build.clang-x86_64-darwin11-nobootstrap-RAincremental/clang.src/test/CodeGenCXX/microsoft-abi-member-pointers.cpp:241:15: error: expected string not found in input
	// X64-LABEL: define zeroext i1 @"\01?nullTestDataUnspecified@@
	              ^
	<stdin>:1:1: note: scanning from here
	; ModuleID = '/Users/buildslave/zorg/buildbot/smooshlab/slave-0.8/build.clang-x86_64-darwin11-nobootstrap-RAincremental/clang.src/test/CodeGenCXX/microsoft-abi-member-pointers.cpp'
	^
	<stdin>:52:18: note: possible intended match here
	declare void @"\01?foo at Unspecified@@QEAAXXZ"(%struct.Unspecified*) #0
	                 ^
	
	--
	
	********************







More information about the llvm-testresults mailing list