[llvm-testresults] buildbot failure in lab.llvm.org on clang-x86_64-darwin11-nobootstrap-RAincremental

llvmlab-buildmaster at lab.llvm.org llvmlab-buildmaster at lab.llvm.org
Tue Sep 10 03:09:51 PDT 2013


The Buildbot has detected a failed build on builder clang-x86_64-darwin11-nobootstrap-RAincremental while building llvm.
Full details are available at:
 http://lab.llvm.org:8013/builders/clang-x86_64-darwin11-nobootstrap-RAincremental/builds/6978

Buildbot URL: http://lab.llvm.org:8013/

Buildslave for this Build: xserve5

Build Reason: Triggerable(phase1-stage0)
Build Source Stamp: 190398
Blamelist: 

BUILD FAILED: failed run.llvm.tests

sincerely,
 -The Buildbot


================================================================================

CHANGES:


LOGS:
Last 15 lines of 'stdio':
	PASS: LLVM-Unit :: Support/Release+Asserts/SupportTests/ValueHandle.AssertingVH_Asserts (15417 of 15418)
	PASS: LLVM-Unit :: ADT/Release+Asserts/ADTTests/APFloatTest.StringHexadecimalExponentDeath (15418 of 15418)
	
	1 warning(s) in tests.
	Testing Time: 281.65s
	********************
	Failing Tests (1):
	    Clang :: CodeGen/builtins-mips-msa.c
	
	  Expected Passes    : 15312
	  Expected Failures  : 74
	  Unsupported Tests  : 31
	  Unexpected Failures: 1
	make[1]: *** [check-local-all] Error 1
	make: *** [check-all] Error 2

Last 15 lines of 'Clang :: CodeGen__builtins-mips-msa.c':
	
	Command Output (stderr):
	--
	/Users/buildslave/zorg/buildbot/smooshlab/slave-0.8/build.clang-x86_64-darwin11-nobootstrap-RAincremental/clang.src/test/CodeGen/builtins-mips-msa.c:259:13: error: cannot compile this builtin function yet
	  v16i8_r = __builtin_msa_dotp_s_b(v16i8_a, v16i8_b); // CHECK: call <16 x i8>  @llvm.mips.dotp.s.b(
	            ^~~~~~~~~~~~~~~~~~~~~~~~~~~~~~~~~~~~~~~~
	/Users/buildslave/zorg/buildbot/smooshlab/slave-0.8/build.clang-x86_64-darwin11-nobootstrap-RAincremental/clang.src/test/CodeGen/builtins-mips-msa.c:264:13: error: cannot compile this builtin function yet
	  v16u8_r = __builtin_msa_dotp_u_b(v16u8_a, v16u8_b); // CHECK: call <16 x i8>  @llvm.mips.dotp.u.b(
	            ^~~~~~~~~~~~~~~~~~~~~~~~~~~~~~~~~~~~~~~~
	2 errors generated.
	FileCheck error: '-' is empty.
	
	--
	
	********************

Last 15 lines of 'warnings (1)':
	lit.py: discovery.py:190: warning: test suite 'Extra Tools Unit Tests' contained no tests







More information about the llvm-testresults mailing list