[llvm-testresults] buildbot failure in lab.llvm.org on clang-x86_64-darwin11-nobootstrap-RAincremental
llvmlab-buildmaster at lab.llvm.org
llvmlab-buildmaster at lab.llvm.org
Thu May 2 15:06:21 PDT 2013
The Buildbot has detected a failed build on builder clang-x86_64-darwin11-nobootstrap-RAincremental while building lldb.
Full details are available at:
http://lab.llvm.org:8013/builders/clang-x86_64-darwin11-nobootstrap-RAincremental/builds/1170
Buildbot URL: http://lab.llvm.org:8013/
Buildslave for this Build: xserve5
Build Reason: Triggerable(phase1-stage0)
Build Source Stamp: 180955
Blamelist:
BUILD FAILED: failed run.llvm.tests
sincerely,
-The Buildbot
================================================================================
CHANGES:
LOGS:
Last 15 lines of 'stdio':
LLVM :: CodeGen/Hexagon/remove_lsr.ll
LLVM :: CodeGen/Hexagon/simpletailcall.ll
LLVM :: CodeGen/Hexagon/static.ll
LLVM :: CodeGen/Hexagon/struct_args.ll
LLVM :: CodeGen/Hexagon/sube.ll
LLVM :: CodeGen/Hexagon/union-1.ll
LLVM :: CodeGen/Hexagon/vaddh.ll
LLVM :: CodeGen/Hexagon/zextloadi1.ll
Expected Passes : 13743
Expected Failures : 81
Unsupported Tests : 93
Unexpected Failures: 49
make[1]: *** [check-local-all] Error 1
make: *** [check-all] Error 2
Last 15 lines of 'LLVM :: CodeGen__Hexagon__always-ext.ll':
7 llc 0x000000010fb849b6 llvm::FPPassManager::runOnFunction(llvm::Function&) + 310
8 llc 0x000000010fb84c2b llvm::FPPassManager::runOnModule(llvm::Module&) + 59
9 llc 0x000000010fb84f18 llvm::MPPassManager::runOnModule(llvm::Module&) + 344
10 llc 0x000000010fb85556 llvm::PassManagerImpl::run(llvm::Module&) + 294
11 llc 0x000000010fb8574d llvm::PassManager::run(llvm::Module&) + 13
12 llc 0x000000010f1c6b30 main + 5872
13 llc 0x000000010f1c5434 start + 52
Stack dump:
0. Program arguments: /Users/buildslave/zorg/buildbot/smooshlab/slave-0.8/build.clang-x86_64-darwin11-nobootstrap-RAincremental/clang-build/Release+Asserts/bin/llc -march=hexagon -mcpu=hexagonv4
1. Running pass 'Function Pass Manager' on module '<stdin>'.
2. Running pass 'Hexagon Packetizer' on function '@CuSuiteAddSuite'
FileCheck error: '-' is empty.
--
********************
Last 15 lines of 'LLVM :: CodeGen__Hexagon__adde.ll':
8 llc 0x000000010a02bc2b llvm::FPPassManager::runOnModule(llvm::Module&) + 59
9 llc 0x000000010a02bf18 llvm::MPPassManager::runOnModule(llvm::Module&) + 344
10 llc 0x000000010a02c556 llvm::PassManagerImpl::run(llvm::Module&) + 294
11 llc 0x000000010a02c74d llvm::PassManager::run(llvm::Module&) + 13
12 llc 0x000000010966db30 main + 5872
13 llc 0x000000010966c434 start + 52
14 llc 0x0000000000000002 start + 4137237506
Stack dump:
0. Program arguments: /Users/buildslave/zorg/buildbot/smooshlab/slave-0.8/build.clang-x86_64-darwin11-nobootstrap-RAincremental/clang-build/Release+Asserts/bin/llc -march=hexagon
1. Running pass 'Function Pass Manager' on module '<stdin>'.
2. Running pass 'Hexagon Packetizer' on function '@check_adde_addc'
FileCheck error: '-' is empty.
--
********************
Last 15 lines of 'LLVM :: CodeGen__Hexagon__absimm.ll':
7 llc 0x00000001054fa9b6 llvm::FPPassManager::runOnFunction(llvm::Function&) + 310
8 llc 0x00000001054fac2b llvm::FPPassManager::runOnModule(llvm::Module&) + 59
9 llc 0x00000001054faf18 llvm::MPPassManager::runOnModule(llvm::Module&) + 344
10 llc 0x00000001054fb556 llvm::PassManagerImpl::run(llvm::Module&) + 294
11 llc 0x00000001054fb74d llvm::PassManager::run(llvm::Module&) + 13
12 llc 0x0000000104b3cb30 main + 5872
13 llc 0x0000000104b3b434 start + 52
Stack dump:
0. Program arguments: /Users/buildslave/zorg/buildbot/smooshlab/slave-0.8/build.clang-x86_64-darwin11-nobootstrap-RAincremental/clang-build/Release+Asserts/bin/llc -march=hexagon -mcpu=hexagonv4
1. Running pass 'Function Pass Manager' on module '<stdin>'.
2. Running pass 'Hexagon Packetizer' on function '@f2'
FileCheck error: '-' is empty.
--
********************
Last 15 lines of 'LLVM :: CodeGen__Hexagon__absaddr-store.ll':
7 llc 0x00000001014089b6 llvm::FPPassManager::runOnFunction(llvm::Function&) + 310
8 llc 0x0000000101408c2b llvm::FPPassManager::runOnModule(llvm::Module&) + 59
9 llc 0x0000000101408f18 llvm::MPPassManager::runOnModule(llvm::Module&) + 344
10 llc 0x0000000101409556 llvm::PassManagerImpl::run(llvm::Module&) + 294
11 llc 0x000000010140974d llvm::PassManager::run(llvm::Module&) + 13
12 llc 0x0000000100a4ab30 main + 5872
13 llc 0x0000000100a49434 start + 52
Stack dump:
0. Program arguments: /Users/buildslave/zorg/buildbot/smooshlab/slave-0.8/build.clang-x86_64-darwin11-nobootstrap-RAincremental/clang-build/Release+Asserts/bin/llc -march=hexagon -mcpu=hexagonv4
1. Running pass 'Function Pass Manager' on module '<stdin>'.
2. Running pass 'Hexagon Packetizer' on function '@absStoreWord'
FileCheck error: '-' is empty.
--
********************
Last 15 lines of 'LLVM :: CodeGen__Hexagon__ashift-left-right.ll':
7 llc 0x0000000107bd29b6 llvm::FPPassManager::runOnFunction(llvm::Function&) + 310
8 llc 0x0000000107bd2c2b llvm::FPPassManager::runOnModule(llvm::Module&) + 59
9 llc 0x0000000107bd2f18 llvm::MPPassManager::runOnModule(llvm::Module&) + 344
10 llc 0x0000000107bd3556 llvm::PassManagerImpl::run(llvm::Module&) + 294
11 llc 0x0000000107bd374d llvm::PassManager::run(llvm::Module&) + 13
12 llc 0x0000000107214b30 main + 5872
13 llc 0x0000000107213434 start + 52
Stack dump:
0. Program arguments: /Users/buildslave/zorg/buildbot/smooshlab/slave-0.8/build.clang-x86_64-darwin11-nobootstrap-RAincremental/clang-build/Release+Asserts/bin/llc -march=hexagon -mcpu=hexagonv4
1. Running pass 'Function Pass Manager' on module '<stdin>'.
2. Running pass 'Hexagon Packetizer' on function '@bar'
FileCheck error: '-' is empty.
--
********************
Last 15 lines of 'LLVM :: CodeGen__Hexagon__block-addr.ll':
8 llc 0x000000010df2ec2b llvm::FPPassManager::runOnModule(llvm::Module&) + 59
9 llc 0x000000010df2ef18 llvm::MPPassManager::runOnModule(llvm::Module&) + 344
10 llc 0x000000010df2f556 llvm::PassManagerImpl::run(llvm::Module&) + 294
11 llc 0x000000010df2f74d llvm::PassManager::run(llvm::Module&) + 13
12 llc 0x000000010d570b30 main + 5872
13 llc 0x000000010d56f434 start + 52
14 llc 0x0000000000000002 start + 4071164930
Stack dump:
0. Program arguments: /Users/buildslave/zorg/buildbot/smooshlab/slave-0.8/build.clang-x86_64-darwin11-nobootstrap-RAincremental/clang-build/Release+Asserts/bin/llc -march=hexagon
1. Running pass 'Function Pass Manager' on module '<stdin>'.
2. Running pass 'Hexagon Packetizer' on function '@main'
FileCheck error: '-' is empty.
--
********************
Last 15 lines of 'LLVM :: CodeGen__Hexagon__cext-check.ll':
7 llc 0x0000000105b1b9b6 llvm::FPPassManager::runOnFunction(llvm::Function&) + 310
8 llc 0x0000000105b1bc2b llvm::FPPassManager::runOnModule(llvm::Module&) + 59
9 llc 0x0000000105b1bf18 llvm::MPPassManager::runOnModule(llvm::Module&) + 344
10 llc 0x0000000105b1c556 llvm::PassManagerImpl::run(llvm::Module&) + 294
11 llc 0x0000000105b1c74d llvm::PassManager::run(llvm::Module&) + 13
12 llc 0x000000010515db30 main + 5872
13 llc 0x000000010515c434 start + 52
Stack dump:
0. Program arguments: /Users/buildslave/zorg/buildbot/smooshlab/slave-0.8/build.clang-x86_64-darwin11-nobootstrap-RAincremental/clang-build/Release+Asserts/bin/llc -march=hexagon -mcpu=hexagonv4
1. Running pass 'Function Pass Manager' on module '<stdin>'.
2. Running pass 'Hexagon Packetizer' on function '@cext_test1'
FileCheck error: '-' is empty.
--
********************
Last 15 lines of 'LLVM :: CodeGen__Hexagon__cext-valid-packet1.ll':
7 llc 0x00000001012129b6 llvm::FPPassManager::runOnFunction(llvm::Function&) + 310
8 llc 0x0000000101212c2b llvm::FPPassManager::runOnModule(llvm::Module&) + 59
9 llc 0x0000000101212f18 llvm::MPPassManager::runOnModule(llvm::Module&) + 344
10 llc 0x0000000101213556 llvm::PassManagerImpl::run(llvm::Module&) + 294
11 llc 0x000000010121374d llvm::PassManager::run(llvm::Module&) + 13
12 llc 0x0000000100854b30 main + 5872
13 llc 0x0000000100853434 start + 52
Stack dump:
0. Program arguments: /Users/buildslave/zorg/buildbot/smooshlab/slave-0.8/build.clang-x86_64-darwin11-nobootstrap-RAincremental/clang-build/Release+Asserts/bin/llc -march=hexagon -mcpu=hexagonv4
1. Running pass 'Function Pass Manager' on module '<stdin>'.
2. Running pass 'Hexagon Packetizer' on function '@check-packet1'
FileCheck error: '-' is empty.
--
********************
Last 15 lines of 'LLVM :: CodeGen__Hexagon__cmp-to-genreg.ll':
7 llc 0x00000001047989b6 llvm::FPPassManager::runOnFunction(llvm::Function&) + 310
8 llc 0x0000000104798c2b llvm::FPPassManager::runOnModule(llvm::Module&) + 59
9 llc 0x0000000104798f18 llvm::MPPassManager::runOnModule(llvm::Module&) + 344
10 llc 0x0000000104799556 llvm::PassManagerImpl::run(llvm::Module&) + 294
11 llc 0x000000010479974d llvm::PassManager::run(llvm::Module&) + 13
12 llc 0x0000000103ddab30 main + 5872
13 llc 0x0000000103dd9434 start + 52
Stack dump:
0. Program arguments: /Users/buildslave/zorg/buildbot/smooshlab/slave-0.8/build.clang-x86_64-darwin11-nobootstrap-RAincremental/clang-build/Release+Asserts/bin/llc -march=hexagon -mcpu=hexagonv4
1. Running pass 'Function Pass Manager' on module '<stdin>'.
2. Running pass 'Hexagon Packetizer' on function '@compare1'
FileCheck error: '-' is empty.
--
********************
Last 15 lines of 'LLVM :: CodeGen__Hexagon__cmp-to-predreg.ll':
7 llc 0x0000000104d989b6 llvm::FPPassManager::runOnFunction(llvm::Function&) + 310
8 llc 0x0000000104d98c2b llvm::FPPassManager::runOnModule(llvm::Module&) + 59
9 llc 0x0000000104d98f18 llvm::MPPassManager::runOnModule(llvm::Module&) + 344
10 llc 0x0000000104d99556 llvm::PassManagerImpl::run(llvm::Module&) + 294
11 llc 0x0000000104d9974d llvm::PassManager::run(llvm::Module&) + 13
12 llc 0x00000001043dab30 main + 5872
13 llc 0x00000001043d9434 start + 52
Stack dump:
0. Program arguments: /Users/buildslave/zorg/buildbot/smooshlab/slave-0.8/build.clang-x86_64-darwin11-nobootstrap-RAincremental/clang-build/Release+Asserts/bin/llc -march=hexagon -mcpu=hexagonv4
1. Running pass 'Function Pass Manager' on module '<stdin>'.
2. Running pass 'Hexagon Packetizer' on function '@compare1'
FileCheck error: '-' is empty.
--
********************
Last 15 lines of 'LLVM :: CodeGen__Hexagon__cmp_pred.ll':
7 llc 0x000000010f0859b6 llvm::FPPassManager::runOnFunction(llvm::Function&) + 310
8 llc 0x000000010f085c2b llvm::FPPassManager::runOnModule(llvm::Module&) + 59
9 llc 0x000000010f085f18 llvm::MPPassManager::runOnModule(llvm::Module&) + 344
10 llc 0x000000010f086556 llvm::PassManagerImpl::run(llvm::Module&) + 294
11 llc 0x000000010f08674d llvm::PassManager::run(llvm::Module&) + 13
12 llc 0x000000010e6c7b30 main + 5872
13 llc 0x000000010e6c6434 start + 52
Stack dump:
0. Program arguments: /Users/buildslave/zorg/buildbot/smooshlab/slave-0.8/build.clang-x86_64-darwin11-nobootstrap-RAincremental/clang-build/Release+Asserts/bin/llc -march=hexagon -mcpu=hexagonv5
1. Running pass 'Function Pass Manager' on module '<stdin>'.
2. Running pass 'Hexagon Packetizer' on function '@Func_3Ugt'
FileCheck error: '-' is empty.
--
********************
Last 15 lines of 'LLVM :: CodeGen__Hexagon__cmp_pred2.ll':
7 llc 0x000000010f76e9b6 llvm::FPPassManager::runOnFunction(llvm::Function&) + 310
8 llc 0x000000010f76ec2b llvm::FPPassManager::runOnModule(llvm::Module&) + 59
9 llc 0x000000010f76ef18 llvm::MPPassManager::runOnModule(llvm::Module&) + 344
10 llc 0x000000010f76f556 llvm::PassManagerImpl::run(llvm::Module&) + 294
11 llc 0x000000010f76f74d llvm::PassManager::run(llvm::Module&) + 13
12 llc 0x000000010edb0b30 main + 5872
13 llc 0x000000010edaf434 start + 52
Stack dump:
0. Program arguments: /Users/buildslave/zorg/buildbot/smooshlab/slave-0.8/build.clang-x86_64-darwin11-nobootstrap-RAincremental/clang-build/Release+Asserts/bin/llc -march=hexagon -mcpu=hexagonv5
1. Running pass 'Function Pass Manager' on module '<stdin>'.
2. Running pass 'Hexagon Packetizer' on function '@test4'
FileCheck error: '-' is empty.
--
********************
Last 15 lines of 'LLVM :: CodeGen__Hexagon__cmp_pred_reg.ll':
7 llc 0x000000010396f9b6 llvm::FPPassManager::runOnFunction(llvm::Function&) + 310
8 llc 0x000000010396fc2b llvm::FPPassManager::runOnModule(llvm::Module&) + 59
9 llc 0x000000010396ff18 llvm::MPPassManager::runOnModule(llvm::Module&) + 344
10 llc 0x0000000103970556 llvm::PassManagerImpl::run(llvm::Module&) + 294
11 llc 0x000000010397074d llvm::PassManager::run(llvm::Module&) + 13
12 llc 0x0000000102fb1b30 main + 5872
13 llc 0x0000000102fb0434 start + 52
Stack dump:
0. Program arguments: /Users/buildslave/zorg/buildbot/smooshlab/slave-0.8/build.clang-x86_64-darwin11-nobootstrap-RAincremental/clang-build/Release+Asserts/bin/llc -march=hexagon -mcpu=hexagonv5
1. Running pass 'Function Pass Manager' on module '<stdin>'.
2. Running pass 'Hexagon Packetizer' on function '@Func_3Ugt'
FileCheck error: '-' is empty.
--
********************
Last 15 lines of 'LLVM :: CodeGen__Hexagon__cmpb_pred.ll':
7 llc 0x000000010e5f99b6 llvm::FPPassManager::runOnFunction(llvm::Function&) + 310
8 llc 0x000000010e5f9c2b llvm::FPPassManager::runOnModule(llvm::Module&) + 59
9 llc 0x000000010e5f9f18 llvm::MPPassManager::runOnModule(llvm::Module&) + 344
10 llc 0x000000010e5fa556 llvm::PassManagerImpl::run(llvm::Module&) + 294
11 llc 0x000000010e5fa74d llvm::PassManager::run(llvm::Module&) + 13
12 llc 0x000000010dc3bb30 main + 5872
13 llc 0x000000010dc3a434 start + 52
Stack dump:
0. Program arguments: /Users/buildslave/zorg/buildbot/smooshlab/slave-0.8/build.clang-x86_64-darwin11-nobootstrap-RAincremental/clang-build/Release+Asserts/bin/llc -march=hexagon -mcpu=hexagonv5
1. Running pass 'Function Pass Manager' on module '<stdin>'.
2. Running pass 'Hexagon Packetizer' on function '@Func_3h'
FileCheck error: '-' is empty.
--
********************
Last 15 lines of 'LLVM :: CodeGen__Hexagon__combine.ll':
7 llc 0x0000000101eca9b6 llvm::FPPassManager::runOnFunction(llvm::Function&) + 310
8 llc 0x0000000101ecac2b llvm::FPPassManager::runOnModule(llvm::Module&) + 59
9 llc 0x0000000101ecaf18 llvm::MPPassManager::runOnModule(llvm::Module&) + 344
10 llc 0x0000000101ecb556 llvm::PassManagerImpl::run(llvm::Module&) + 294
11 llc 0x0000000101ecb74d llvm::PassManager::run(llvm::Module&) + 13
12 llc 0x000000010150cb30 main + 5872
13 llc 0x000000010150b434 start + 52
Stack dump:
0. Program arguments: /Users/buildslave/zorg/buildbot/smooshlab/slave-0.8/build.clang-x86_64-darwin11-nobootstrap-RAincremental/clang-build/Release+Asserts/bin/llc -march=hexagon -mcpu=hexagonv4
1. Running pass 'Function Pass Manager' on module '<stdin>'.
2. Running pass 'Hexagon Packetizer' on function '@foo'
FileCheck error: '-' is empty.
--
********************
Last 15 lines of 'LLVM :: CodeGen__Hexagon__combine_ir.ll':
7 llc 0x00000001075a19b6 llvm::FPPassManager::runOnFunction(llvm::Function&) + 310
8 llc 0x00000001075a1c2b llvm::FPPassManager::runOnModule(llvm::Module&) + 59
9 llc 0x00000001075a1f18 llvm::MPPassManager::runOnModule(llvm::Module&) + 344
10 llc 0x00000001075a2556 llvm::PassManagerImpl::run(llvm::Module&) + 294
11 llc 0x00000001075a274d llvm::PassManager::run(llvm::Module&) + 13
12 llc 0x0000000106be3b30 main + 5872
13 llc 0x0000000106be2434 start + 52
Stack dump:
0. Program arguments: /Users/buildslave/zorg/buildbot/smooshlab/slave-0.8/build.clang-x86_64-darwin11-nobootstrap-RAincremental/clang-build/Release+Asserts/bin/llc -march=hexagon -mcpu=hexagonv4
1. Running pass 'Function Pass Manager' on module '<stdin>'.
2. Running pass 'Hexagon Packetizer' on function '@word'
FileCheck error: '-' is empty.
--
********************
Last 15 lines of 'LLVM :: CodeGen__Hexagon__double.ll':
7 llc 0x00000001083499b6 llvm::FPPassManager::runOnFunction(llvm::Function&) + 310
8 llc 0x0000000108349c2b llvm::FPPassManager::runOnModule(llvm::Module&) + 59
9 llc 0x0000000108349f18 llvm::MPPassManager::runOnModule(llvm::Module&) + 344
10 llc 0x000000010834a556 llvm::PassManagerImpl::run(llvm::Module&) + 294
11 llc 0x000000010834a74d llvm::PassManager::run(llvm::Module&) + 13
12 llc 0x000000010798bb30 main + 5872
13 llc 0x000000010798a434 start + 52
Stack dump:
0. Program arguments: /Users/buildslave/zorg/buildbot/smooshlab/slave-0.8/build.clang-x86_64-darwin11-nobootstrap-RAincremental/clang-build/Release+Asserts/bin/llc -march=hexagon -mcpu=hexagonv4
1. Running pass 'Function Pass Manager' on module '<stdin>'.
2. Running pass 'Hexagon Packetizer' on function '@foo'
FileCheck error: '-' is empty.
--
********************
Last 15 lines of 'LLVM :: CodeGen__Hexagon__dualstore.ll':
7 llc 0x00000001075c89b6 llvm::FPPassManager::runOnFunction(llvm::Function&) + 310
8 llc 0x00000001075c8c2b llvm::FPPassManager::runOnModule(llvm::Module&) + 59
9 llc 0x00000001075c8f18 llvm::MPPassManager::runOnModule(llvm::Module&) + 344
10 llc 0x00000001075c9556 llvm::PassManagerImpl::run(llvm::Module&) + 294
11 llc 0x00000001075c974d llvm::PassManager::run(llvm::Module&) + 13
12 llc 0x0000000106c0ab30 main + 5872
13 llc 0x0000000106c09434 start + 52
Stack dump:
0. Program arguments: /Users/buildslave/zorg/buildbot/smooshlab/slave-0.8/build.clang-x86_64-darwin11-nobootstrap-RAincremental/clang-build/Release+Asserts/bin/llc -march=hexagon -mcpu=hexagonv4 -disable-hexagon-misched
1. Running pass 'Function Pass Manager' on module '<stdin>'.
2. Running pass 'Hexagon Packetizer' on function '@main'
FileCheck error: '-' is empty.
--
********************
Last 15 lines of 'LLVM :: CodeGen__Hexagon__fcmp.ll':
7 llc 0x000000010c9bb9b6 llvm::FPPassManager::runOnFunction(llvm::Function&) + 310
8 llc 0x000000010c9bbc2b llvm::FPPassManager::runOnModule(llvm::Module&) + 59
9 llc 0x000000010c9bbf18 llvm::MPPassManager::runOnModule(llvm::Module&) + 344
10 llc 0x000000010c9bc556 llvm::PassManagerImpl::run(llvm::Module&) + 294
11 llc 0x000000010c9bc74d llvm::PassManager::run(llvm::Module&) + 13
12 llc 0x000000010bffdb30 main + 5872
13 llc 0x000000010bffc434 start + 52
Stack dump:
0. Program arguments: /Users/buildslave/zorg/buildbot/smooshlab/slave-0.8/build.clang-x86_64-darwin11-nobootstrap-RAincremental/clang-build/Release+Asserts/bin/llc -march=hexagon -mcpu=hexagonv5
1. Running pass 'Function Pass Manager' on module '<stdin>'.
2. Running pass 'Hexagon Packetizer' on function '@foo'
FileCheck error: '-' is empty.
--
********************
Last 15 lines of 'LLVM :: CodeGen__Hexagon__fusedandshift.ll':
7 llc 0x0000000103b7e9b6 llvm::FPPassManager::runOnFunction(llvm::Function&) + 310
8 llc 0x0000000103b7ec2b llvm::FPPassManager::runOnModule(llvm::Module&) + 59
9 llc 0x0000000103b7ef18 llvm::MPPassManager::runOnModule(llvm::Module&) + 344
10 llc 0x0000000103b7f556 llvm::PassManagerImpl::run(llvm::Module&) + 294
11 llc 0x0000000103b7f74d llvm::PassManager::run(llvm::Module&) + 13
12 llc 0x00000001031c0b30 main + 5872
13 llc 0x00000001031bf434 start + 52
Stack dump:
0. Program arguments: /Users/buildslave/zorg/buildbot/smooshlab/slave-0.8/build.clang-x86_64-darwin11-nobootstrap-RAincremental/clang-build/Release+Asserts/bin/llc -march=hexagon -mcpu=hexagonv4
1. Running pass 'Function Pass Manager' on module '<stdin>'.
2. Running pass 'Hexagon Packetizer' on function '@main'
FileCheck error: '-' is empty.
--
********************
Last 15 lines of 'warnings (1)':
lit.py: discovery.py:180: warning: test suite 'Extra Tools Unit Tests' contained no tests
More information about the llvm-testresults
mailing list