[llvm-testresults] buildbot failure in lab.llvm.org on clang-x86_64-darwin11-nobootstrap-RAincremental
llvmlab-buildmaster at lab.llvm.org
llvmlab-buildmaster at lab.llvm.org
Tue Jun 25 08:37:52 PDT 2013
The Buildbot has detected a failed build on builder clang-x86_64-darwin11-nobootstrap-RAincremental while building cfe.
Full details are available at:
http://lab.llvm.org:8013/builders/clang-x86_64-darwin11-nobootstrap-RAincremental/builds/3469
Buildbot URL: http://lab.llvm.org:8013/
Buildslave for this Build: xserve5
Build Reason: Triggerable(phase1-stage0)
Build Source Stamp: 184857
Blamelist:
BUILD FAILED: failed run.llvm.tests
sincerely,
-The Buildbot
================================================================================
CHANGES:
LOGS:
Last 15 lines of 'stdio':
PASS: LLVM-Unit :: Support/Release+Asserts/SupportTests/ValueHandle.AssertingVH_Asserts (14722 of 14723)
PASS: LLVM-Unit :: ADT/Release+Asserts/ADTTests/APFloatTest.StringHexadecimalExponentDeath (14723 of 14723)
1 warning(s) in tests.
Testing Time: 222.13s
********************
Failing Tests (1):
LLVM :: CodeGen/ARM/load-global.ll
Expected Passes : 14619
Expected Failures : 75
Unsupported Tests : 28
Unexpected Failures: 1
make[1]: *** [check-local-all] Error 1
make: *** [check-all] Error 2
Last 15 lines of 'LLVM :: CodeGen__ARM__load-global.ll':
--
/Users/buildslave/zorg/buildbot/smooshlab/slave-0.8/build.clang-x86_64-darwin11-nobootstrap-RAincremental/clang-build/Release+Asserts/bin/llc < /Users/buildslave/zorg/buildbot/smooshlab/slave-0.8/build.clang-x86_64-darwin11-nobootstrap-RAincremental/llvm/test/CodeGen/ARM/load-global.ll -mtriple=armv6-apple-darwin -relocation-model=static | /Users/buildslave/zorg/buildbot/smooshlab/slave-0.8/build.clang-x86_64-darwin11-nobootstrap-RAincremental/clang-build/Release+Asserts/bin/FileCheck /Users/buildslave/zorg/buildbot/smooshlab/slave-0.8/build.clang-x86_64-darwin11-nobootstrap-RAincremental/llvm/test/CodeGen/ARM/load-global.ll -check-prefix=STATIC
/Users/buildslave/zorg/buildbot/smooshlab/slave-0.8/build.clang-x86_64-darwin11-nobootstrap-RAincremental/clang-build/Release+Asserts/bin/llc < /Users/buildslave/zorg/buildbot/smooshlab/slave-0.8/build.clang-x86_64-darwin11-nobootstrap-RAincremental/llvm/test/CodeGen/ARM/load-global.ll -mtriple=armv6-apple-darwin -relocation-model=dynamic-no-pic | /Users/buildslave/zorg/buildbot/smooshlab/slave-0.8/build.clang-x86_64-darwin11-nobootstrap-RAincremental/clang-build/Release+Asserts/bin/FileCheck /Users/buildslave/zorg/buildbot/smooshlab/slave-0.8/build.clang-x86_64-darwin11-nobootstrap-RAincremental/llvm/test/CodeGen/ARM/load-global.ll -check-prefix=DYNAMIC
/Users/buildslave/zorg/buildbot/smooshlab/slave-0.8/build.clang-x86_64-darwin11-nobootstrap-RAincremental/clang-build/Release+Asserts/bin/llc < /Users/buildslave/zorg/buildbot/smooshlab/slave-0.8/build.clang-x86_64-darwin11-nobootstrap-RAincremental/llvm/test/CodeGen/ARM/load-global.ll -mtriple=armv6-apple-darwin -relocation-model=pic | /Users/buildslave/zorg/buildbot/smooshlab/slave-0.8/build.clang-x86_64-darwin11-nobootstrap-RAincremental/clang-build/Release+Asserts/bin/FileCheck /Users/buildslave/zorg/buildbot/smooshlab/slave-0.8/build.clang-x86_64-darwin11-nobootstrap-RAincremental/llvm/test/CodeGen/ARM/load-global.ll -check-prefix=PIC
/Users/buildslave/zorg/buildbot/smooshlab/slave-0.8/build.clang-x86_64-darwin11-nobootstrap-RAincremental/clang-build/Release+Asserts/bin/llc < /Users/buildslave/zorg/buildbot/smooshlab/slave-0.8/build.clang-x86_64-darwin11-nobootstrap-RAincremental/llvm/test/CodeGen/ARM/load-global.ll -mtriple=thumbv6-apple-darwin -relocation-model=pic | /Users/buildslave/zorg/buildbot/smooshlab/slave-0.8/build.clang-x86_64-darwin11-nobootstrap-RAincremental/clang-build/Release+Asserts/bin/FileCheck /Users/buildslave/zorg/buildbot/smooshlab/slave-0.8/build.clang-x86_64-darwin11-nobootstrap-RAincremental/llvm/test/CodeGen/ARM/load-global.ll -check-prefix=PIC_T
/Users/buildslave/zorg/buildbot/smooshlab/slave-0.8/build.clang-x86_64-darwin11-nobootstrap-RAincremental/clang-build/Release+Asserts/bin/llc < /Users/buildslave/zorg/buildbot/smooshlab/slave-0.8/build.clang-x86_64-darwin11-nobootstrap-RAincremental/llvm/test/CodeGen/ARM/load-global.ll -mtriple=armv7-apple-darwin -relocation-model=pic | /Users/buildslave/zorg/buildbot/smooshlab/slave-0.8/build.clang-x86_64-darwin11-nobootstrap-RAincremental/clang-build/Release+Asserts/bin/FileCheck /Users/buildslave/zorg/buildbot/smooshlab/slave-0.8/build.clang-x86_64-darwin11-nobootstrap-RAincremental/llvm/test/CodeGen/ARM/load-global.ll -check-prefix=PIC_V7
/Users/buildslave/zorg/buildbot/smooshlab/slave-0.8/build.clang-x86_64-darwin11-nobootstrap-RAincremental/clang-build/Release+Asserts/bin/llc < /Users/buildslave/zorg/buildbot/smooshlab/slave-0.8/build.clang-x86_64-darwin11-nobootstrap-RAincremental/llvm/test/CodeGen/ARM/load-global.ll -mtriple=armv6-linux-gnueabi -relocation-model=pic | /Users/buildslave/zorg/buildbot/smooshlab/slave-0.8/build.clang-x86_64-darwin11-nobootstrap-RAincremental/clang-build/Release+Asserts/bin/FileCheck /Users/buildslave/zorg/buildbot/smooshlab/slave-0.8/build.clang-x86_64-darwin11-nobootstrap-RAincremental/llvm/test/CodeGen/ARM/load-global.ll -check-prefix=LINUX
--
Exit Code: 2
Command Output (stderr):
--
FileCheck error: '-' is empty.
--
********************
Last 15 lines of 'warnings (1)':
lit.py: discovery.py:180: warning: test suite 'Extra Tools Unit Tests' contained no tests
More information about the llvm-testresults
mailing list