[llvm-testresults] buildbot failure in lab.llvm.org on clang-x86_64-darwin11-nobootstrap-RAincremental
llvmlab-buildmaster at lab.llvm.org
llvmlab-buildmaster at lab.llvm.org
Fri Jun 14 13:37:09 PDT 2013
The Buildbot has detected a new failure on builder clang-x86_64-darwin11-nobootstrap-RAincremental while building llvm.
Full details are available at:
http://lab.llvm.org:8013/builders/clang-x86_64-darwin11-nobootstrap-RAincremental/builds/3004
Buildbot URL: http://lab.llvm.org:8013/
Buildslave for this Build: xserve5
Build Reason: Triggerable(phase1-stage0)
Build Source Stamp: 184003
Blamelist:
BUILD FAILED: failed make
sincerely,
-The Buildbot
================================================================================
CHANGES:
LOGS:
Last 15 lines of 'stdio':
/Users/buildslave/zorg/buildbot/smooshlab/slave-0.8/build.clang-x86_64-darwin11-nobootstrap-RAincremental/llvm/tools/clang/tools/extra/unittests/cpp11-migrate/TransformTest.cpp:101:44: error: no member named 'GetCurrentDirectory' in 'llvm::sys::Path'
llvm::sys::Path FileA = llvm::sys::Path::GetCurrentDirectory();
~~~~~~~~~~~~~~~~~^
/Users/buildslave/zorg/buildbot/smooshlab/slave-0.8/build.clang-x86_64-darwin11-nobootstrap-RAincremental/llvm/tools/clang/tools/extra/unittests/cpp11-migrate/TransformTest.cpp:105:44: error: no member named 'GetCurrentDirectory' in 'llvm::sys::Path'
llvm::sys::Path FileB = llvm::sys::Path::GetCurrentDirectory();
~~~~~~~~~~~~~~~~~^
2 errors generated.
make[6]: *** [/Users/buildslave/zorg/buildbot/smooshlab/slave-0.8/build.clang-x86_64-darwin11-nobootstrap-RAincremental/clang-build/tools/clang/tools/extra/unittests/cpp11-migrate/Release+Asserts/TransformTest.o] Error 1
make[6]: *** Waiting for unfinished jobs....
make[5]: *** [cpp11-migrate/.makeall] Error 2
make[4]: *** [all] Error 1
make[3]: *** [all] Error 1
make[2]: *** [all] Error 1
make[1]: *** [clang/.makeall] Error 2
make: *** [all] Error 1
More information about the llvm-testresults
mailing list