[llvm-testresults] buildbot failure in lab.llvm.org on clang-x86_64-darwin11-nobootstrap-RAincremental
llvmlab-buildmaster at lab.llvm.org
llvmlab-buildmaster at lab.llvm.org
Thu Aug 1 16:34:16 PDT 2013
The Buildbot has detected a failed build on builder clang-x86_64-darwin11-nobootstrap-RAincremental while building cfe.
Full details are available at:
http://lab.llvm.org:8013/builders/clang-x86_64-darwin11-nobootstrap-RAincremental/builds/5278
Buildbot URL: http://lab.llvm.org:8013/
Buildslave for this Build: xserve5
Build Reason: Triggerable(phase1-stage0)
Build Source Stamp: 187630
Blamelist:
BUILD FAILED: failed run.llvm.tests
sincerely,
-The Buildbot
================================================================================
CHANGES:
LOGS:
Last 15 lines of 'stdio':
Clang :: Driver/O.c
Clang :: Driver/frame-pointer.c
Clang :: debuginfo-tests/aggregate-indirect-arg.cpp
Clang :: debuginfo-tests/ctor.cpp
Clang :: debuginfo-tests/forward-declare-class.cpp
Clang :: debuginfo-tests/nested-struct.cpp
Clang :: debuginfo-tests/sret.cpp
Clang :: debuginfo-tests/static-member.cpp
Expected Passes : 14931
Expected Failures : 73
Unsupported Tests : 32
Unexpected Failures: 16
make[1]: *** [check-local-all] Error 1
make: *** [check-all] Error 2
Last 15 lines of 'Clang :: ARCMT__objcmt-instancetype.m':
******************** TEST 'Clang :: ARCMT/objcmt-instancetype.m' FAILED ********************
Script:
--
rm -rf /Users/buildslave/zorg/buildbot/smooshlab/slave-0.8/build.clang-x86_64-darwin11-nobootstrap-RAincremental/clang-build/tools/clang/test/ARCMT/Output/objcmt-instancetype.m.tmp
/Users/buildslave/zorg/buildbot/smooshlab/slave-0.8/build.clang-x86_64-darwin11-nobootstrap-RAincremental/clang-build/Release+Asserts/bin/clang -cc1 -internal-isystem /Users/buildslave/zorg/buildbot/smooshlab/slave-0.8/build.clang-x86_64-darwin11-nobootstrap-RAincremental/clang-build/Release+Asserts/bin/../lib/clang/3.4/include -objcmt-migrate-property -mt-migrate-directory /Users/buildslave/zorg/buildbot/smooshlab/slave-0.8/build.clang-x86_64-darwin11-nobootstrap-RAincremental/clang-build/tools/clang/test/ARCMT/Output/objcmt-instancetype.m.tmp /Users/buildslave/zorg/buildbot/smooshlab/slave-0.8/build.clang-x86_64-darwin11-nobootstrap-RAincremental/clang.src/test/ARCMT/objcmt-instancetype.m -x objective-c -fobjc-runtime-has-weak -fobjc-arc -fobjc-default-synthesize-properties -triple x86_64-apple-darwin11
c-arcmt-test -mt-migrate-directory /Users/buildslave/zorg/buildbot/smooshlab/slave-0.8/build.clang-x86_64-darwin11-nobootstrap-RAincremental/clang-build/tools/clang/test/ARCMT/Output/objcmt-instancetype.m.tmp | arcmt-test -verify-transformed-files /Users/buildslave/zorg/buildbot/smooshlab/slave-0.8/build.clang-x86_64-darwin11-nobootstrap-RAincremental/clang.src/test/ARCMT/objcmt-instancetype.m.result
/Users/buildslave/zorg/buildbot/smooshlab/slave-0.8/build.clang-x86_64-darwin11-nobootstrap-RAincremental/clang-build/Release+Asserts/bin/clang -cc1 -internal-isystem /Users/buildslave/zorg/buildbot/smooshlab/slave-0.8/build.clang-x86_64-darwin11-nobootstrap-RAincremental/clang-build/Release+Asserts/bin/../lib/clang/3.4/include -triple x86_64-apple-darwin11 -fsyntax-only -x objective-c -fobjc-runtime-has-weak -fobjc-arc -fobjc-default-synthesize-properties /Users/buildslave/zorg/buildbot/smooshlab/slave-0.8/build.clang-x86_64-darwin11-nobootstrap-RAincremental/clang.src/test/ARCMT/objcmt-instancetype.m.result
--
Exit Code: 1
Command Output (stderr):
--
error: '/Users/buildslave/zorg/buildbot/smooshlab/slave-0.8/build.clang-x86_64-darwin11-nobootstrap-RAincremental/clang.src/test/ARCMT/objcmt-instancetype.m.result' is different than '/var/tmp/objcmt-instancetype.m-2dcd0e..m'
--
********************
Last 15 lines of 'Clang :: CodeGen__2010-03-09-DbgInfo.c':
8 clang 0x000000010918c60b clang::driver::Driver::BuildJobsForAction(clang::driver::Compilation&, clang::driver::Action const*, clang::driver::ToolChain const*, char const*, bool, bool, char const*, clang::driver::InputInfo&) const + 731
9 clang 0x00000001091889e5 clang::driver::Driver::BuildJobs(clang::driver::Compilation&) const + 613
10 clang 0x0000000109184d1e clang::driver::Driver::BuildCompilation(llvm::ArrayRef<char const*>) + 1838
11 clang 0x00000001090eae1f main + 9183
12 clang 0x00000001090e4334 start + 52
13 clang 0x0000000000000008 start + 4143037704
Stack dump:
0. Program arguments: /Users/buildslave/zorg/buildbot/smooshlab/slave-0.8/build.clang-x86_64-darwin11-nobootstrap-RAincremental/clang-build/Release+Asserts/bin/clang -emit-llvm -S -O0 -g /Users/buildslave/zorg/buildbot/smooshlab/slave-0.8/build.clang-x86_64-darwin11-nobootstrap-RAincremental/clang.src/test/CodeGen/2010-03-09-DbgInfo.c -o -
1. Compilation construction
2. Building compilation jobs
3. Building compilation jobs
4. Building compilation jobs
--
********************
Last 15 lines of 'Clang :: CodeGen__2010-02-18-Dbg-VectorType.c':
7 clang 0x000000010675495b clang::driver::Driver::BuildJobsForAction(clang::driver::Compilation&, clang::driver::Action const*, clang::driver::ToolChain const*, char const*, bool, bool, char const*, clang::driver::InputInfo&) const + 1579
8 clang 0x000000010675460b clang::driver::Driver::BuildJobsForAction(clang::driver::Compilation&, clang::driver::Action const*, clang::driver::ToolChain const*, char const*, bool, bool, char const*, clang::driver::InputInfo&) const + 731
9 clang 0x00000001067509e5 clang::driver::Driver::BuildJobs(clang::driver::Compilation&) const + 613
10 clang 0x000000010674cd1e clang::driver::Driver::BuildCompilation(llvm::ArrayRef<char const*>) + 1838
11 clang 0x00000001066b2e1f main + 9183
12 clang 0x00000001066ac334 start + 52
Stack dump:
0. Program arguments: /Users/buildslave/zorg/buildbot/smooshlab/slave-0.8/build.clang-x86_64-darwin11-nobootstrap-RAincremental/clang-build/Release+Asserts/bin/clang -emit-llvm -S -O0 -g /Users/buildslave/zorg/buildbot/smooshlab/slave-0.8/build.clang-x86_64-darwin11-nobootstrap-RAincremental/clang.src/test/CodeGen/2010-02-18-Dbg-VectorType.c -o -
1. Compilation construction
2. Building compilation jobs
3. Building compilation jobs
4. Building compilation jobs
--
********************
Last 15 lines of 'Clang :: CodeGen__call.c':
8 clang 0x0000000104d3560b clang::driver::Driver::BuildJobsForAction(clang::driver::Compilation&, clang::driver::Action const*, clang::driver::ToolChain const*, char const*, bool, bool, char const*, clang::driver::InputInfo&) const + 731
9 clang 0x0000000104d319e5 clang::driver::Driver::BuildJobs(clang::driver::Compilation&) const + 613
10 clang 0x0000000104d2dd1e clang::driver::Driver::BuildCompilation(llvm::ArrayRef<char const*>) + 1838
11 clang 0x0000000104c93e1f main + 9183
12 clang 0x0000000104c8d334 start + 52
Stack dump:
0. Program arguments: /Users/buildslave/zorg/buildbot/smooshlab/slave-0.8/build.clang-x86_64-darwin11-nobootstrap-RAincremental/clang-build/Release+Asserts/bin/clang /Users/buildslave/zorg/buildbot/smooshlab/slave-0.8/build.clang-x86_64-darwin11-nobootstrap-RAincremental/clang.src/test/CodeGen/call.c -O0 -emit-llvm -S -o -
1. Compilation construction
2. Building compilation jobs
3. Building compilation jobs
4. Building compilation jobs
FileCheck error: '-' is empty.
--
********************
Last 15 lines of 'Clang :: CodeGen__lifetime.c':
8 clang 0x000000010193260b clang::driver::Driver::BuildJobsForAction(clang::driver::Compilation&, clang::driver::Action const*, clang::driver::ToolChain const*, char const*, bool, bool, char const*, clang::driver::InputInfo&) const + 731
9 clang 0x000000010192e9e5 clang::driver::Driver::BuildJobs(clang::driver::Compilation&) const + 613
10 clang 0x000000010192ad1e clang::driver::Driver::BuildCompilation(llvm::ArrayRef<char const*>) + 1838
11 clang 0x0000000101890e1f main + 9183
12 clang 0x000000010188a334 start + 52
Stack dump:
0. Program arguments: /Users/buildslave/zorg/buildbot/smooshlab/slave-0.8/build.clang-x86_64-darwin11-nobootstrap-RAincremental/clang-build/Release+Asserts/bin/clang -S -emit-llvm -o - -O0 /Users/buildslave/zorg/buildbot/smooshlab/slave-0.8/build.clang-x86_64-darwin11-nobootstrap-RAincremental/clang.src/test/CodeGen/lifetime.c
1. Compilation construction
2. Building compilation jobs
3. Building compilation jobs
4. Building compilation jobs
FileCheck error: '-' is empty.
--
********************
Last 15 lines of 'Clang :: CodeGen__lifetime2.c':
8 clang 0x00000001053cc60b clang::driver::Driver::BuildJobsForAction(clang::driver::Compilation&, clang::driver::Action const*, clang::driver::ToolChain const*, char const*, bool, bool, char const*, clang::driver::InputInfo&) const + 731
9 clang 0x00000001053c89e5 clang::driver::Driver::BuildJobs(clang::driver::Compilation&) const + 613
10 clang 0x00000001053c4d1e clang::driver::Driver::BuildCompilation(llvm::ArrayRef<char const*>) + 1838
11 clang 0x000000010532ae1f main + 9183
12 clang 0x0000000105324334 start + 52
Stack dump:
0. Program arguments: /Users/buildslave/zorg/buildbot/smooshlab/slave-0.8/build.clang-x86_64-darwin11-nobootstrap-RAincremental/clang-build/Release+Asserts/bin/clang -S -emit-llvm -o - -O0 /Users/buildslave/zorg/buildbot/smooshlab/slave-0.8/build.clang-x86_64-darwin11-nobootstrap-RAincremental/clang.src/test/CodeGen/lifetime2.c
1. Compilation construction
2. Building compilation jobs
3. Building compilation jobs
4. Building compilation jobs
FileCheck error: '-' is empty.
--
********************
Last 15 lines of 'Clang :: CodeGenCXX__debug-info-static-member.cpp':
6 clang 0x000000010fa9592b clang::driver::tools::Clang::ConstructJob(clang::driver::Compilation&, clang::driver::JobAction const&, clang::driver::InputInfo const&, llvm::SmallVector<clang::driver::InputInfo, 4u> const&, llvm::opt::ArgList const&, char const*) const + 40987
7 clang 0x000000010fa6695b clang::driver::Driver::BuildJobsForAction(clang::driver::Compilation&, clang::driver::Action const*, clang::driver::ToolChain const*, char const*, bool, bool, char const*, clang::driver::InputInfo&) const + 1579
8 clang 0x000000010fa629e5 clang::driver::Driver::BuildJobs(clang::driver::Compilation&) const + 613
9 clang 0x000000010fa5ed1e clang::driver::Driver::BuildCompilation(llvm::ArrayRef<char const*>) + 1838
10 clang 0x000000010f9c4e1f main + 9183
11 clang 0x000000010f9be334 start + 52
Stack dump:
0. Program arguments: /Users/buildslave/zorg/buildbot/smooshlab/slave-0.8/build.clang-x86_64-darwin11-nobootstrap-RAincremental/clang-build/Release+Asserts/bin/clang --driver-mode=g++ -target x86_64-unknown-unknown -g -O0 /Users/buildslave/zorg/buildbot/smooshlab/slave-0.8/build.clang-x86_64-darwin11-nobootstrap-RAincremental/clang.src/test/CodeGenCXX/debug-info-static-member.cpp -emit-llvm -S -o -
1. Compilation construction
2. Building compilation jobs
3. Building compilation jobs
FileCheck error: '-' is empty.
--
********************
Last 15 lines of 'Clang :: CodeGenCXX__debug-info-zero-length-arrays.cpp':
6 clang 0x00000001095d292b clang::driver::tools::Clang::ConstructJob(clang::driver::Compilation&, clang::driver::JobAction const&, clang::driver::InputInfo const&, llvm::SmallVector<clang::driver::InputInfo, 4u> const&, llvm::opt::ArgList const&, char const*) const + 40987
7 clang 0x00000001095a395b clang::driver::Driver::BuildJobsForAction(clang::driver::Compilation&, clang::driver::Action const*, clang::driver::ToolChain const*, char const*, bool, bool, char const*, clang::driver::InputInfo&) const + 1579
8 clang 0x000000010959f9e5 clang::driver::Driver::BuildJobs(clang::driver::Compilation&) const + 613
9 clang 0x000000010959bd1e clang::driver::Driver::BuildCompilation(llvm::ArrayRef<char const*>) + 1838
10 clang 0x0000000109501e1f main + 9183
11 clang 0x00000001094fb334 start + 52
Stack dump:
0. Program arguments: /Users/buildslave/zorg/buildbot/smooshlab/slave-0.8/build.clang-x86_64-darwin11-nobootstrap-RAincremental/clang-build/Release+Asserts/bin/clang -target x86_64-unknown-unknown -fverbose-asm -g -O0 -S -emit-llvm /Users/buildslave/zorg/buildbot/smooshlab/slave-0.8/build.clang-x86_64-darwin11-nobootstrap-RAincremental/clang.src/test/CodeGenCXX/debug-info-zero-length-arrays.cpp -o -
1. Compilation construction
2. Building compilation jobs
3. Building compilation jobs
FileCheck error: '-' is empty.
--
********************
Last 15 lines of 'Clang :: Driver__O.c':
******************** TEST 'Clang :: Driver/O.c' FAILED ********************
Script:
--
/Users/buildslave/zorg/buildbot/smooshlab/slave-0.8/build.clang-x86_64-darwin11-nobootstrap-RAincremental/clang-build/Release+Asserts/bin/clang -O -### /Users/buildslave/zorg/buildbot/smooshlab/slave-0.8/build.clang-x86_64-darwin11-nobootstrap-RAincremental/clang.src/test/Driver/O.c 2>&1 | FileCheck -check-prefix=CHECK-O /Users/buildslave/zorg/buildbot/smooshlab/slave-0.8/build.clang-x86_64-darwin11-nobootstrap-RAincremental/clang.src/test/Driver/O.c
/Users/buildslave/zorg/buildbot/smooshlab/slave-0.8/build.clang-x86_64-darwin11-nobootstrap-RAincremental/clang-build/Release+Asserts/bin/clang -O0 -### /Users/buildslave/zorg/buildbot/smooshlab/slave-0.8/build.clang-x86_64-darwin11-nobootstrap-RAincremental/clang.src/test/Driver/O.c 2>&1 | FileCheck -check-prefix=CHECK-O0 /Users/buildslave/zorg/buildbot/smooshlab/slave-0.8/build.clang-x86_64-darwin11-nobootstrap-RAincremental/clang.src/test/Driver/O.c
/Users/buildslave/zorg/buildbot/smooshlab/slave-0.8/build.clang-x86_64-darwin11-nobootstrap-RAincremental/clang-build/Release+Asserts/bin/clang -O1 -### /Users/buildslave/zorg/buildbot/smooshlab/slave-0.8/build.clang-x86_64-darwin11-nobootstrap-RAincremental/clang.src/test/Driver/O.c 2>&1 | FileCheck -check-prefix=CHECK-O1 /Users/buildslave/zorg/buildbot/smooshlab/slave-0.8/build.clang-x86_64-darwin11-nobootstrap-RAincremental/clang.src/test/Driver/O.c
--
Exit Code: 132
Command Output (stderr):
--
/Users/buildslave/zorg/buildbot/smooshlab/slave-0.8/build.clang-x86_64-darwin11-nobootstrap-RAincremental/clang-build/tools/clang/test/Driver/Output/O.c.script: line 3: 49442 Illegal instruction: 4 /Users/buildslave/zorg/buildbot/smooshlab/slave-0.8/build.clang-x86_64-darwin11-nobootstrap-RAincremental/clang-build/Release+Asserts/bin/clang -O0 -### /Users/buildslave/zorg/buildbot/smooshlab/slave-0.8/build.clang-x86_64-darwin11-nobootstrap-RAincremental/clang.src/test/Driver/O.c 2>&1
49443 Done | FileCheck -check-prefix=CHECK-O0 /Users/buildslave/zorg/buildbot/smooshlab/slave-0.8/build.clang-x86_64-darwin11-nobootstrap-RAincremental/clang.src/test/Driver/O.c
--
********************
Last 15 lines of 'Clang :: Driver__frame-pointer.c':
Exit Code: 1
Command Output (stderr):
--
/Users/buildslave/zorg/buildbot/smooshlab/slave-0.8/build.clang-x86_64-darwin11-nobootstrap-RAincremental/clang.src/test/Driver/frame-pointer.c:19:15: error: expected string not found in input
// CHECK0-32: -mdisable-fp-elim
^
<stdin>:1:1: note: scanning from here
clang version 3.4 (trunk 187630)
^
<stdin>:3:8: note: possible intended match here
Thread model: posix
^
--
********************
Last 15 lines of 'Clang :: debuginfo-tests__ctor.cpp':
8 clang 0x000000010b86760b clang::driver::Driver::BuildJobsForAction(clang::driver::Compilation&, clang::driver::Action const*, clang::driver::ToolChain const*, char const*, bool, bool, char const*, clang::driver::InputInfo&) const + 731
9 clang 0x000000010b8639e5 clang::driver::Driver::BuildJobs(clang::driver::Compilation&) const + 613
10 clang 0x000000010b85fd1e clang::driver::Driver::BuildCompilation(llvm::ArrayRef<char const*>) + 1838
11 clang 0x000000010b7c5e1f main + 9183
12 clang 0x000000010b7bf334 start + 52
Stack dump:
0. Program arguments: /Users/buildslave/zorg/buildbot/smooshlab/slave-0.8/build.clang-x86_64-darwin11-nobootstrap-RAincremental/clang-build/Release+Asserts/bin/clang --driver-mode=g++ -O0 -g /Users/buildslave/zorg/buildbot/smooshlab/slave-0.8/build.clang-x86_64-darwin11-nobootstrap-RAincremental/clang.src/test/debuginfo-tests/ctor.cpp -c -o /Users/buildslave/zorg/buildbot/smooshlab/slave-0.8/build.clang-x86_64-darwin11-nobootstrap-RAincremental/clang-build/tools/clang/test/debuginfo-tests/Output/ctor.cpp.tmp.o
1. Compilation construction
2. Building compilation jobs
3. Building compilation jobs
4. Building compilation jobs
/Users/buildslave/zorg/buildbot/smooshlab/slave-0.8/build.clang-x86_64-darwin11-nobootstrap-RAincremental/clang-build/tools/clang/test/debuginfo-tests/Output/ctor.cpp.script: line 3: 61849 Illegal instruction: 4 /Users/buildslave/zorg/buildbot/smooshlab/slave-0.8/build.clang-x86_64-darwin11-nobootstrap-RAincremental/clang-build/Release+Asserts/bin/clang --driver-mode=g++ -O0 -g /Users/buildslave/zorg/buildbot/smooshlab/slave-0.8/build.clang-x86_64-darwin11-nobootstrap-RAincremental/clang.src/test/debuginfo-tests/ctor.cpp -c -o /Users/buildslave/zorg/buildbot/smooshlab/slave-0.8/build.clang-x86_64-darwin11-nobootstrap-RAincremental/clang-build/tools/clang/test/debuginfo-tests/Output/ctor.cpp.tmp.o
--
********************
Last 15 lines of 'Clang :: debuginfo-tests__aggregate-indirect-arg.cpp':
8 clang 0x000000010cee460b clang::driver::Driver::BuildJobsForAction(clang::driver::Compilation&, clang::driver::Action const*, clang::driver::ToolChain const*, char const*, bool, bool, char const*, clang::driver::InputInfo&) const + 731
9 clang 0x000000010cee09e5 clang::driver::Driver::BuildJobs(clang::driver::Compilation&) const + 613
10 clang 0x000000010cedcd1e clang::driver::Driver::BuildCompilation(llvm::ArrayRef<char const*>) + 1838
11 clang 0x000000010ce42e1f main + 9183
12 clang 0x000000010ce3c334 start + 52
Stack dump:
0. Program arguments: /Users/buildslave/zorg/buildbot/smooshlab/slave-0.8/build.clang-x86_64-darwin11-nobootstrap-RAincremental/clang-build/Release+Asserts/bin/clang --driver-mode=g++ -O0 -g /Users/buildslave/zorg/buildbot/smooshlab/slave-0.8/build.clang-x86_64-darwin11-nobootstrap-RAincremental/clang.src/test/debuginfo-tests/aggregate-indirect-arg.cpp -c -o /Users/buildslave/zorg/buildbot/smooshlab/slave-0.8/build.clang-x86_64-darwin11-nobootstrap-RAincremental/clang-build/tools/clang/test/debuginfo-tests/Output/aggregate-indirect-arg.cpp.tmp.o
1. Compilation construction
2. Building compilation jobs
3. Building compilation jobs
4. Building compilation jobs
/Users/buildslave/zorg/buildbot/smooshlab/slave-0.8/build.clang-x86_64-darwin11-nobootstrap-RAincremental/clang-build/tools/clang/test/debuginfo-tests/Output/aggregate-indirect-arg.cpp.script: line 3: 61846 Illegal instruction: 4 /Users/buildslave/zorg/buildbot/smooshlab/slave-0.8/build.clang-x86_64-darwin11-nobootstrap-RAincremental/clang-build/Release+Asserts/bin/clang --driver-mode=g++ -O0 -g /Users/buildslave/zorg/buildbot/smooshlab/slave-0.8/build.clang-x86_64-darwin11-nobootstrap-RAincremental/clang.src/test/debuginfo-tests/aggregate-indirect-arg.cpp -c -o /Users/buildslave/zorg/buildbot/smooshlab/slave-0.8/build.clang-x86_64-darwin11-nobootstrap-RAincremental/clang-build/tools/clang/test/debuginfo-tests/Output/aggregate-indirect-arg.cpp.tmp.o
--
********************
Last 15 lines of 'Clang :: debuginfo-tests__forward-declare-class.cpp':
8 clang 0x000000010d5b160b clang::driver::Driver::BuildJobsForAction(clang::driver::Compilation&, clang::driver::Action const*, clang::driver::ToolChain const*, char const*, bool, bool, char const*, clang::driver::InputInfo&) const + 731
9 clang 0x000000010d5ad9e5 clang::driver::Driver::BuildJobs(clang::driver::Compilation&) const + 613
10 clang 0x000000010d5a9d1e clang::driver::Driver::BuildCompilation(llvm::ArrayRef<char const*>) + 1838
11 clang 0x000000010d50fe1f main + 9183
12 clang 0x000000010d509334 start + 52
Stack dump:
0. Program arguments: /Users/buildslave/zorg/buildbot/smooshlab/slave-0.8/build.clang-x86_64-darwin11-nobootstrap-RAincremental/clang-build/Release+Asserts/bin/clang --driver-mode=g++ -O0 -g /Users/buildslave/zorg/buildbot/smooshlab/slave-0.8/build.clang-x86_64-darwin11-nobootstrap-RAincremental/clang.src/test/debuginfo-tests/forward-declare-class.cpp -c -o /Users/buildslave/zorg/buildbot/smooshlab/slave-0.8/build.clang-x86_64-darwin11-nobootstrap-RAincremental/clang-build/tools/clang/test/debuginfo-tests/Output/forward-declare-class.cpp.tmp.o
1. Compilation construction
2. Building compilation jobs
3. Building compilation jobs
4. Building compilation jobs
/Users/buildslave/zorg/buildbot/smooshlab/slave-0.8/build.clang-x86_64-darwin11-nobootstrap-RAincremental/clang-build/tools/clang/test/debuginfo-tests/Output/forward-declare-class.cpp.script: line 2: 61857 Illegal instruction: 4 /Users/buildslave/zorg/buildbot/smooshlab/slave-0.8/build.clang-x86_64-darwin11-nobootstrap-RAincremental/clang-build/Release+Asserts/bin/clang --driver-mode=g++ -O0 -g /Users/buildslave/zorg/buildbot/smooshlab/slave-0.8/build.clang-x86_64-darwin11-nobootstrap-RAincremental/clang.src/test/debuginfo-tests/forward-declare-class.cpp -c -o /Users/buildslave/zorg/buildbot/smooshlab/slave-0.8/build.clang-x86_64-darwin11-nobootstrap-RAincremental/clang-build/tools/clang/test/debuginfo-tests/Output/forward-declare-class.cpp.tmp.o
--
********************
Last 15 lines of 'Clang :: debuginfo-tests__nested-struct.cpp':
8 clang 0x00000001082f560b clang::driver::Driver::BuildJobsForAction(clang::driver::Compilation&, clang::driver::Action const*, clang::driver::ToolChain const*, char const*, bool, bool, char const*, clang::driver::InputInfo&) const + 731
9 clang 0x00000001082f19e5 clang::driver::Driver::BuildJobs(clang::driver::Compilation&) const + 613
10 clang 0x00000001082edd1e clang::driver::Driver::BuildCompilation(llvm::ArrayRef<char const*>) + 1838
11 clang 0x0000000108253e1f main + 9183
12 clang 0x000000010824d334 start + 52
Stack dump:
0. Program arguments: /Users/buildslave/zorg/buildbot/smooshlab/slave-0.8/build.clang-x86_64-darwin11-nobootstrap-RAincremental/clang-build/Release+Asserts/bin/clang --driver-mode=g++ -O0 -g /Users/buildslave/zorg/buildbot/smooshlab/slave-0.8/build.clang-x86_64-darwin11-nobootstrap-RAincremental/clang.src/test/debuginfo-tests/nested-struct.cpp -c -o /Users/buildslave/zorg/buildbot/smooshlab/slave-0.8/build.clang-x86_64-darwin11-nobootstrap-RAincremental/clang-build/tools/clang/test/debuginfo-tests/Output/nested-struct.cpp.tmp.o
1. Compilation construction
2. Building compilation jobs
3. Building compilation jobs
4. Building compilation jobs
/Users/buildslave/zorg/buildbot/smooshlab/slave-0.8/build.clang-x86_64-darwin11-nobootstrap-RAincremental/clang-build/tools/clang/test/debuginfo-tests/Output/nested-struct.cpp.script: line 2: 61877 Illegal instruction: 4 /Users/buildslave/zorg/buildbot/smooshlab/slave-0.8/build.clang-x86_64-darwin11-nobootstrap-RAincremental/clang-build/Release+Asserts/bin/clang --driver-mode=g++ -O0 -g /Users/buildslave/zorg/buildbot/smooshlab/slave-0.8/build.clang-x86_64-darwin11-nobootstrap-RAincremental/clang.src/test/debuginfo-tests/nested-struct.cpp -c -o /Users/buildslave/zorg/buildbot/smooshlab/slave-0.8/build.clang-x86_64-darwin11-nobootstrap-RAincremental/clang-build/tools/clang/test/debuginfo-tests/Output/nested-struct.cpp.tmp.o
--
********************
Last 15 lines of 'Clang :: debuginfo-tests__sret.cpp':
8 clang 0x000000010bf3660b clang::driver::Driver::BuildJobsForAction(clang::driver::Compilation&, clang::driver::Action const*, clang::driver::ToolChain const*, char const*, bool, bool, char const*, clang::driver::InputInfo&) const + 731
9 clang 0x000000010bf329e5 clang::driver::Driver::BuildJobs(clang::driver::Compilation&) const + 613
10 clang 0x000000010bf2ed1e clang::driver::Driver::BuildCompilation(llvm::ArrayRef<char const*>) + 1838
11 clang 0x000000010be94e1f main + 9183
12 clang 0x000000010be8e334 start + 52
Stack dump:
0. Program arguments: /Users/buildslave/zorg/buildbot/smooshlab/slave-0.8/build.clang-x86_64-darwin11-nobootstrap-RAincremental/clang-build/Release+Asserts/bin/clang --driver-mode=g++ -O0 -g /Users/buildslave/zorg/buildbot/smooshlab/slave-0.8/build.clang-x86_64-darwin11-nobootstrap-RAincremental/clang.src/test/debuginfo-tests/sret.cpp -c -o /Users/buildslave/zorg/buildbot/smooshlab/slave-0.8/build.clang-x86_64-darwin11-nobootstrap-RAincremental/clang-build/tools/clang/test/debuginfo-tests/Output/sret.cpp.tmp.o
1. Compilation construction
2. Building compilation jobs
3. Building compilation jobs
4. Building compilation jobs
/Users/buildslave/zorg/buildbot/smooshlab/slave-0.8/build.clang-x86_64-darwin11-nobootstrap-RAincremental/clang-build/tools/clang/test/debuginfo-tests/Output/sret.cpp.script: line 3: 61879 Illegal instruction: 4 /Users/buildslave/zorg/buildbot/smooshlab/slave-0.8/build.clang-x86_64-darwin11-nobootstrap-RAincremental/clang-build/Release+Asserts/bin/clang --driver-mode=g++ -O0 -g /Users/buildslave/zorg/buildbot/smooshlab/slave-0.8/build.clang-x86_64-darwin11-nobootstrap-RAincremental/clang.src/test/debuginfo-tests/sret.cpp -c -o /Users/buildslave/zorg/buildbot/smooshlab/slave-0.8/build.clang-x86_64-darwin11-nobootstrap-RAincremental/clang-build/tools/clang/test/debuginfo-tests/Output/sret.cpp.tmp.o
--
********************
Last 15 lines of 'Clang :: debuginfo-tests__static-member.cpp':
8 clang 0x00000001021e360b clang::driver::Driver::BuildJobsForAction(clang::driver::Compilation&, clang::driver::Action const*, clang::driver::ToolChain const*, char const*, bool, bool, char const*, clang::driver::InputInfo&) const + 731
9 clang 0x00000001021df9e5 clang::driver::Driver::BuildJobs(clang::driver::Compilation&) const + 613
10 clang 0x00000001021dbd1e clang::driver::Driver::BuildCompilation(llvm::ArrayRef<char const*>) + 1838
11 clang 0x0000000102141e1f main + 9183
12 clang 0x000000010213b334 start + 52
Stack dump:
0. Program arguments: /Users/buildslave/zorg/buildbot/smooshlab/slave-0.8/build.clang-x86_64-darwin11-nobootstrap-RAincremental/clang-build/Release+Asserts/bin/clang --driver-mode=g++ -O0 -g /Users/buildslave/zorg/buildbot/smooshlab/slave-0.8/build.clang-x86_64-darwin11-nobootstrap-RAincremental/clang.src/test/debuginfo-tests/static-member.cpp -o /Users/buildslave/zorg/buildbot/smooshlab/slave-0.8/build.clang-x86_64-darwin11-nobootstrap-RAincremental/clang-build/tools/clang/test/debuginfo-tests/Output/static-member.cpp.tmp -c
1. Compilation construction
2. Building compilation jobs
3. Building compilation jobs
4. Building compilation jobs
/Users/buildslave/zorg/buildbot/smooshlab/slave-0.8/build.clang-x86_64-darwin11-nobootstrap-RAincremental/clang-build/tools/clang/test/debuginfo-tests/Output/static-member.cpp.script: line 3: 61881 Illegal instruction: 4 /Users/buildslave/zorg/buildbot/smooshlab/slave-0.8/build.clang-x86_64-darwin11-nobootstrap-RAincremental/clang-build/Release+Asserts/bin/clang --driver-mode=g++ -O0 -g /Users/buildslave/zorg/buildbot/smooshlab/slave-0.8/build.clang-x86_64-darwin11-nobootstrap-RAincremental/clang.src/test/debuginfo-tests/static-member.cpp -o /Users/buildslave/zorg/buildbot/smooshlab/slave-0.8/build.clang-x86_64-darwin11-nobootstrap-RAincremental/clang-build/tools/clang/test/debuginfo-tests/Output/static-member.cpp.tmp -c
--
********************
Last 15 lines of 'warnings (1)':
lit.py: discovery.py:180: warning: test suite 'Extra Tools Unit Tests' contained no tests
More information about the llvm-testresults
mailing list