[llvm-testresults] buildbot failure in smooshlab on clang-x86_64-darwin10-qa_tests
daniel_dunbar at apple.com
daniel_dunbar at apple.com
Fri Sep 24 12:47:13 PDT 2010
The Buildbot has detected a new failure of clang-x86_64-darwin10-qa_tests on smooshlab.
Full details are available at:
http://smooshlab.apple.com:8010/builders/clang-x86_64-darwin10-qa_tests/builds/935
Buildbot URL: http://smooshlab.apple.com:8010/
Buildslave for this Build: smoosh-01
Build Reason:
Build Source Stamp: 114738
Blamelist: dgregor,fjahanian,geoffray
BUILD FAILED: failed test-gcc-4_2-testsuite-gcc test-gcc-4_2-testsuite-g++
sincerely,
-The Buildbot
================================================================================
CHANGES:
Files:
include/llvm/CodeGen/GCMetadata.h
lib/CodeGen/GCStrategy.cpp
At: Fri 24 Sep 2010 10:33:33
Changed By: geoffray
Comments: Attach a DebugLoc to a GC point in order to get precise information in the JIT of a GC point.
Properties:
File: docs/tools/clang.pod
At: Fri 24 Sep 2010 10:33:33
Changed By: dgregor
Comments: Update Clang man page to say a little bit more about C++Properties:
Files:
include/clang/AST/ASTContext.h
include/clang/AST/Type.h
include/clang/Sema/Initialization.h
lib/AST/ASTContext.cpp
lib/CodeGen/CGExprScalar.cpp
lib/CodeGen/CodeGenFunction.cpp
lib/CodeGen/CodeGenFunction.h
lib/Sema/SemaDeclCXX.cpp
lib/Sema/SemaExpr.cpp
lib/Sema/SemaExprCXX.cpp
lib/Sema/SemaExprObjC.cpp
lib/Sema/SemaOverload.cpp
test/CodeGen/vla.c
At: Fri 24 Sep 2010 10:33:33
Changed By: fjahanian
Comments: Patch implements passing arrays to functions expecting
vla. Implements pr7827.
Properties:
File: SingleSource/UnitTests/vla.c
At: Fri 24 Sep 2010 10:36:30
Changed By: fjahanian
Comments: Test for pr7827 (clang).
Properties:
LOGS:
Last 10 lines of 'stdio':
# of expected passes 31867
# of unexpected failures 9956
# of unexpected successes 27
# of expected failures 42
# of unresolved testcases 488
# of untested testcases 273
# of unsupported tests 718
/Users/buildslave/zorg/buildbot/smooshlab/slave/build.clang-x86_64-darwin10-qa_tests/llvm.install/bin/clang version 2.9 (trunk 114738)
make: *** [check-gcc] Error 1
Last 10 lines of 'dg.sum':
# of expected passes 31867
# of unexpected failures 9956
# of unexpected successes 27
# of expected failures 42
# of unresolved testcases 488
# of untested testcases 273
# of unsupported tests 718
/Users/buildslave/zorg/buildbot/smooshlab/slave/build.clang-x86_64-darwin10-qa_tests/llvm.install/bin/clang version 2.9 (trunk 114738)
Last 10 lines of 'warnings':
FAIL: gcc.dg/format/miss-5.c -DWIDE return type warning (test for warnings, line 20)
FAIL: gcc.dg/format/miss-5.c -DWIDE return type warning (test for warnings, line 38)
FAIL: gcc.dg/format/miss-6.c parameter passing warning (test for warnings, line 23)
FAIL: gcc.dg/format/miss-6.c parameter passing warning (test for warnings, line 28)
FAIL: gcc.dg/format/miss-6.c -DWIDE parameter passing warning (test for warnings, line 23)
FAIL: gcc.dg/format/miss-6.c -DWIDE parameter passing warning (test for warnings, line 28)
FAIL: gcc.dg/format/sec-1.c security warning (test for warnings, line 11)
FAIL: gcc.dg/format/sec-1.c -DWIDE security warning (test for warnings, line 11)
FAIL: gcc.dg/format/z-1.c bogus printf warning (test for bogus messages, line 27)
FAIL: gcc.dg/format/z-1.c -DWIDE bogus printf warning (test for bogus messages, line 27)
Last 10 lines of 'tests.FAIL':
gcc.dg/vla-4.c execution test
Last 10 lines of 'tests.XFAIL':
gcc.dg/torture/fp-int-convert-float128-timode.c -O3 -g (test for excess errors)
gcc.dg/torture/fp-int-convert-float128-timode.c -Os (test for excess errors)
gcc.dg/torture/fp-int-convert-float128.c -O0 (test for excess errors)
gcc.dg/torture/fp-int-convert-float128.c -O1 (test for excess errors)
gcc.dg/torture/fp-int-convert-float128.c -O2 (test for excess errors)
gcc.dg/torture/fp-int-convert-float128.c -O3 -fomit-frame-pointer (test for excess errors)
gcc.dg/torture/fp-int-convert-float128.c -O3 -g (test for excess errors)
gcc.dg/torture/fp-int-convert-float128.c -Os (test for excess errors)
gcc.dg/uninit-13.c uninit (test for warnings, line 9)
gcc.dg/uninit-B.c uninit i warning (test for warnings, line 12)
Last 10 lines of 'tests.IGNORE FAIL':
tmpdir-gcc.dg-struct-layout-1/t027 c_compat_x_tst.o-c_compat_y_alt.o execute "-m32","-m32"
tmpdir-gcc.dg-struct-layout-1/t027 c_compat_x_tst.o-c_compat_y_alt.o execute "-m64","-m64"
tmpdir-gcc.dg-struct-layout-1/t027 c_compat_x_tst.o-c_compat_y_tst.o execute "-m32","-m32"
tmpdir-gcc.dg-struct-layout-1/t027 c_compat_x_tst.o-c_compat_y_tst.o execute "-m64","-m64"
tmpdir-gcc.dg-struct-layout-1/t028 c_compat_x_alt.o-c_compat_y_tst.o execute "-m32","-m32"
tmpdir-gcc.dg-struct-layout-1/t028 c_compat_x_alt.o-c_compat_y_tst.o execute "-m64","-m64"
tmpdir-gcc.dg-struct-layout-1/t028 c_compat_x_tst.o-c_compat_y_alt.o execute "-m32","-m32"
tmpdir-gcc.dg-struct-layout-1/t028 c_compat_x_tst.o-c_compat_y_alt.o execute "-m64","-m64"
tmpdir-gcc.dg-struct-layout-1/t028 c_compat_x_tst.o-c_compat_y_tst.o execute "-m32","-m32"
tmpdir-gcc.dg-struct-layout-1/t028 c_compat_x_tst.o-c_compat_y_tst.o execute "-m64","-m64"
Last 10 lines of 'tests.IGNORE PASS':
gcc.dg/visibility-d.c scan-hidden private_extern[ \t_]*_?foo46
gcc.dg/visibility-d.c scan-hidden private_extern[ \t_]*_?foo47
gcc.dg/visibility-d.c scan-hidden private_extern[ \t_]*_?foo49
gcc.dg/visibility-d.c scan-hidden private_extern[ \t_]*_?foo51
gcc.dg/visibility-d.c scan-hidden private_extern[ \t_]*_?foo55
gcc.dg/visibility-d.c scan-hidden private_extern[ \t_]*_?foo57
gcc.dg/visibility-d.c scan-hidden private_extern[ \t_]*_?foo59
gcc.dg/vla-4.c (test for excess errors)
gcc.target/i386/pr23376.c (test for excess errors)
gcc.target/x86_64/abi/test_struct_returning.c execution, -O0
Last 10 lines of 'tests.IGNORE XPASS':
gcc.dg/c99-const-expr-3.c bogus null pointer constant (test for bogus messages, line 35)
gcc.dg/c99-const-expr-3.c bogus null pointer constant (test for bogus messages, line 42)
gcc.dg/c99-const-expr-3.c bogus null pointer constant (test for bogus messages, line 43)
gcc.dg/c99-const-expr-3.c bogus null pointer constant (test for bogus messages, line 44)
gcc.dg/overflow-warn-3.c constant (test for bogus messages, line 42)
gcc.dg/overflow-warn-4.c constant (test for bogus messages, line 42)
gcc.dg/pr13519-1.c bogus error (test for bogus messages, line 17)
gcc.dg/uninit-6.c uninitialized variable warning (test for bogus messages, line 42)
gcc.dg/wtr-union-init-3.c initialization of unions (test for bogus messages, line 44)
gcc.dg/wtr-union-init-3.c initialization of unions (test for bogus messages, line 47)
Last 10 lines of 'tests.IGNORE UNRESOLVED':
gcc.target/i386/abi-1.c: error executing dg-final: couldn't open "abi-1.s": no such file or directory
gcc.target/i386/pr22432.c: error executing dg-final: couldn't open "pr22432.s": no such file or directory
gcc.target/i386/pr28946.c: error executing dg-final: couldn't open "pr28946.s": no such file or directory
gcc.target/i386/vectorize1.c: error executing dg-final: no files matched glob pattern "vectorize1.c.[0-9][0-9][0-9][ti].vect"
tmpdir-gcc.dg-struct-layout-1/t024 c_compat_x_alt.o-c_compat_y_tst.o execute "-m32","-m32"
tmpdir-gcc.dg-struct-layout-1/t024 c_compat_x_alt.o-c_compat_y_tst.o link "-m32","-m32"
tmpdir-gcc.dg-struct-layout-1/t024 c_compat_x_tst.o-c_compat_y_alt.o execute "-m32","-m32"
tmpdir-gcc.dg-struct-layout-1/t024 c_compat_x_tst.o-c_compat_y_alt.o link "-m32","-m32"
tmpdir-gcc.dg-struct-layout-1/t024 c_compat_x_tst.o-c_compat_y_tst.o execute "-m32","-m32"
tmpdir-gcc.dg-struct-layout-1/t024 c_compat_x_tst.o-c_compat_y_tst.o link "-m32","-m32"
Last 10 lines of 'stdio':
# of expected passes 11451
# of unexpected failures 3777
# of unexpected successes 41
# of expected failures 22
# of unresolved testcases 33
# of untested testcases 39
# of unsupported tests 319
/Users/buildslave/zorg/buildbot/smooshlab/slave/build.clang-x86_64-darwin10-qa_tests/llvm.install/bin/clang++ version 2.9 (trunk 114738)
make: *** [check-g++] Error 1
Last 10 lines of 'dg.sum':
# of expected passes 11451
# of unexpected failures 3777
# of unexpected successes 41
# of expected failures 22
# of unresolved testcases 33
# of untested testcases 39
# of unsupported tests 319
/Users/buildslave/zorg/buildbot/smooshlab/slave/build.clang-x86_64-darwin10-qa_tests/llvm.install/bin/clang++ version 2.9 (trunk 114738)
Last 10 lines of 'warnings':
FAIL: g++.dg/warn/miss-format-1.C scanf attribute warning (test for warnings, line 24)
FAIL: g++.dg/warn/miss-format-1.C printf attribute warning 2 (test for warnings, line 40)
FAIL: g++.dg/warn/miss-format-3.C initialization warning (test for warnings, line 18)
FAIL: g++.dg/warn/miss-format-3.C initialization warning (test for warnings, line 23)
FAIL: g++.dg/warn/miss-format-4.C assignment warning (test for warnings, line 24)
FAIL: g++.dg/warn/miss-format-4.C assignment warning (test for warnings, line 29)
FAIL: g++.dg/warn/miss-format-5.C return type warning (test for warnings, line 20)
FAIL: g++.dg/warn/miss-format-5.C return type warning (test for warnings, line 38)
FAIL: g++.dg/warn/miss-format-6.C parameter passing warning (test for warnings, line 23)
FAIL: g++.dg/warn/miss-format-6.C parameter passing warning (test for warnings, line 28)
Last 10 lines of 'tests.FAIL':
g++.dg/template/varmod1.C (test for excess errors)
Last 10 lines of 'tests.XFAIL':
g++.old-deja/g++.law/missed-error1.C (test for errors, line 19)
g++.old-deja/g++.law/missed-error1.C (test for errors, line 20)
g++.old-deja/g++.oliva/expr1.C (test for bogus messages, line 12)
g++.old-deja/g++.other/access2.C (test for errors, line 7)
g++.old-deja/g++.other/access2.C (test for errors, line 9)
g++.old-deja/g++.other/overload11.C (test for bogus messages, line 56)
g++.old-deja/g++.other/overload11.C (test for warnings, line 84)
g++.old-deja/g++.pt/explicit76.C (test for bogus messages, line 10)
g++.old-deja/g++.pt/overload7.C (test for bogus messages, line 14)
g++.old-deja/g++.pt/overload7.C (test for bogus messages, line 19)
Last 10 lines of 'tests.IGNORE FAIL':
tmpdir-g++.dg-struct-layout-1/t029 cp_compat_x_tst.o-cp_compat_y_alt.o execute "-m32","-m32"
tmpdir-g++.dg-struct-layout-1/t029 cp_compat_x_tst.o-cp_compat_y_alt.o execute "-m64","-m64"
tmpdir-g++.dg-struct-layout-1/t029 cp_compat_x_tst.o-cp_compat_y_tst.o execute "-m32","-m32"
tmpdir-g++.dg-struct-layout-1/t029 cp_compat_x_tst.o-cp_compat_y_tst.o execute "-m64","-m64"
tmpdir-g++.dg-struct-layout-1/t030 cp_compat_x_alt.o-cp_compat_y_tst.o execute "-m32","-m32"
tmpdir-g++.dg-struct-layout-1/t030 cp_compat_x_alt.o-cp_compat_y_tst.o execute "-m64","-m64"
tmpdir-g++.dg-struct-layout-1/t030 cp_compat_x_tst.o-cp_compat_y_alt.o execute "-m32","-m32"
tmpdir-g++.dg-struct-layout-1/t030 cp_compat_x_tst.o-cp_compat_y_alt.o execute "-m64","-m64"
tmpdir-g++.dg-struct-layout-1/t030 cp_compat_x_tst.o-cp_compat_y_tst.o execute "-m32","-m32"
tmpdir-g++.dg-struct-layout-1/t030 cp_compat_x_tst.o-cp_compat_y_tst.o execute "-m64","-m64"
Last 10 lines of 'tests.IGNORE PASS':
tmpdir-g++.dg-struct-layout-1/t025 cp_compat_x_tst.o compile, "-m32","-m32"
tmpdir-g++.dg-struct-layout-1/t025 cp_compat_x_tst.o compile, "-m64","-m64"
tmpdir-g++.dg-struct-layout-1/t026 cp_compat_x_tst.o compile, "-m32","-m32"
tmpdir-g++.dg-struct-layout-1/t026 cp_compat_x_tst.o compile, "-m64","-m64"
tmpdir-g++.dg-struct-layout-1/t027 cp_compat_x_tst.o compile, "-m32","-m32"
tmpdir-g++.dg-struct-layout-1/t027 cp_compat_x_tst.o compile, "-m64","-m64"
tmpdir-g++.dg-struct-layout-1/t029 cp_compat_x_tst.o compile, "-m32","-m32"
tmpdir-g++.dg-struct-layout-1/t029 cp_compat_x_tst.o compile, "-m64","-m64"
tmpdir-g++.dg-struct-layout-1/t030 cp_compat_x_tst.o compile, "-m32","-m32"
tmpdir-g++.dg-struct-layout-1/t030 cp_compat_x_tst.o compile, "-m64","-m64"
Last 10 lines of 'tests.IGNORE XPASS':
g++.old-deja/g++.ns/template13.C (test for errors, line 13)
g++.old-deja/g++.oliva/linkage1.C (test for bogus messages, line )
g++.old-deja/g++.oliva/ns2.C (test for bogus messages, line 13)
g++.old-deja/g++.other/crash32.C (test for bogus messages, line 10)
g++.old-deja/g++.other/crash32.C (test for bogus messages, line 12)
g++.old-deja/g++.other/overload11.C (test for bogus messages, line 57)
g++.old-deja/g++.other/overload11.C (test for bogus messages, line 58)
g++.old-deja/g++.other/overload11.C (test for bogus messages, line 59)
g++.old-deja/g++.pt/spec24.C (test for errors, line 5)
g++.old-deja/g++.robertl/eb133b.C (test for errors, line 6)
Last 10 lines of 'tests.IGNORE UNRESOLVED':
g++.dg/tree-ssa/pr18178.C: error executing dg-final: no files matched glob pattern "pr18178.C.[0-9][0-9][0-9][ti].vrp1"
g++.dg/tree-ssa/pr19807.C: error executing dg-final: no files matched glob pattern "pr19807.C.[0-9][0-9][0-9][ti].optimized"
g++.dg/tree-ssa/pr23948.C: error executing dg-final: no files matched glob pattern "pr23948.C.[0-9][0-9][0-9][ti].recip"
g++.dg/tree-ssa/pr26406.C: error executing dg-final: no files matched glob pattern "pr26406.C.[0-9][0-9][0-9][ti].optimized"
g++.dg/tree-ssa/pr27090.C: error executing dg-final: no files matched glob pattern "pr27090.C.[0-9][0-9][0-9][ti].optimized"
g++.dg/tree-ssa/ssa-cast-1.C: error executing dg-final: no files matched glob pattern "ssa-cast-1.C.[0-9][0-9][0-9][ti].optimized"
g++.dg/tree-ssa/ssa-sra-1.C: error executing dg-final: no files matched glob pattern "ssa-sra-1.C.[0-9][0-9][0-9][ti].optimized"
g++.dg/tree-ssa/ssa-sra-2.C: error executing dg-final: no files matched glob pattern "ssa-sra-2.C.[0-9][0-9][0-9][ti].optimized"
g++.dg/tree-ssa/tmmti-2.C: error executing dg-final: no files matched glob pattern "tmmti-2.C.[0-9][0-9][0-9][ti].optimized"
g++.old-deja/g++.ext/attrib5.C
More information about the llvm-testresults
mailing list