[llvm-testresults] buildbot failure in smooshlab on llvm-gcc-i386-darwin9

daniel_dunbar at apple.com daniel_dunbar at apple.com
Sat Nov 6 14:33:43 PDT 2010


The Buildbot has detected a new failure of llvm-gcc-i386-darwin9 on smooshlab.
Full details are available at:
 http://smooshlab.apple.com:8010/builders/llvm-gcc-i386-darwin9/builds/10727

Buildbot URL: http://smooshlab.apple.com:8010/

Buildslave for this Build: smoosh-03.apple.com

Build Reason: 
Build Source Stamp: 118354
Blamelist: lattner

BUILD FAILED: failed compile.llvm-gcc.stage1

sincerely,
 -The Buildbot


================================================================================

CHANGES:
Files:
 lib/Target/X86/X86InstrFPStack.td
 lib/Target/X86/X86InstrInfo.td
 test/MC/X86/x86-32-coverage.s
 test/MC/X86/x86-32.s
 test/MC/X86/x86-64.s
At: Sat 06 Nov 2010 13:57:37
Changed By: lattner
Comments: change the fp comparison instructions to not have %st0 explicitly
listed in its asm string, for consistency with the other similar
instructions.

Properties: 




LOGS:
Last 10 lines of 'stdio':
	{standard input}:289:suffix or operands invalid for `fucomip'
	{standard input}:301:suffix or operands invalid for `fucomip'
	{standard input}:310:suffix or operands invalid for `fucomip'
	{standard input}:345:suffix or operands invalid for `fucomip'
	make[4]: *** [libgcc/./_divxc3.o] Error 1
	make[3]: *** [stmp-multilib] Error 2
	rm fsf-funding.pod gcov.pod gfdl.pod cpp.pod gpl.pod gcc.pod
	make[2]: *** [all-stage1-gcc] Error 2
	make[1]: *** [stage1-bubble] Error 2
	make: *** [all] Error 2

Last 10 lines of 'warnings':
	warning: structure `VEC_cp_token_position_heap' used but not defined
	warning: structure `pointer_set_t' used but not defined
	warning: structure `c_arg_info' used but not defined
	warning: structure `c_switch' used but not defined
	warning: structure `et_node' used but not defined
	warning: structure `loop' used but not defined
	warning: structure `ipa_reference_vars_info_d' used but not defined
	warning: structure `reg_info_def' used but not defined
	warning: structure `value_set' used but not defined
	../../llvm-gcc.src/gcc/sched-vis.c:628: warning: no previous prototype for 'print_insn'




More information about the llvm-testresults mailing list