[llvm-testresults] buildbot failure in smooshlab on clang-x86_64-darwin10-selfhost-rel
daniel_dunbar at apple.com
daniel_dunbar at apple.com
Fri May 21 15:13:07 PDT 2010
The Buildbot has detected a new failure of clang-x86_64-darwin10-selfhost-rel on smooshlab.
Full details are available at:
http://smooshlab.apple.com:8010/builders/clang-x86_64-darwin10-selfhost-rel/builds/2261
Buildbot URL: http://smooshlab.apple.com:8010/
Buildslave for this Build: smoosh-02
Build Reason:
Build Source Stamp: 104387
Blamelist: andersca
BUILD FAILED: failed compile.llvm.stage2
sincerely,
-The Buildbot
================================================================================
CHANGES:
Files:
lib/CodeGen/CGClass.cpp
lib/CodeGen/CGExpr.cpp
lib/CodeGen/CGExprAgg.cpp
lib/CodeGen/CGExprScalar.cpp
lib/CodeGen/CGObjC.cpp
lib/CodeGen/CodeGenFunction.cpp
lib/CodeGen/CodeGenFunction.h
test/CodeGenCXX/pointers-to-data-members.cpp
At: Fri 21 May 2010 14:49:47
Changed By: andersca
Comments: Rename CodeGenFunction::EmitMemSetToZero to EmitNullInitialization. Handle setting null data member pointers correctly. Fixes PR7139.Properties:
LOGS:
Last 10 lines of 'stdio':
clang: error: assembler command failed due to signal 6 (use -v to see invocation)
make[2]: *** [/Users/buildslave/zorg/buildbot/smooshlab/slave/build.clang-x86_64-darwin10-selfhost-rel/llvm.obj.2/utils/TableGen/Release/CodeGenInstruction.o] Error 1
make[2]: *** Waiting for unfinished jobs....
llvm[3]: Compiling gtest-test-part.cc for Release build
llvm[3]: Compiling gtest-typed-test.cc for Release build
llvm[2]: Linking Release executable FileCheck (without symbols)
llvm[2]: ======= Finished Linking Release Executable FileCheck (without symbols)
llvm[3]: Building Release Archive Library libGoogleTest.a
make[1]: *** [TableGen/.makeall] Error 2
make: *** [all] Error 1
More information about the llvm-testresults
mailing list