[llvm-testresults] buildbot failure in smooshlab on llvm-gcc-i386-darwin9
daniel_dunbar at apple.com
daniel_dunbar at apple.com
Tue Mar 16 12:54:15 PDT 2010
The Buildbot has detected a new failure of llvm-gcc-i386-darwin9 on smooshlab.
Full details are available at:
http://smooshlab.apple.com:8010/builders/llvm-gcc-i386-darwin9/builds/4509
Buildbot URL: http://smooshlab.apple.com:8010/
Buildslave for this Build: smoosh-03.apple.com
Build Reason:
Build Source Stamp: 98661
Blamelist: lattner
BUILD FAILED: failed test.llvm.stage1 test.llvm.stage2
sincerely,
-The Buildbot
================================================================================
CHANGES:
Files:
lib/Bitcode/Reader/BitcodeReader.cpp
lib/Bitcode/Writer/BitcodeWriter.cpp
lib/CodeGen/AsmPrinter/AsmPrinter.cpp
lib/CodeGen/SelectionDAG/SelectionDAGBuilder.cpp
lib/Target/TargetData.cpp
At: Tue 16 Mar 2010 12:19:51
Changed By: lattner
Comments: improve support for uniontype and ConstantUnion, patch by Tim Northover!
Properties:
File: lib/Parse/AttributeList.cpp
At: Tue 16 Mar 2010 12:29:44
Changed By: lattner
Comments: accept and ignore __gcc_tdiag__ so we don't produce warnings
building mainline GCC, PR6542
Properties:
LOGS:
Last 10 lines of 'stdio':
********************
Failing Tests (1):
LLVM :: Feature/unions.ll
Expected Passes : 4586
Expected Failures : 29
Unsupported Tests : 513
Unexpected Failures: 1
make[1]: *** [check-local-lit] Error 1
make: *** [check-lit] Error 2
Last 10 lines of 'fail':
LLVM :: Feature/unions.ll
Last 10 lines of 'xfail':
LLVM :: MC/AsmParser/X86/x86_32-bit.s
LLVM :: MC/AsmParser/X86/x86_32-bit_cat.s
LLVM :: MC/AsmParser/X86/x86_32-encoding.s
LLVM :: MC/AsmParser/directive_lsym.s
LLVM :: MC/AsmParser/exprs-invalid.s
LLVM :: MC/MachO/Darwin/x86_32_diff_as.s
LLVM :: Transforms/GVN/rle-no-phi-translate.ll
LLVM :: Transforms/IndVarSimplify/loop_evaluate_6.ll
LLVM :: Transforms/TailCallElim/nocapture.ll
LLVM :: Transforms/TailDup/2008-06-11-AvoidDupLoopHeader.ll
Last 10 lines of 'unsupported':
LLVM :: LLVMC/C++/hello.cpp
LLVM :: LLVMC/C++/together.cpp
LLVM :: LLVMC/C/emit-llvm.c
LLVM :: LLVMC/C/hello.c
LLVM :: LLVMC/C/include.c
LLVM :: LLVMC/C/opt-test.c
LLVM :: LLVMC/C/sink.c
LLVM :: LLVMC/C/wall.c
LLVM :: LLVMC/ObjC++/hello.mm
LLVM :: LLVMC/ObjC/hello.m
Last 10 lines of 'unions.ll':
Command Output (stderr):
--
llvm-as: /Users/buildslave/zorg/buildbot/smooshlab/slave/build.llvm-gcc-i386-darwin9/llvm.obj/test/Feature/Output/unions.ll.tmp1.ll:5:39: error: expected type
@union1 = constant union { i32, i8 } <placeholder or erroneous Constant> ; <union { i32, i8 }*> [#uses=0]
^
llvm-dis: Invalid bitcode signature
--
********************
Last 10 lines of 'stdio':
********************
Failing Tests (1):
LLVM :: Feature/unions.ll
Expected Passes : 5027
Expected Failures : 37
Unsupported Tests : 64
Unexpected Failures: 1
make[1]: *** [check-local-lit] Error 1
make: *** [check-lit] Error 2
Last 10 lines of 'fail':
LLVM :: Feature/unions.ll
Last 10 lines of 'xfail':
LLVM :: MC/AsmParser/X86/x86_32-mismatched-add.s
LLVM :: MC/AsmParser/X86/x86_32-bit_cat.s
LLVM :: MC/AsmParser/X86/x86_32-encoding.s
LLVM :: MC/AsmParser/directive_lsym.s
LLVM :: MC/AsmParser/exprs-invalid.s
LLVM :: MC/MachO/Darwin/x86_32_diff_as.s
LLVM :: Transforms/GVN/rle-no-phi-translate.ll
LLVM :: Transforms/IndVarSimplify/loop_evaluate_6.ll
LLVM :: Transforms/TailCallElim/nocapture.ll
LLVM :: Transforms/TailDup/2008-06-11-AvoidDupLoopHeader.ll
Last 10 lines of 'unsupported':
LLVM :: FrontendObjC/2009-04-27-bitfield-vs-ivar.m
LLVM :: FrontendObjC/2009-04-28-bitfield-vs-vbc.m
LLVM :: FrontendObjC/2009-08-05-utf16.m
LLVM :: FrontendObjC/2009-08-17-DebugInfo.m
LLVM :: FrontendObjC/2009-11-30-Objc-ID.m
LLVM :: FrontendObjC/2010-02-01-utf16-with-null.m
LLVM :: FrontendObjC/2010-02-11-fwritable-stringsBug.m
LLVM :: FrontendObjC/2010-02-23-DbgInheritance.m
LLVM :: LLVMC/ObjC++/hello.mm
LLVM :: LLVMC/ObjC/hello.m
Last 10 lines of 'unions.ll':
Command Output (stderr):
--
llvm-as: /Users/buildslave/zorg/buildbot/smooshlab/slave/build.llvm-gcc-i386-darwin9/llvm.obj.2/test/Feature/Output/unions.ll.tmp1.ll:5:39: error: expected type
@union1 = constant union { i32, i8 } <placeholder or erroneous Constant> ; <union { i32, i8 }*> [#uses=0]
^
llvm-dis: Invalid bitcode signature
--
********************
More information about the llvm-testresults
mailing list