[llvm-testresults] buildbot failure in smooshlab on clang-x86_64-darwin10-selfhost-rel
daniel_dunbar at apple.com
daniel_dunbar at apple.com
Wed Jul 14 09:39:33 PDT 2010
The Buildbot has detected a new failure of clang-x86_64-darwin10-selfhost-rel on smooshlab.
Full details are available at:
http://smooshlab.apple.com:8010/builders/clang-x86_64-darwin10-selfhost-rel/builds/3358
Buildbot URL: http://smooshlab.apple.com:8010/
Buildslave for this Build: smoosh-02
Build Reason:
Build Source Stamp: 108332
Blamelist: bwilson
BUILD FAILED: failed test-llvm test-llvm_1
sincerely,
-The Buildbot
================================================================================
CHANGES:
File: lib/Target/ARM/ARMInstrThumb2.td
At: Wed 14 Jul 2010 09:03:03
Changed By: bwilson
Comments: Add missing address register update to t2LDM_RET instruction.
Patch by Brian Lucas. PR7636.
Properties:
LOGS:
Last 10 lines of 'stdio':
********************
Failing Tests (1):
LLVM :: CodeGen/Thumb2/2009-10-15-ITBlockBranch.ll
Expected Passes : 4822
Expected Failures : 27
Unsupported Tests : 539
Unexpected Failures: 1
make[1]: *** [check-local-lit] Error 1
make: *** [check-lit] Error 2
Last 10 lines of 'fail':
LLVM :: CodeGen/Thumb2/2009-10-15-ITBlockBranch.ll
Last 10 lines of 'xfail':
LLVM :: MC/AsmParser/X86/x86_32-bit_cat.s
LLVM :: MC/AsmParser/X86/x86_32-bit.s
LLVM :: MC/AsmParser/X86/x86_32-encoding.s
LLVM :: MC/AsmParser/directive_lsym.s
LLVM :: MC/AsmParser/exprs-invalid.s
LLVM :: Transforms/DeadArgElim/deadexternal.ll
LLVM :: Transforms/GVN/rle-no-phi-translate.ll
LLVM :: Transforms/IndVarSimplify/loop_evaluate_6.ll
LLVM :: Transforms/TailCallElim/nocapture.ll
LLVM :: Transforms/TailDup/2008-06-11-AvoidDupLoopHeader.ll
Last 10 lines of 'unsupported':
LLVM :: LLVMC/C++/hello.cpp
LLVM :: LLVMC/C++/together.cpp
LLVM :: LLVMC/C/emit-llvm.c
LLVM :: LLVMC/C/hello.c
LLVM :: LLVMC/C/include.c
LLVM :: LLVMC/C/opt-test.c
LLVM :: LLVMC/C/sink.c
LLVM :: LLVMC/C/wall.c
LLVM :: LLVMC/ObjC++/hello.mm
LLVM :: LLVMC/ObjC/hello.m
Last 10 lines of '2009-10-15-itblockbranch.ll':
/Users/buildslave/zorg/buildbot/smooshlab/slave/build.clang-x86_64-darwin10-selfhost-rel/llvm.src/test/CodeGen/Thumb2/2009-10-15-ITBlockBranch.ll:15:15: error: expected string not found in input
; CHECK-NEXT: ldmia.w sp, {r4, r5, r6, r8, r9, pc}
^
<stdin>:44:2: note: scanning from here
ldmia.w sp!, {r4, r5, r6, r8, r9, pc}
^
--
********************
Last 10 lines of 'stdio':
********************
Failing Tests (1):
LLVM :: CodeGen/Thumb2/2009-10-15-ITBlockBranch.ll
Expected Passes : 4822
Expected Failures : 27
Unsupported Tests : 539
Unexpected Failures: 1
make[1]: *** [check-local-lit] Error 1
make: *** [check-lit] Error 2
Last 10 lines of 'fail':
LLVM :: CodeGen/Thumb2/2009-10-15-ITBlockBranch.ll
Last 10 lines of 'xfail':
LLVM :: MC/AsmParser/X86/x86_32-bit.s
LLVM :: MC/AsmParser/X86/x86_32-encoding.s
LLVM :: MC/AsmParser/X86/x86_32-bit_cat.s
LLVM :: MC/AsmParser/directive_lsym.s
LLVM :: MC/AsmParser/exprs-invalid.s
LLVM :: Transforms/DeadArgElim/deadexternal.ll
LLVM :: Transforms/GVN/rle-no-phi-translate.ll
LLVM :: Transforms/IndVarSimplify/loop_evaluate_6.ll
LLVM :: Transforms/TailCallElim/nocapture.ll
LLVM :: Transforms/TailDup/2008-06-11-AvoidDupLoopHeader.ll
Last 10 lines of 'unsupported':
LLVM :: LLVMC/C++/hello.cpp
LLVM :: LLVMC/C++/together.cpp
LLVM :: LLVMC/C/emit-llvm.c
LLVM :: LLVMC/C/opt-test.c
LLVM :: LLVMC/C/sink.c
LLVM :: LLVMC/C/wall.c
LLVM :: LLVMC/C/include.c
LLVM :: LLVMC/C/hello.c
LLVM :: LLVMC/ObjC++/hello.mm
LLVM :: LLVMC/ObjC/hello.m
Last 10 lines of '2009-10-15-itblockbranch.ll':
/Users/buildslave/zorg/buildbot/smooshlab/slave/build.clang-x86_64-darwin10-selfhost-rel/llvm.src/test/CodeGen/Thumb2/2009-10-15-ITBlockBranch.ll:15:15: error: expected string not found in input
; CHECK-NEXT: ldmia.w sp, {r4, r5, r6, r8, r9, pc}
^
<stdin>:44:2: note: scanning from here
ldmia.w sp!, {r4, r5, r6, r8, r9, pc}
^
--
********************
More information about the llvm-testresults
mailing list