[llvm-testresults] buildbot failure in smooshlab on llvm-gcc-i386-darwin9
daniel_dunbar at apple.com
daniel_dunbar at apple.com
Thu Aug 19 17:15:33 PDT 2010
The Buildbot has detected a new failure of llvm-gcc-i386-darwin9 on smooshlab.
Full details are available at:
http://smooshlab.apple.com:8010/builders/llvm-gcc-i386-darwin9/builds/8661
Buildbot URL: http://smooshlab.apple.com:8010/
Buildslave for this Build: smoosh-03.apple.com
Build Reason:
Build Source Stamp: 111577
Blamelist: bwilson,dgregor,evancheng,resistor
BUILD FAILED: failed test.llvm.stage1 test.llvm.stage2
sincerely,
-The Buildbot
================================================================================
CHANGES:
Files:
lib/Transforms/InstCombine/InstCombineLoadStoreAlloca.cpp
test/Transforms/InstCombine/2010-08-19-StoreNarrowing.ll
At: Thu 19 Aug 2010 16:30:20
Changed By: resistor
Comments: Revert r111568 to unbreak clang self-host.
Properties:
File: lib/CodeGen/MachineBasicBlock.cpp
At: Thu 19 Aug 2010 16:36:29
Changed By: evancheng
Comments: Properly update MachineDominators when splitting critical edge.Properties:
File: lib/CodeGen/MachineSink.cpp
At: Thu 19 Aug 2010 16:36:29
Changed By: evancheng
Comments: Update debug logs.Properties:
File: docs/UsersManual.html
At: Thu 19 Aug 2010 16:36:58
Changed By: dgregor
Comments: Fix some typos in the documentation of -fdiagnostics-parseable-fixits. Typos by me, patch by Eelis van der WeegenProperties:
File: include/llvm/CodeGen/ISDOpcodes.h
At: Thu 19 Aug 2010 16:41:27
Changed By: bwilson
Comments: Update comment to remove special case for vector extending loads. An
extending vector load should extend each element in the same way as the
corresponding scalar extending load.
Properties:
LOGS:
Last 10 lines of 'stdio':
PASS: LLVM-Unit :: VMCore/Release+Asserts/VMCoreTests/PassManager.ReRun (5504 of 5506)
PASS: LLVM-Unit :: VMCore/Release+Asserts/VMCoreTests/PassManager.RunOnce (5505 of 5506)
PASS: LLVM-Unit :: VMCore/Release+Asserts/VMCoreTests/VerifierTest.Branch_i1 (5506 of 5506)
Testing Time: 135.61s
Expected Passes : 4926
Expected Failures : 29
Unsupported Tests : 550
Unresolved Tests : 1
make[1]: *** [check-local-lit] Error 1
make: *** [check] Error 2
Last 10 lines of 'xfail':
LLVM :: MC/AsmParser/X86/x86_32-bit_cat.s
LLVM :: MC/AsmParser/X86/x86_32-encoding.s
LLVM :: MC/AsmParser/X86/x86_32-mismatched-add.s
LLVM :: MC/AsmParser/directive_lsym.s
LLVM :: MC/AsmParser/exprs-invalid.s
LLVM :: Transforms/DeadArgElim/deadexternal.ll
LLVM :: Transforms/GVN/rle-no-phi-translate.ll
LLVM :: Transforms/IndVarSimplify/loop_evaluate_6.ll
LLVM :: Transforms/TailCallElim/nocapture.ll
LLVM :: Transforms/TailDup/2008-06-11-AvoidDupLoopHeader.ll
Last 10 lines of 'unresolved':
LLVM :: Transforms/InstCombine/2010-08-19-StoreNarrowing.ll
Last 10 lines of 'unsupported':
LLVM :: LLVMC/C++/hello.cpp
LLVM :: LLVMC/C++/together.cpp
LLVM :: LLVMC/C/emit-llvm.c
LLVM :: LLVMC/C/hello.c
LLVM :: LLVMC/C/include.c
LLVM :: LLVMC/C/opt-test.c
LLVM :: LLVMC/C/sink.c
LLVM :: LLVMC/C/wall.c
LLVM :: LLVMC/ObjC++/hello.mm
LLVM :: LLVMC/ObjC/hello.m
Last 10 lines of '2010-08-19-storenarrowing.ll':
******************** TEST 'LLVM :: Transforms/InstCombine/2010-08-19-StoreNarrowing.ll' FAILED ********************Test has no run line!
********************
Last 10 lines of 'stdio':
PASS: LLVM-Unit :: VMCore/Release+Asserts/VMCoreTests/PassManager.ReRun (5504 of 5506)
PASS: LLVM-Unit :: VMCore/Release+Asserts/VMCoreTests/PassManager.RunOnce (5505 of 5506)
PASS: LLVM-Unit :: VMCore/Release+Asserts/VMCoreTests/VerifierTest.Branch_i1 (5506 of 5506)
Testing Time: 141.99s
Expected Passes : 5399
Expected Failures : 37
Unsupported Tests : 69
Unresolved Tests : 1
make[1]: *** [check-local-lit] Error 1
make: *** [check] Error 2
Last 10 lines of 'xfail':
LLVM :: MC/AsmParser/X86/x86_32-bit_cat.s
LLVM :: MC/AsmParser/X86/x86_32-encoding.s
LLVM :: MC/AsmParser/X86/x86_32-mismatched-add.s
LLVM :: MC/AsmParser/directive_lsym.s
LLVM :: MC/AsmParser/exprs-invalid.s
LLVM :: Transforms/DeadArgElim/deadexternal.ll
LLVM :: Transforms/GVN/rle-no-phi-translate.ll
LLVM :: Transforms/IndVarSimplify/loop_evaluate_6.ll
LLVM :: Transforms/TailCallElim/nocapture.ll
LLVM :: Transforms/TailDup/2008-06-11-AvoidDupLoopHeader.ll
Last 10 lines of 'unresolved':
LLVM :: Transforms/InstCombine/2010-08-19-StoreNarrowing.ll
Last 10 lines of 'unsupported':
LLVM :: FrontendObjC/2009-08-05-utf16.m
LLVM :: FrontendObjC/2009-08-17-DebugInfo.m
LLVM :: FrontendObjC/2009-11-30-Objc-ID.m
LLVM :: FrontendObjC/2010-02-01-utf16-with-null.m
LLVM :: FrontendObjC/2010-02-11-fwritable-stringsBug.m
LLVM :: FrontendObjC/2010-02-23-DbgInheritance.m
LLVM :: FrontendObjC/2010-03-17-StructRef.m
LLVM :: FrontendObjC/2010-06-04-UnnamedCFString-dbg.m
LLVM :: LLVMC/ObjC++/hello.mm
LLVM :: LLVMC/ObjC/hello.m
Last 10 lines of '2010-08-19-storenarrowing.ll':
******************** TEST 'LLVM :: Transforms/InstCombine/2010-08-19-StoreNarrowing.ll' FAILED ********************Test has no run line!
********************
More information about the llvm-testresults
mailing list