[llvm-testresults] buildbot failure in smooshlab on llvm-gcc-x86_64-darwin10-selfhost
daniel_dunbar at apple.com
daniel_dunbar at apple.com
Mon Apr 26 00:59:27 PDT 2010
The Buildbot has detected a new failure of llvm-gcc-x86_64-darwin10-selfhost on smooshlab.
Full details are available at:
http://smooshlab.apple.com:8010/builders/llvm-gcc-x86_64-darwin10-selfhost/builds/3267
Buildbot URL: http://smooshlab.apple.com:8010/
Buildslave for this Build: smoosh-04
Build Reason:
Build Source Stamp: 102323
Blamelist: evancheng
BUILD FAILED: failed buildit-llvmgcc42
sincerely,
-The Buildbot
================================================================================
CHANGES:
Files:
include/llvm/Target/TargetInstrInfo.h
include/llvm/Target/TargetLowering.h
lib/CodeGen/LiveIntervalAnalysis.cpp
lib/CodeGen/SelectionDAG/InstrEmitter.cpp
lib/CodeGen/SelectionDAG/InstrEmitter.h
lib/CodeGen/SelectionDAG/ScheduleDAGSDNodes.cpp
lib/Target/X86/X86ISelLowering.cpp
lib/Target/X86/X86ISelLowering.h
lib/Target/X86/X86InstrInfo.cpp
lib/Target/X86/X86InstrInfo.h
At: Mon 26 Apr 2010 00:40:04
Changed By: evancheng
Comments: - Move TargetLowering::EmitTargetCodeForFrameDebugValue to TargetInstrInfo and rename it to emitFrameIndexDebugValue.
- Teach spiller to modify DBG_VALUE instructions to reference spill slots.
Properties:
LOGS:
Last 10 lines of 'stdio':
{standard input}:unknown:Partial line at end of file ignored
make[5]: *** [libgcc/./unwind-dw2.o] Error 1
make[5]: *** Waiting for unfinished jobs....
make[4]: *** [stmp-multilib] Error 2
rm fsf-funding.pod gcov.pod gfdl.pod cpp.pod gpl.pod gcc.pod
make[3]: *** [all-stage1-gcc] Error 2
make[2]: *** [stage1-bubble] Error 2
make[1]: *** [all] Error 2
+ exit 1
make: *** [install] Error 1
Last 10 lines of 'warnings':
warning: structure `ZipDirectory' used but not defined
warning: structure `VEC_cp_token_position_heap' used but not defined
warning: structure `pointer_set_t' used but not defined
warning: structure `c_arg_info' used but not defined
warning: structure `c_switch' used but not defined
warning: structure `et_node' used but not defined
warning: structure `loop' used but not defined
warning: structure `ipa_reference_vars_info_d' used but not defined
warning: structure `reg_info_def' used but not defined
warning: structure `value_set' used but not defined
More information about the llvm-testresults
mailing list