[llvm-testresults] buildbot failure in smooshlab on llvm-gcc-powerpc-darwin9
daniel_dunbar at apple.com
daniel_dunbar at apple.com
Sun Apr 4 20:15:52 PDT 2010
The Buildbot has detected a new failure of llvm-gcc-powerpc-darwin9 on smooshlab.
Full details are available at:
http://smooshlab.apple.com:8010/builders/llvm-gcc-powerpc-darwin9/builds/1934
Buildbot URL: http://smooshlab.apple.com:8010/
Buildslave for this Build: smoosh-14.apple.com
Build Reason:
Build Source Stamp: 100382
Blamelist: lattner
BUILD FAILED: failed compile.llvm-gcc.stage1
sincerely,
-The Buildbot
================================================================================
CHANGES:
Files:
include/llvm/CodeGen/FastISel.h
include/llvm/CodeGen/SelectionDAGISel.h
include/llvm/Target/TargetLowering.h
lib/CodeGen/AsmPrinter/DwarfDebug.cpp
lib/CodeGen/AsmPrinter/DwarfDebug.h
lib/CodeGen/AsmPrinter/DwarfWriter.cpp
lib/CodeGen/SelectionDAG/FastISel.cpp
lib/CodeGen/SelectionDAG/SelectionDAGISel.cpp
lib/Target/X86/X86FastISel.cpp
lib/Target/X86/X86ISelLowering.cpp
lib/Target/X86/X86ISelLowering.h
At: Sun 04 Apr 2010 19:25:01
Changed By: lattner
Comments: fastisel doesn't need DwarfWriter, remove some tendricles.
Properties:
Files:
include/llvm/CodeGen/SelectionDAG.h
lib/CodeGen/SelectionDAG/SelectionDAG.cpp
lib/CodeGen/SelectionDAG/SelectionDAGBuilder.cpp
lib/CodeGen/SelectionDAG/SelectionDAGISel.cpp
At: Sun 04 Apr 2010 19:25:01
Changed By: lattner
Comments: selection dag doesn't need DwarfWriter, remove some tendrils.
Properties:
LOGS:
Last 10 lines of 'stdio':
checking for unistd.h... (cached) yes
checking for int... yes
checking size of int... 4
checking for uintptr_t... yes
checking for a 64-bit type... uint64_t
checking for pid_t... yes
checking for library containing strerror... configure: error: Link tests are not allowed after GCC_NO_EXECUTABLES.
make[2]: *** [configure-stage2-libiberty] Error 1
make[1]: *** [stage2-bubble] Error 2
make: *** [all] Error 2
Last 10 lines of 'warnings':
../../llvm-gcc.src/gcc/config/rs6000/altivec.md:1882: warning: operand 1 missing mode?
../../llvm-gcc.src/gcc/config/rs6000/altivec.md:1889: warning: operand 1 missing mode?
../../llvm-gcc.src/gcc/config/rs6000/altivec.md:2195: warning: destination missing a mode?
../../llvm-gcc.src/gcc/config/rs6000/altivec.md:2195: warning: operand 0 missing mode?
../../llvm-gcc.src/gcc/sched-vis.c:628: warning: no previous prototype for 'print_insn'
../../llvm-gcc.src/gcc/libgcc2.c:412: warning: control reaches end of non-void function
../../llvm-gcc.src/gcc/libgcc2.c:2045: warning: 'noreturn' function does return
ld warning: can't add line info to anonymous symbol _abort from libgcc/ppc64/_negvsi2_s.o
ld warning: can't add line info to anonymous symbol ___floatditf from libgcc/ppc64/ppc64-fp_s.o
ld warning: can't add line info to anonymous symbol __Unwind_GetDataRelBase from libgcc/ppc64/unwind-c_s.o
More information about the llvm-testresults
mailing list