[llvm-testresults] buildbot failure in smooshlab on llvm-gcc-i386-darwin9
daniel_dunbar at apple.com
daniel_dunbar at apple.com
Wed Oct 28 18:54:29 PDT 2009
The Buildbot has detected a new failure of llvm-gcc-i386-darwin9 on smooshlab.
Full details are available at:
http://smooshlab.apple.com:8010/builders/llvm-gcc-i386-darwin9/builds/5801
Buildbot URL: http://smooshlab.apple.com:8010/
Buildslave for this Build: smoosh-03.apple.com
Build Reason:
Build Source Stamp: 85467
Blamelist: echristo,johnny
BUILD FAILED: failed compile llvm
sincerely,
-The Buildbot
================================================================================
CHANGES:
File: gcc/llvm-convert.cpp
At: Wed 28 Oct 2009 18:45:01
Changed By: echristo
Comments: Try #2 of this. Coerce all of the types to what they should be.
File: utils/TableGen/RISCDisassemblerEmitter.cpp
At: Wed 28 Oct 2009 18:50:01
Changed By: johnny
Comments: Minor tweak to forgo the the curly braces for most case blocks, except when
declaring local variables.
LOGS:
Last 10 lines of 'compile llvm.stdio':
/Volumes/Sandbox/Buildbot/llvm/build.llvm-gcc-i386-darwin9/llvm.src/utils/TableGen/RISCDisassemblerEmitter.cpp:1151: error: 'fBackend' was not declared in this scope
/Volumes/Sandbox/Buildbot/llvm/build.llvm-gcc-i386-darwin9/llvm.src/utils/TableGen/RISCDisassemblerEmitter.cpp: At global scope:
/Volumes/Sandbox/Buildbot/llvm/build.llvm-gcc-i386-darwin9/llvm.src/utils/TableGen/RISCDisassemblerEmitter.cpp:1155: error: 'RISCDisassemblerEmitter' has not been declared
/Volumes/Sandbox/Buildbot/llvm/build.llvm-gcc-i386-darwin9/llvm.src/utils/TableGen/RISCDisassemblerEmitter.cpp: In function 'void shutdownBackend()':
/Volumes/Sandbox/Buildbot/llvm/build.llvm-gcc-i386-darwin9/llvm.src/utils/TableGen/RISCDisassemblerEmitter.cpp:1157: error: 'fBackend' was not declared in this scope
llvm[2]: Compiling Record.cpp for Release build
make[2]: *** [/Volumes/Sandbox/Buildbot/llvm/build.llvm-gcc-i386-darwin9/llvm.obj/utils/TableGen/Release/RISCDisassemblerEmitter.o] Error 1
make[2]: *** Waiting for unfinished jobs....
make[1]: *** [TableGen/.makeall] Error 2
make: *** [all] Error 1
Last 10 lines of 'compile llvm.warnings':
/Volumes/Sandbox/Buildbot/llvm/build.llvm-gcc-i386-darwin9/llvm.src/utils/TableGen/RISCDisassemblerEmitter.cpp:239: warning: 'class AbstractFilterChooser' has virtual functions but non-virtual destructor
/Volumes/Sandbox/Buildbot/llvm/build.llvm-gcc-i386-darwin9/llvm.src/utils/TableGen/RISCDisassemblerEmitter.cpp:245: warning: 'class FilterChooser<32u>' has virtual functions but non-virtual destructor
More information about the llvm-testresults
mailing list