[llvm] [SPARC] Implement TargetInstrInfo::insertIndirectBranch() (PR #226678)

via llvm-commits llvm-commits at lists.llvm.org
Thu Oct 1 07:56:07 PDT 2026


github-actions[bot] wrote:

<!--PREMERGE ADVISOR COMMENT: Windows-->
# :window: Windows x64 Test Results

The build failed before running any tests. Click on a failure below to see the details.

<details>
<summary>[code=1] lib/Target/Sparc/SparcGenAsmMatcher.inc C:/_work/llvm-project/llvm-project/build/lib/Target/Sparc/SparcGenAsmMatcher.inc</summary>

```
FAILED: [code=1] lib/Target/Sparc/SparcGenAsmMatcher.inc C:/_work/llvm-project/llvm-project/build/lib/Target/Sparc/SparcGenAsmMatcher.inc
C:\Windows\system32\cmd.exe /C "cd /D C:\_work\llvm-project\llvm-project\build\lib\Target\Sparc && C:\_work\llvm-project\llvm-project\build\bin\llvm-tblgen.exe -gen-asm-matcher -IC:/_work/llvm-project/llvm-project/llvm/lib/Target/Sparc -IC:/_work/llvm-project/llvm-project/build/include -IC:/_work/llvm-project/llvm-project/llvm/include -I C:/_work/llvm-project/llvm-project/llvm/lib/Target --long-string-literals=0 C:/_work/llvm-project/llvm-project/llvm/lib/Target/Sparc/Sparc.td --write-if-changed -o SparcGenAsmMatcher.inc -d SparcGenAsmMatcher.inc.d && C:\BuildTools\Common7\IDE\CommonExtensions\Microsoft\CMake\CMake\bin\cmake.exe -E cmake_transform_depfile Ninja gccdepfile C:/_work/llvm-project/llvm-project/llvm C:/_work/llvm-project/llvm-project/llvm/lib/Target/Sparc C:/_work/llvm-project/llvm-project/build C:/_work/llvm-project/llvm-project/build/lib/Target/Sparc C:/_work/llvm-project/llvm-project/build/lib/Target/Sparc/SparcGenAsmMatcher.inc.d C:/_work/llvm-project/llvm-project/build/CMakeFiles/d/a82edcffda4ac92b08be3ea1af8eaaa0b383df6b701c613c84b1703f5f24894e.d"
Included from C:/_work/llvm-project/llvm-project/llvm/lib/Target/Sparc/Sparc.td:159:
C:/_work/llvm-project/llvm-project/llvm/lib/Target/Sparc\SparcInstrInfo.td:1141:21: error: Variable not defined: 'IIC_jmp_or_call'
IIC_jmp_or_call> {
^
```
</details>
<details>
<summary>[code=1] lib/Target/Sparc/SparcGenAsmWriter.inc C:/_work/llvm-project/llvm-project/build/lib/Target/Sparc/SparcGenAsmWriter.inc</summary>

```
FAILED: [code=1] lib/Target/Sparc/SparcGenAsmWriter.inc C:/_work/llvm-project/llvm-project/build/lib/Target/Sparc/SparcGenAsmWriter.inc
C:\Windows\system32\cmd.exe /C "cd /D C:\_work\llvm-project\llvm-project\build\lib\Target\Sparc && C:\_work\llvm-project\llvm-project\build\bin\llvm-tblgen.exe -gen-asm-writer -IC:/_work/llvm-project/llvm-project/llvm/lib/Target/Sparc -IC:/_work/llvm-project/llvm-project/build/include -IC:/_work/llvm-project/llvm-project/llvm/include -I C:/_work/llvm-project/llvm-project/llvm/lib/Target --long-string-literals=0 C:/_work/llvm-project/llvm-project/llvm/lib/Target/Sparc/Sparc.td --write-if-changed -o SparcGenAsmWriter.inc -d SparcGenAsmWriter.inc.d && C:\BuildTools\Common7\IDE\CommonExtensions\Microsoft\CMake\CMake\bin\cmake.exe -E cmake_transform_depfile Ninja gccdepfile C:/_work/llvm-project/llvm-project/llvm C:/_work/llvm-project/llvm-project/llvm/lib/Target/Sparc C:/_work/llvm-project/llvm-project/build C:/_work/llvm-project/llvm-project/build/lib/Target/Sparc C:/_work/llvm-project/llvm-project/build/lib/Target/Sparc/SparcGenAsmWriter.inc.d C:/_work/llvm-project/llvm-project/build/CMakeFiles/d/31ff3f5ccf415e9a398af899ce7041b73c858254f61d77a75067af1053a03089.d"
Included from C:/_work/llvm-project/llvm-project/llvm/lib/Target/Sparc/Sparc.td:159:
C:/_work/llvm-project/llvm-project/llvm/lib/Target/Sparc\SparcInstrInfo.td:1141:21: error: Variable not defined: 'IIC_jmp_or_call'
IIC_jmp_or_call> {
^
```
</details>
<details>
<summary>[code=1] lib/Target/Sparc/SparcGenDAGISel.inc C:/_work/llvm-project/llvm-project/build/lib/Target/Sparc/SparcGenDAGISel.inc</summary>

```
FAILED: [code=1] lib/Target/Sparc/SparcGenDAGISel.inc C:/_work/llvm-project/llvm-project/build/lib/Target/Sparc/SparcGenDAGISel.inc
C:\Windows\system32\cmd.exe /C "cd /D C:\_work\llvm-project\llvm-project\build\lib\Target\Sparc && C:\_work\llvm-project\llvm-project\build\bin\llvm-tblgen.exe -gen-dag-isel -IC:/_work/llvm-project/llvm-project/llvm/lib/Target/Sparc -IC:/_work/llvm-project/llvm-project/build/include -IC:/_work/llvm-project/llvm-project/llvm/include -I C:/_work/llvm-project/llvm-project/llvm/lib/Target -omit-comments --long-string-literals=0 C:/_work/llvm-project/llvm-project/llvm/lib/Target/Sparc/Sparc.td --write-if-changed -o SparcGenDAGISel.inc -d SparcGenDAGISel.inc.d && C:\BuildTools\Common7\IDE\CommonExtensions\Microsoft\CMake\CMake\bin\cmake.exe -E cmake_transform_depfile Ninja gccdepfile C:/_work/llvm-project/llvm-project/llvm C:/_work/llvm-project/llvm-project/llvm/lib/Target/Sparc C:/_work/llvm-project/llvm-project/build C:/_work/llvm-project/llvm-project/build/lib/Target/Sparc C:/_work/llvm-project/llvm-project/build/lib/Target/Sparc/SparcGenDAGISel.inc.d C:/_work/llvm-project/llvm-project/build/CMakeFiles/d/6679cc5c6ec0a7e4613b410282cd904b662b6f289fe43f5606aa7f81edbd30df.d"
Included from C:/_work/llvm-project/llvm-project/llvm/lib/Target/Sparc/Sparc.td:159:
C:/_work/llvm-project/llvm-project/llvm/lib/Target/Sparc\SparcInstrInfo.td:1141:21: error: Variable not defined: 'IIC_jmp_or_call'
IIC_jmp_or_call> {
^
```
</details>
<details>
<summary>[code=1] lib/Target/Sparc/SparcGenCallingConv.inc C:/_work/llvm-project/llvm-project/build/lib/Target/Sparc/SparcGenCallingConv.inc</summary>

```
FAILED: [code=1] lib/Target/Sparc/SparcGenCallingConv.inc C:/_work/llvm-project/llvm-project/build/lib/Target/Sparc/SparcGenCallingConv.inc
C:\Windows\system32\cmd.exe /C "cd /D C:\_work\llvm-project\llvm-project\build\lib\Target\Sparc && C:\_work\llvm-project\llvm-project\build\bin\llvm-tblgen.exe -gen-callingconv -IC:/_work/llvm-project/llvm-project/llvm/lib/Target/Sparc -IC:/_work/llvm-project/llvm-project/build/include -IC:/_work/llvm-project/llvm-project/llvm/include -I C:/_work/llvm-project/llvm-project/llvm/lib/Target --long-string-literals=0 C:/_work/llvm-project/llvm-project/llvm/lib/Target/Sparc/Sparc.td --write-if-changed -o SparcGenCallingConv.inc -d SparcGenCallingConv.inc.d && C:\BuildTools\Common7\IDE\CommonExtensions\Microsoft\CMake\CMake\bin\cmake.exe -E cmake_transform_depfile Ninja gccdepfile C:/_work/llvm-project/llvm-project/llvm C:/_work/llvm-project/llvm-project/llvm/lib/Target/Sparc C:/_work/llvm-project/llvm-project/build C:/_work/llvm-project/llvm-project/build/lib/Target/Sparc C:/_work/llvm-project/llvm-project/build/lib/Target/Sparc/SparcGenCallingConv.inc.d C:/_work/llvm-project/llvm-project/build/CMakeFiles/d/7d0ed81cd3cb9bda1ad378683a0a7b206b65f00b9f02b53dd884afdf67f22014.d"
Included from C:/_work/llvm-project/llvm-project/llvm/lib/Target/Sparc/Sparc.td:159:
C:/_work/llvm-project/llvm-project/llvm/lib/Target/Sparc\SparcInstrInfo.td:1141:21: error: Variable not defined: 'IIC_jmp_or_call'
IIC_jmp_or_call> {
^
```
</details>
<details>
<summary>[code=1] lib/Target/Sparc/SparcGenDisassemblerTables.inc C:/_work/llvm-project/llvm-project/build/lib/Target/Sparc/SparcGenDisassemblerTables.inc</summary>

```
FAILED: [code=1] lib/Target/Sparc/SparcGenDisassemblerTables.inc C:/_work/llvm-project/llvm-project/build/lib/Target/Sparc/SparcGenDisassemblerTables.inc
C:\Windows\system32\cmd.exe /C "cd /D C:\_work\llvm-project\llvm-project\build\lib\Target\Sparc && C:\_work\llvm-project\llvm-project\build\bin\llvm-tblgen.exe -gen-disassembler -IC:/_work/llvm-project/llvm-project/llvm/lib/Target/Sparc -IC:/_work/llvm-project/llvm-project/build/include -IC:/_work/llvm-project/llvm-project/llvm/include -I C:/_work/llvm-project/llvm-project/llvm/lib/Target --long-string-literals=0 C:/_work/llvm-project/llvm-project/llvm/lib/Target/Sparc/Sparc.td --write-if-changed -o SparcGenDisassemblerTables.inc -d SparcGenDisassemblerTables.inc.d && C:\BuildTools\Common7\IDE\CommonExtensions\Microsoft\CMake\CMake\bin\cmake.exe -E cmake_transform_depfile Ninja gccdepfile C:/_work/llvm-project/llvm-project/llvm C:/_work/llvm-project/llvm-project/llvm/lib/Target/Sparc C:/_work/llvm-project/llvm-project/build C:/_work/llvm-project/llvm-project/build/lib/Target/Sparc C:/_work/llvm-project/llvm-project/build/lib/Target/Sparc/SparcGenDisassemblerTables.inc.d C:/_work/llvm-project/llvm-project/build/CMakeFiles/d/4858d39ca119f6baad229b14b4b79d03c073919de732aeb552397dd0badeabdb.d"
Included from C:/_work/llvm-project/llvm-project/llvm/lib/Target/Sparc/Sparc.td:159:
C:/_work/llvm-project/llvm-project/llvm/lib/Target/Sparc\SparcInstrInfo.td:1141:21: error: Variable not defined: 'IIC_jmp_or_call'
IIC_jmp_or_call> {
^
```
</details>
<details>
<summary>[code=1] lib/Target/Sparc/SparcGenMCCodeEmitter.inc C:/_work/llvm-project/llvm-project/build/lib/Target/Sparc/SparcGenMCCodeEmitter.inc</summary>

```
FAILED: [code=1] lib/Target/Sparc/SparcGenMCCodeEmitter.inc C:/_work/llvm-project/llvm-project/build/lib/Target/Sparc/SparcGenMCCodeEmitter.inc
C:\Windows\system32\cmd.exe /C "cd /D C:\_work\llvm-project\llvm-project\build\lib\Target\Sparc && C:\_work\llvm-project\llvm-project\build\bin\llvm-tblgen.exe -gen-emitter -IC:/_work/llvm-project/llvm-project/llvm/lib/Target/Sparc -IC:/_work/llvm-project/llvm-project/build/include -IC:/_work/llvm-project/llvm-project/llvm/include -I C:/_work/llvm-project/llvm-project/llvm/lib/Target --long-string-literals=0 C:/_work/llvm-project/llvm-project/llvm/lib/Target/Sparc/Sparc.td --write-if-changed -o SparcGenMCCodeEmitter.inc -d SparcGenMCCodeEmitter.inc.d && C:\BuildTools\Common7\IDE\CommonExtensions\Microsoft\CMake\CMake\bin\cmake.exe -E cmake_transform_depfile Ninja gccdepfile C:/_work/llvm-project/llvm-project/llvm C:/_work/llvm-project/llvm-project/llvm/lib/Target/Sparc C:/_work/llvm-project/llvm-project/build C:/_work/llvm-project/llvm-project/build/lib/Target/Sparc C:/_work/llvm-project/llvm-project/build/lib/Target/Sparc/SparcGenMCCodeEmitter.inc.d C:/_work/llvm-project/llvm-project/build/CMakeFiles/d/343e54be8a20dab58e6a42c5ade6b03e705262f00037d51af7c5cfe289539dd8.d"
Included from C:/_work/llvm-project/llvm-project/llvm/lib/Target/Sparc/Sparc.td:159:
C:/_work/llvm-project/llvm-project/llvm/lib/Target/Sparc\SparcInstrInfo.td:1141:21: error: Variable not defined: 'IIC_jmp_or_call'
IIC_jmp_or_call> {
^
```
</details>
<details>
<summary>[code=1] lib/Target/Sparc/SparcGenInstrInfo.inc C:/_work/llvm-project/llvm-project/build/lib/Target/Sparc/SparcGenInstrInfo.inc</summary>

```
FAILED: [code=1] lib/Target/Sparc/SparcGenInstrInfo.inc C:/_work/llvm-project/llvm-project/build/lib/Target/Sparc/SparcGenInstrInfo.inc
C:\Windows\system32\cmd.exe /C "cd /D C:\_work\llvm-project\llvm-project\build\lib\Target\Sparc && C:\_work\llvm-project\llvm-project\build\bin\llvm-tblgen.exe -gen-instr-info -IC:/_work/llvm-project/llvm-project/llvm/lib/Target/Sparc -IC:/_work/llvm-project/llvm-project/build/include -IC:/_work/llvm-project/llvm-project/llvm/include -I C:/_work/llvm-project/llvm-project/llvm/lib/Target --long-string-literals=0 C:/_work/llvm-project/llvm-project/llvm/lib/Target/Sparc/Sparc.td --write-if-changed -o SparcGenInstrInfo.inc -d SparcGenInstrInfo.inc.d && C:\BuildTools\Common7\IDE\CommonExtensions\Microsoft\CMake\CMake\bin\cmake.exe -E cmake_transform_depfile Ninja gccdepfile C:/_work/llvm-project/llvm-project/llvm C:/_work/llvm-project/llvm-project/llvm/lib/Target/Sparc C:/_work/llvm-project/llvm-project/build C:/_work/llvm-project/llvm-project/build/lib/Target/Sparc C:/_work/llvm-project/llvm-project/build/lib/Target/Sparc/SparcGenInstrInfo.inc.d C:/_work/llvm-project/llvm-project/build/CMakeFiles/d/00f836ca6b6575a5407f6ab422e50ad6a0eb398a6bb62009e0af2d2359e40cc2.d"
Included from C:/_work/llvm-project/llvm-project/llvm/lib/Target/Sparc/Sparc.td:159:
C:/_work/llvm-project/llvm-project/llvm/lib/Target/Sparc\SparcInstrInfo.td:1141:21: error: Variable not defined: 'IIC_jmp_or_call'
IIC_jmp_or_call> {
^
```
</details>
<details>
<summary>[code=1] lib/Target/Sparc/SparcGenRegisterInfo.inc lib/Target/Sparc/SparcGenRegisterInfoEnums.inc lib/Target/Sparc/SparcGenRegisterInfoHeader.inc lib/Target/Sparc/SparcGenRegisterInfoMCDesc.inc lib/Target/Sparc/SparcGenRegisterInfoTargetDesc.inc C:/_work/llvm-project/llvm-project/build/lib/Target/Sparc/SparcGenRegisterInfo.inc C:/_work/llvm-project/llvm-project/build/lib/Target/Sparc/SparcGenRegisterInfoEnums.inc C:/_work/llvm-project/llvm-project/build/lib/Target/Sparc/SparcGenRegisterInfoHeader.inc C:/_work/llvm-project/llvm-project/build/lib/Target/Sparc/SparcGenRegisterInfoMCDesc.inc C:/_work/llvm-project/llvm-project/build/lib/Target/Sparc/SparcGenRegisterInfoTargetDesc.inc</summary>

```
FAILED: [code=1] lib/Target/Sparc/SparcGenRegisterInfo.inc lib/Target/Sparc/SparcGenRegisterInfoEnums.inc lib/Target/Sparc/SparcGenRegisterInfoHeader.inc lib/Target/Sparc/SparcGenRegisterInfoMCDesc.inc lib/Target/Sparc/SparcGenRegisterInfoTargetDesc.inc C:/_work/llvm-project/llvm-project/build/lib/Target/Sparc/SparcGenRegisterInfo.inc C:/_work/llvm-project/llvm-project/build/lib/Target/Sparc/SparcGenRegisterInfoEnums.inc C:/_work/llvm-project/llvm-project/build/lib/Target/Sparc/SparcGenRegisterInfoHeader.inc C:/_work/llvm-project/llvm-project/build/lib/Target/Sparc/SparcGenRegisterInfoMCDesc.inc C:/_work/llvm-project/llvm-project/build/lib/Target/Sparc/SparcGenRegisterInfoTargetDesc.inc
C:\Windows\system32\cmd.exe /C "cd /D C:\_work\llvm-project\llvm-project\build\lib\Target\Sparc && C:\_work\llvm-project\llvm-project\build\bin\llvm-tblgen.exe -gen-register-info -IC:/_work/llvm-project/llvm-project/llvm/lib/Target/Sparc -IC:/_work/llvm-project/llvm-project/build/include -IC:/_work/llvm-project/llvm-project/llvm/include -I C:/_work/llvm-project/llvm-project/llvm/lib/Target --long-string-literals=0 C:/_work/llvm-project/llvm-project/llvm/lib/Target/Sparc/Sparc.td --write-if-changed -o SparcGenRegisterInfo.inc -d SparcGenRegisterInfo.inc.d && C:\BuildTools\Common7\IDE\CommonExtensions\Microsoft\CMake\CMake\bin\cmake.exe -E cmake_transform_depfile Ninja gccdepfile C:/_work/llvm-project/llvm-project/llvm C:/_work/llvm-project/llvm-project/llvm/lib/Target/Sparc C:/_work/llvm-project/llvm-project/build C:/_work/llvm-project/llvm-project/build/lib/Target/Sparc C:/_work/llvm-project/llvm-project/build/lib/Target/Sparc/SparcGenRegisterInfo.inc.d C:/_work/llvm-project/llvm-project/build/CMakeFiles/d/bdc627b719193576c49a93855b57dc45b0f2f0d024d127c8cc3200c46b0becf3.d"
Included from C:/_work/llvm-project/llvm-project/llvm/lib/Target/Sparc/Sparc.td:159:
C:/_work/llvm-project/llvm-project/llvm/lib/Target/Sparc\SparcInstrInfo.td:1141:21: error: Variable not defined: 'IIC_jmp_or_call'
IIC_jmp_or_call> {
^
```
</details>
<details>
<summary>[code=1] lib/Target/Sparc/SparcGenSDNodeInfo.inc C:/_work/llvm-project/llvm-project/build/lib/Target/Sparc/SparcGenSDNodeInfo.inc</summary>

```
FAILED: [code=1] lib/Target/Sparc/SparcGenSDNodeInfo.inc C:/_work/llvm-project/llvm-project/build/lib/Target/Sparc/SparcGenSDNodeInfo.inc
C:\Windows\system32\cmd.exe /C "cd /D C:\_work\llvm-project\llvm-project\build\lib\Target\Sparc && C:\_work\llvm-project\llvm-project\build\bin\llvm-tblgen.exe -gen-sd-node-info -sdnode-namespace=SPISD -IC:/_work/llvm-project/llvm-project/llvm/lib/Target/Sparc -IC:/_work/llvm-project/llvm-project/build/include -IC:/_work/llvm-project/llvm-project/llvm/include -I C:/_work/llvm-project/llvm-project/llvm/lib/Target --long-string-literals=0 C:/_work/llvm-project/llvm-project/llvm/lib/Target/Sparc/Sparc.td --write-if-changed -o SparcGenSDNodeInfo.inc -d SparcGenSDNodeInfo.inc.d && C:\BuildTools\Common7\IDE\CommonExtensions\Microsoft\CMake\CMake\bin\cmake.exe -E cmake_transform_depfile Ninja gccdepfile C:/_work/llvm-project/llvm-project/llvm C:/_work/llvm-project/llvm-project/llvm/lib/Target/Sparc C:/_work/llvm-project/llvm-project/build C:/_work/llvm-project/llvm-project/build/lib/Target/Sparc C:/_work/llvm-project/llvm-project/build/lib/Target/Sparc/SparcGenSDNodeInfo.inc.d C:/_work/llvm-project/llvm-project/build/CMakeFiles/d/bf533ece53d4f367281261fcd532638c3b95868ac698738b97cc548c0801d711.d"
Included from C:/_work/llvm-project/llvm-project/llvm/lib/Target/Sparc/Sparc.td:159:
C:/_work/llvm-project/llvm-project/llvm/lib/Target/Sparc\SparcInstrInfo.td:1141:21: error: Variable not defined: 'IIC_jmp_or_call'
IIC_jmp_or_call> {
^
```
</details>
<details>
<summary>[code=1] lib/Target/Sparc/SparcGenSearchableTables.inc C:/_work/llvm-project/llvm-project/build/lib/Target/Sparc/SparcGenSearchableTables.inc</summary>

```
FAILED: [code=1] lib/Target/Sparc/SparcGenSearchableTables.inc C:/_work/llvm-project/llvm-project/build/lib/Target/Sparc/SparcGenSearchableTables.inc
C:\Windows\system32\cmd.exe /C "cd /D C:\_work\llvm-project\llvm-project\build\lib\Target\Sparc && C:\_work\llvm-project\llvm-project\build\bin\llvm-tblgen.exe -gen-searchable-tables -IC:/_work/llvm-project/llvm-project/llvm/lib/Target/Sparc -IC:/_work/llvm-project/llvm-project/build/include -IC:/_work/llvm-project/llvm-project/llvm/include -I C:/_work/llvm-project/llvm-project/llvm/lib/Target --long-string-literals=0 C:/_work/llvm-project/llvm-project/llvm/lib/Target/Sparc/Sparc.td --write-if-changed -o SparcGenSearchableTables.inc -d SparcGenSearchableTables.inc.d && C:\BuildTools\Common7\IDE\CommonExtensions\Microsoft\CMake\CMake\bin\cmake.exe -E cmake_transform_depfile Ninja gccdepfile C:/_work/llvm-project/llvm-project/llvm C:/_work/llvm-project/llvm-project/llvm/lib/Target/Sparc C:/_work/llvm-project/llvm-project/build C:/_work/llvm-project/llvm-project/build/lib/Target/Sparc C:/_work/llvm-project/llvm-project/build/lib/Target/Sparc/SparcGenSearchableTables.inc.d C:/_work/llvm-project/llvm-project/build/CMakeFiles/d/bd3040b1d724c95de7bcdbf2f2e4ea2d9eb4ac845c06dfaa8d2fb942723cf3f2.d"
Included from C:/_work/llvm-project/llvm-project/llvm/lib/Target/Sparc/Sparc.td:159:
C:/_work/llvm-project/llvm-project/llvm/lib/Target/Sparc\SparcInstrInfo.td:1141:21: error: Variable not defined: 'IIC_jmp_or_call'
IIC_jmp_or_call> {
^
```
</details>
<details>
<summary>[code=1] lib/Target/Sparc/SparcGenSubtargetInfo.inc C:/_work/llvm-project/llvm-project/build/lib/Target/Sparc/SparcGenSubtargetInfo.inc</summary>

```
FAILED: [code=1] lib/Target/Sparc/SparcGenSubtargetInfo.inc C:/_work/llvm-project/llvm-project/build/lib/Target/Sparc/SparcGenSubtargetInfo.inc
C:\Windows\system32\cmd.exe /C "cd /D C:\_work\llvm-project\llvm-project\build\lib\Target\Sparc && C:\_work\llvm-project\llvm-project\build\bin\llvm-tblgen.exe -gen-subtarget -IC:/_work/llvm-project/llvm-project/llvm/lib/Target/Sparc -IC:/_work/llvm-project/llvm-project/build/include -IC:/_work/llvm-project/llvm-project/llvm/include -I C:/_work/llvm-project/llvm-project/llvm/lib/Target --long-string-literals=0 C:/_work/llvm-project/llvm-project/llvm/lib/Target/Sparc/Sparc.td --write-if-changed -o SparcGenSubtargetInfo.inc -d SparcGenSubtargetInfo.inc.d && C:\BuildTools\Common7\IDE\CommonExtensions\Microsoft\CMake\CMake\bin\cmake.exe -E cmake_transform_depfile Ninja gccdepfile C:/_work/llvm-project/llvm-project/llvm C:/_work/llvm-project/llvm-project/llvm/lib/Target/Sparc C:/_work/llvm-project/llvm-project/build C:/_work/llvm-project/llvm-project/build/lib/Target/Sparc C:/_work/llvm-project/llvm-project/build/lib/Target/Sparc/SparcGenSubtargetInfo.inc.d C:/_work/llvm-project/llvm-project/build/CMakeFiles/d/431c4fe93eda31bc39ca8421dde2fff0d68657b51e8c26e5a0e541d78d397066.d"
Included from C:/_work/llvm-project/llvm-project/llvm/lib/Target/Sparc/Sparc.td:159:
C:/_work/llvm-project/llvm-project/llvm/lib/Target/Sparc\SparcInstrInfo.td:1141:21: error: Variable not defined: 'IIC_jmp_or_call'
IIC_jmp_or_call> {
^
```
</details>

If these failures are unrelated to your changes (for example tests are broken or flaky at HEAD), please open an issue at https://github.com/llvm/llvm-project/issues and add the `infrastructure` label.

https://github.com/llvm/llvm-project/pull/226678


More information about the llvm-commits mailing list