[clang] [llvm] [LLVMABI][AARCH64] Implement Pure Scalable Type handling (PR #227504)
via llvm-commits
llvm-commits at lists.llvm.org
Tue Sep 29 19:16:22 PDT 2026
github-actions[bot] wrote:
<!--PREMERGE ADVISOR COMMENT: Linux-->
# :penguin: Linux x64 Test Results
* 156691 tests passed
* 2308 tests skipped
* 14 tests failed
## Failed Tests
(click on a test name to see its output)
### Clang
<details>
<summary>Clang.CIR/CodeGen/constexpr-ptr-offset.cpp</summary>
```
Exit Code: 1
Command Output (stdout):
--
# RUN: at line 1
/home/gha/actions-runner/_work/llvm-project/llvm-project/build/bin/clang -cc1 -internal-isystem /home/gha/actions-runner/_work/llvm-project/llvm-project/build/lib/clang/24/include -nostdsysteminc -std=c++17 -triple x86_64-unknown-linux-gnu -fclangir -emit-cir /home/gha/actions-runner/_work/llvm-project/llvm-project/clang/test/CIR/CodeGen/constexpr-ptr-offset.cpp -o /home/gha/actions-runner/_work/llvm-project/llvm-project/build/tools/clang/test/CIR/CodeGen/Output/constexpr-ptr-offset.cpp.tmp.cir
# executed command: /home/gha/actions-runner/_work/llvm-project/llvm-project/build/bin/clang -cc1 -internal-isystem /home/gha/actions-runner/_work/llvm-project/llvm-project/build/lib/clang/24/include -nostdsysteminc -std=c++17 -triple x86_64-unknown-linux-gnu -fclangir -emit-cir /home/gha/actions-runner/_work/llvm-project/llvm-project/clang/test/CIR/CodeGen/constexpr-ptr-offset.cpp -o /home/gha/actions-runner/_work/llvm-project/llvm-project/build/tools/clang/test/CIR/CodeGen/Output/constexpr-ptr-offset.cpp.tmp.cir
# note: command had no output on stdout or stderr
# RUN: at line 2
/home/gha/actions-runner/_work/llvm-project/llvm-project/build/bin/FileCheck --check-prefix=CIR --input-file=/home/gha/actions-runner/_work/llvm-project/llvm-project/build/tools/clang/test/CIR/CodeGen/Output/constexpr-ptr-offset.cpp.tmp.cir /home/gha/actions-runner/_work/llvm-project/llvm-project/clang/test/CIR/CodeGen/constexpr-ptr-offset.cpp
# executed command: /home/gha/actions-runner/_work/llvm-project/llvm-project/build/bin/FileCheck --check-prefix=CIR --input-file=/home/gha/actions-runner/_work/llvm-project/llvm-project/build/tools/clang/test/CIR/CodeGen/Output/constexpr-ptr-offset.cpp.tmp.cir /home/gha/actions-runner/_work/llvm-project/llvm-project/clang/test/CIR/CodeGen/constexpr-ptr-offset.cpp
# note: command had no output on stdout or stderr
# RUN: at line 3
/home/gha/actions-runner/_work/llvm-project/llvm-project/build/bin/clang -cc1 -internal-isystem /home/gha/actions-runner/_work/llvm-project/llvm-project/build/lib/clang/24/include -nostdsysteminc -std=c++17 -triple x86_64-unknown-linux-gnu -fclangir -emit-llvm /home/gha/actions-runner/_work/llvm-project/llvm-project/clang/test/CIR/CodeGen/constexpr-ptr-offset.cpp -o /home/gha/actions-runner/_work/llvm-project/llvm-project/build/tools/clang/test/CIR/CodeGen/Output/constexpr-ptr-offset.cpp.tmp-cir.ll
# executed command: /home/gha/actions-runner/_work/llvm-project/llvm-project/build/bin/clang -cc1 -internal-isystem /home/gha/actions-runner/_work/llvm-project/llvm-project/build/lib/clang/24/include -nostdsysteminc -std=c++17 -triple x86_64-unknown-linux-gnu -fclangir -emit-llvm /home/gha/actions-runner/_work/llvm-project/llvm-project/clang/test/CIR/CodeGen/constexpr-ptr-offset.cpp -o /home/gha/actions-runner/_work/llvm-project/llvm-project/build/tools/clang/test/CIR/CodeGen/Output/constexpr-ptr-offset.cpp.tmp-cir.ll
# note: command had no output on stdout or stderr
# RUN: at line 4
/home/gha/actions-runner/_work/llvm-project/llvm-project/build/bin/FileCheck --check-prefix=LLVM,LLVMCIR --input-file=/home/gha/actions-runner/_work/llvm-project/llvm-project/build/tools/clang/test/CIR/CodeGen/Output/constexpr-ptr-offset.cpp.tmp-cir.ll /home/gha/actions-runner/_work/llvm-project/llvm-project/clang/test/CIR/CodeGen/constexpr-ptr-offset.cpp
# executed command: /home/gha/actions-runner/_work/llvm-project/llvm-project/build/bin/FileCheck --check-prefix=LLVM,LLVMCIR --input-file=/home/gha/actions-runner/_work/llvm-project/llvm-project/build/tools/clang/test/CIR/CodeGen/Output/constexpr-ptr-offset.cpp.tmp-cir.ll /home/gha/actions-runner/_work/llvm-project/llvm-project/clang/test/CIR/CodeGen/constexpr-ptr-offset.cpp
# .---command stderr------------
# | /home/gha/actions-runner/_work/llvm-project/llvm-project/clang/test/CIR/CodeGen/constexpr-ptr-offset.cpp:23:13: error: LLVMCIR: expected string not found in input
# | // LLVMCIR: @__const._Z4testv.v = private constant %struct.View <{ ptr getelementptr inbounds nuw (i8, ptr @[[STR_NAME:.*]], i64 2), i32 3, [4 x i8] zeroinitializer }>
# | ^
# | /home/gha/actions-runner/_work/llvm-project/llvm-project/build/tools/clang/test/CIR/CodeGen/Output/constexpr-ptr-offset.cpp.tmp-cir.ll:1:1: note: scanning from here
# | ; ModuleID = '/home/gha/actions-runner/_work/llvm-project/llvm-project/clang/test/CIR/CodeGen/constexpr-ptr-offset.cpp'
# | ^
# | /home/gha/actions-runner/_work/llvm-project/llvm-project/build/tools/clang/test/CIR/CodeGen/Output/constexpr-ptr-offset.cpp.tmp-cir.ll:1:1: note: pattern attempts to capture variables: "STR_NAME"
# | ; ModuleID = '/home/gha/actions-runner/_work/llvm-project/llvm-project/clang/test/CIR/CodeGen/constexpr-ptr-offset.cpp'
# | ^
# | /home/gha/actions-runner/_work/llvm-project/llvm-project/build/tools/clang/test/CIR/CodeGen/Output/constexpr-ptr-offset.cpp.tmp-cir.ll:8:1: note: possible intended match here
# | @__const._Z4testv.v = private constant %struct.View <{ ptr getelementptr (i8, ptr @.str, i64 2), i32 3, [4 x i8] zeroinitializer }>, align 8
# | ^
# |
# | Input file: /home/gha/actions-runner/_work/llvm-project/llvm-project/build/tools/clang/test/CIR/CodeGen/Output/constexpr-ptr-offset.cpp.tmp-cir.ll
# | Check file: /home/gha/actions-runner/_work/llvm-project/llvm-project/clang/test/CIR/CodeGen/constexpr-ptr-offset.cpp
# |
# | -dump-input=help explains the following input dump.
# |
# | Input was:
# | <<<<<<
# | 1: ; ModuleID = '/home/gha/actions-runner/_work/llvm-project/llvm-project/clang/test/CIR/CodeGen/constexpr-ptr-offset.cpp'
# | check:23'0 { search range start (exclusive)
# | check:23'1 error: no match found in search range
# | check:23'2 pattern attempts to capture variables: "STR_NAME"
# | 2: source_filename = "/home/gha/actions-runner/_work/llvm-project/llvm-project/clang/test/CIR/CodeGen/constexpr-ptr-offset.cpp"
# | 3: target datalayout = "e-m:e-p270:32:32-p271:32:32-p272:64:64-i64:64-i128:128-f80:128-n8:16:32:64-S128"
# | 4: target triple = "x86_64-unknown-linux-gnu"
# | 5:
# | 6: %struct.View = type <{ ptr, i32, [4 x i8] }>
# | 7:
# | 8: @__const._Z4testv.v = private constant %struct.View <{ ptr getelementptr (i8, ptr @.str, i64 2), i32 3, [4 x i8] zeroinitializer }>, align 8
# | check:23'3 ? possible intended match
# | 9: @.str = private constant [6 x i8] c"hello\00", align 1
# | 10:
# | 11: ; Function Attrs: noinline
# | 12: define dso_local void @_Z4testv() #0 {
# | check:23'4 } search range end (exclusive)
# | 13: %1 = alloca %struct.View, align 8
# | 14: call void @llvm.memcpy.p0.p0.i64(ptr align 8 %1, ptr align 8 @__const._Z4testv.v, i64 16, i1 false)
# | 15: ret void
# | 16: }
# | 17:
# | .
# | .
# | .
# | >>>>>>
# `-----------------------------
# error: command failed with exit status: 1
--
```
</details>
<details>
<summary>Clang.CIR/CodeGen/global-ptr-init.cpp</summary>
```
Exit Code: 1
Command Output (stdout):
--
# RUN: at line 1
/home/gha/actions-runner/_work/llvm-project/llvm-project/build/bin/clang -cc1 -internal-isystem /home/gha/actions-runner/_work/llvm-project/llvm-project/build/lib/clang/24/include -nostdsysteminc -triple=x86_64-linux-gnu -std=gnu++14 -fclangir -emit-cir -o /home/gha/actions-runner/_work/llvm-project/llvm-project/build/tools/clang/test/CIR/CodeGen/Output/global-ptr-init.cpp.tmp.cir /home/gha/actions-runner/_work/llvm-project/llvm-project/clang/test/CIR/CodeGen/global-ptr-init.cpp
# executed command: /home/gha/actions-runner/_work/llvm-project/llvm-project/build/bin/clang -cc1 -internal-isystem /home/gha/actions-runner/_work/llvm-project/llvm-project/build/lib/clang/24/include -nostdsysteminc -triple=x86_64-linux-gnu -std=gnu++14 -fclangir -emit-cir -o /home/gha/actions-runner/_work/llvm-project/llvm-project/build/tools/clang/test/CIR/CodeGen/Output/global-ptr-init.cpp.tmp.cir /home/gha/actions-runner/_work/llvm-project/llvm-project/clang/test/CIR/CodeGen/global-ptr-init.cpp
# note: command had no output on stdout or stderr
# RUN: at line 2
/home/gha/actions-runner/_work/llvm-project/llvm-project/build/bin/FileCheck -check-prefix=CIR --input-file=/home/gha/actions-runner/_work/llvm-project/llvm-project/build/tools/clang/test/CIR/CodeGen/Output/global-ptr-init.cpp.tmp.cir /home/gha/actions-runner/_work/llvm-project/llvm-project/clang/test/CIR/CodeGen/global-ptr-init.cpp
# executed command: /home/gha/actions-runner/_work/llvm-project/llvm-project/build/bin/FileCheck -check-prefix=CIR --input-file=/home/gha/actions-runner/_work/llvm-project/llvm-project/build/tools/clang/test/CIR/CodeGen/Output/global-ptr-init.cpp.tmp.cir /home/gha/actions-runner/_work/llvm-project/llvm-project/clang/test/CIR/CodeGen/global-ptr-init.cpp
# note: command had no output on stdout or stderr
# RUN: at line 3
/home/gha/actions-runner/_work/llvm-project/llvm-project/build/bin/clang -cc1 -internal-isystem /home/gha/actions-runner/_work/llvm-project/llvm-project/build/lib/clang/24/include -nostdsysteminc -triple=x86_64-linux-gnu -std=gnu++14 -fclangir -emit-llvm -o /home/gha/actions-runner/_work/llvm-project/llvm-project/build/tools/clang/test/CIR/CodeGen/Output/global-ptr-init.cpp.tmp-cir.ll /home/gha/actions-runner/_work/llvm-project/llvm-project/clang/test/CIR/CodeGen/global-ptr-init.cpp
# executed command: /home/gha/actions-runner/_work/llvm-project/llvm-project/build/bin/clang -cc1 -internal-isystem /home/gha/actions-runner/_work/llvm-project/llvm-project/build/lib/clang/24/include -nostdsysteminc -triple=x86_64-linux-gnu -std=gnu++14 -fclangir -emit-llvm -o /home/gha/actions-runner/_work/llvm-project/llvm-project/build/tools/clang/test/CIR/CodeGen/Output/global-ptr-init.cpp.tmp-cir.ll /home/gha/actions-runner/_work/llvm-project/llvm-project/clang/test/CIR/CodeGen/global-ptr-init.cpp
# note: command had no output on stdout or stderr
# RUN: at line 4
/home/gha/actions-runner/_work/llvm-project/llvm-project/build/bin/FileCheck -check-prefix=LLVM --input-file=/home/gha/actions-runner/_work/llvm-project/llvm-project/build/tools/clang/test/CIR/CodeGen/Output/global-ptr-init.cpp.tmp-cir.ll /home/gha/actions-runner/_work/llvm-project/llvm-project/clang/test/CIR/CodeGen/global-ptr-init.cpp
# executed command: /home/gha/actions-runner/_work/llvm-project/llvm-project/build/bin/FileCheck -check-prefix=LLVM --input-file=/home/gha/actions-runner/_work/llvm-project/llvm-project/build/tools/clang/test/CIR/CodeGen/Output/global-ptr-init.cpp.tmp-cir.ll /home/gha/actions-runner/_work/llvm-project/llvm-project/clang/test/CIR/CodeGen/global-ptr-init.cpp
# .---command stderr------------
# | /home/gha/actions-runner/_work/llvm-project/llvm-project/clang/test/CIR/CodeGen/global-ptr-init.cpp:15:10: error: LLVM: expected string not found in input
# | // LLVM: @x = global %struct.B { ptr getelementptr inbounds nuw (i8, ptr @_ZTV1B, i64 16) }, align 8
# | ^
# | /home/gha/actions-runner/_work/llvm-project/llvm-project/build/tools/clang/test/CIR/CodeGen/Output/global-ptr-init.cpp.tmp-cir.ll:1:1: note: scanning from here
# | ; ModuleID = '/home/gha/actions-runner/_work/llvm-project/llvm-project/clang/test/CIR/CodeGen/global-ptr-init.cpp'
# | ^
# | /home/gha/actions-runner/_work/llvm-project/llvm-project/build/tools/clang/test/CIR/CodeGen/Output/global-ptr-init.cpp.tmp-cir.ll:24:1: note: possible intended match here
# | @x = global %struct.B { ptr getelementptr (i8, ptr @_ZTV1B, i64 16) }, align 8
# | ^
# |
# | Input file: /home/gha/actions-runner/_work/llvm-project/llvm-project/build/tools/clang/test/CIR/CodeGen/Output/global-ptr-init.cpp.tmp-cir.ll
# | Check file: /home/gha/actions-runner/_work/llvm-project/llvm-project/clang/test/CIR/CodeGen/global-ptr-init.cpp
# |
# | -dump-input=help explains the following input dump.
# |
# | Input was:
# | <<<<<<
# | 1: ; ModuleID = '/home/gha/actions-runner/_work/llvm-project/llvm-project/clang/test/CIR/CodeGen/global-ptr-init.cpp'
# | check:15'0 { search range start (exclusive)
# | check:15'1 error: no match found in search range
# | 2: source_filename = "/home/gha/actions-runner/_work/llvm-project/llvm-project/clang/test/CIR/CodeGen/global-ptr-init.cpp"
# | 3: target datalayout = "e-m:e-p270:32:32-p271:32:32-p272:64:64-i64:64-i128:128-f80:128-n8:16:32:64-S128"
# | 4: target triple = "x86_64-unknown-linux-gnu"
# | 5:
# | 6: %struct.B = type { ptr }
# | .
# | .
# | .
# | 19:
# | 20: $_ZTI1B = comdat any
# | 21:
# | 22: @__dso_handle = external hidden global i8
# | 23: @_ZTV1B = linkonce_odr constant { [5 x ptr] } { [5 x ptr] [ptr null, ptr @_ZTI1B, ptr @_ZN1B1fEv, ptr @_ZN1BD1Ev, ptr @_ZN1BD0Ev] }, comdat, align 8
# | 24: @x = global %struct.B { ptr getelementptr (i8, ptr @_ZTV1B, i64 16) }, align 8
# | check:15'2 ? possible intended match
# | 25: @_ZTVN10__cxxabiv117__class_type_infoE = external global ptr, align 8
# | 26: @_ZTS1B = linkonce_odr constant [3 x i8] c"1B\00", comdat, align 1
# | 27: @_ZTI1B = linkonce_odr constant { ptr, ptr } { ptr getelementptr (i8, ptr @_ZTVN10__cxxabiv117__class_type_infoE, i64 16), ptr @_ZTS1B }, comdat, align 8
# | 28: @llvm.global_ctors = appending global [1 x { i32, ptr, ptr }] [{ i32, ptr, ptr } { i32 65535, ptr @_GLOBAL__sub_I_global_ptr_init.cpp, ptr null }]
# | 29:
# | .
# | .
# | .
# | 94: attributes #2 = { nounwind }
# | 95: attributes #3 = { builtin nounwind }
# | 96:
# | 97: !llvm.module.flags = !{!0}
# | 98:
# | 99: !0 = !{i32 2, !"Debug Info Version", i32 3}
# | check:15'3 } search range end (exclusive)
# | >>>>>>
# `-----------------------------
# error: command failed with exit status: 1
--
```
</details>
<details>
<summary>Clang.CIR/CodeGen/globals.cpp</summary>
```
Exit Code: 1
Command Output (stdout):
--
# RUN: at line 1
/home/gha/actions-runner/_work/llvm-project/llvm-project/build/bin/clang -cc1 -internal-isystem /home/gha/actions-runner/_work/llvm-project/llvm-project/build/lib/clang/24/include -nostdsysteminc -std=c++17 -triple x86_64-unknown-linux-gnu -fclangir -emit-cir /home/gha/actions-runner/_work/llvm-project/llvm-project/clang/test/CIR/CodeGen/globals.cpp -o /home/gha/actions-runner/_work/llvm-project/llvm-project/build/tools/clang/test/CIR/CodeGen/Output/globals.cpp.tmp.cir
# executed command: /home/gha/actions-runner/_work/llvm-project/llvm-project/build/bin/clang -cc1 -internal-isystem /home/gha/actions-runner/_work/llvm-project/llvm-project/build/lib/clang/24/include -nostdsysteminc -std=c++17 -triple x86_64-unknown-linux-gnu -fclangir -emit-cir /home/gha/actions-runner/_work/llvm-project/llvm-project/clang/test/CIR/CodeGen/globals.cpp -o /home/gha/actions-runner/_work/llvm-project/llvm-project/build/tools/clang/test/CIR/CodeGen/Output/globals.cpp.tmp.cir
# note: command had no output on stdout or stderr
# RUN: at line 2
/home/gha/actions-runner/_work/llvm-project/llvm-project/build/bin/FileCheck --input-file=/home/gha/actions-runner/_work/llvm-project/llvm-project/build/tools/clang/test/CIR/CodeGen/Output/globals.cpp.tmp.cir /home/gha/actions-runner/_work/llvm-project/llvm-project/clang/test/CIR/CodeGen/globals.cpp --check-prefix=CIR
# executed command: /home/gha/actions-runner/_work/llvm-project/llvm-project/build/bin/FileCheck --input-file=/home/gha/actions-runner/_work/llvm-project/llvm-project/build/tools/clang/test/CIR/CodeGen/Output/globals.cpp.tmp.cir /home/gha/actions-runner/_work/llvm-project/llvm-project/clang/test/CIR/CodeGen/globals.cpp --check-prefix=CIR
# note: command had no output on stdout or stderr
# RUN: at line 3
/home/gha/actions-runner/_work/llvm-project/llvm-project/build/bin/clang -cc1 -internal-isystem /home/gha/actions-runner/_work/llvm-project/llvm-project/build/lib/clang/24/include -nostdsysteminc -std=c++17 -triple x86_64-unknown-linux-gnu -fclangir -emit-llvm /home/gha/actions-runner/_work/llvm-project/llvm-project/clang/test/CIR/CodeGen/globals.cpp -o /home/gha/actions-runner/_work/llvm-project/llvm-project/build/tools/clang/test/CIR/CodeGen/Output/globals.cpp.tmp-cir.ll
# executed command: /home/gha/actions-runner/_work/llvm-project/llvm-project/build/bin/clang -cc1 -internal-isystem /home/gha/actions-runner/_work/llvm-project/llvm-project/build/lib/clang/24/include -nostdsysteminc -std=c++17 -triple x86_64-unknown-linux-gnu -fclangir -emit-llvm /home/gha/actions-runner/_work/llvm-project/llvm-project/clang/test/CIR/CodeGen/globals.cpp -o /home/gha/actions-runner/_work/llvm-project/llvm-project/build/tools/clang/test/CIR/CodeGen/Output/globals.cpp.tmp-cir.ll
# note: command had no output on stdout or stderr
# RUN: at line 4
/home/gha/actions-runner/_work/llvm-project/llvm-project/build/bin/FileCheck --input-file=/home/gha/actions-runner/_work/llvm-project/llvm-project/build/tools/clang/test/CIR/CodeGen/Output/globals.cpp.tmp-cir.ll /home/gha/actions-runner/_work/llvm-project/llvm-project/clang/test/CIR/CodeGen/globals.cpp --check-prefix=LLVM
# executed command: /home/gha/actions-runner/_work/llvm-project/llvm-project/build/bin/FileCheck --input-file=/home/gha/actions-runner/_work/llvm-project/llvm-project/build/tools/clang/test/CIR/CodeGen/Output/globals.cpp.tmp-cir.ll /home/gha/actions-runner/_work/llvm-project/llvm-project/clang/test/CIR/CodeGen/globals.cpp --check-prefix=LLVM
# .---command stderr------------
# | /home/gha/actions-runner/_work/llvm-project/llvm-project/clang/test/CIR/CodeGen/globals.cpp:35:10: error: LLVM: expected string not found in input
# | // LLVM: @constArrAddr = global ptr getelementptr inbounds nuw (i8, ptr @arr, i64 132), align 8
# | ^
# | /home/gha/actions-runner/_work/llvm-project/llvm-project/build/tools/clang/test/CIR/CodeGen/Output/globals.cpp.tmp-cir.ll:8:42: note: scanning from here
# | @constFnAddr = global ptr @_Z1fv, align 8
# | ^
# | /home/gha/actions-runner/_work/llvm-project/llvm-project/build/tools/clang/test/CIR/CodeGen/Output/globals.cpp.tmp-cir.ll:10:1: note: possible intended match here
# | @constArrAddr = global ptr getelementptr (i8, ptr @arr, i64 132), align 8
# | ^
# |
# | Input file: /home/gha/actions-runner/_work/llvm-project/llvm-project/build/tools/clang/test/CIR/CodeGen/Output/globals.cpp.tmp-cir.ll
# | Check file: /home/gha/actions-runner/_work/llvm-project/llvm-project/clang/test/CIR/CodeGen/globals.cpp
# |
# | -dump-input=help explains the following input dump.
# |
# | Input was:
# | <<<<<<
# | 1: ; ModuleID = '/home/gha/actions-runner/_work/llvm-project/llvm-project/clang/test/CIR/CodeGen/globals.cpp'
# | 2: source_filename = "/home/gha/actions-runner/_work/llvm-project/llvm-project/clang/test/CIR/CodeGen/globals.cpp"
# | 3: target datalayout = "e-m:e-p270:32:32-p271:32:32-p272:64:64-i64:64-i128:128-f80:128-n8:16:32:64-S128"
# | 4: target triple = "x86_64-unknown-linux-gnu"
# | 5:
# | 6: @var = global i32 1, align 4
# | 7: @constAddr = global ptr @var, align 8
# | 8: @constFnAddr = global ptr @_Z1fv, align 8
# | check:35'0 { search range start (exclusive)
# | check:35'1 error: no match found in search range
# | 9: @arr = global [4 x [16 x i32]] zeroinitializer, align 16
# | 10: @constArrAddr = global ptr getelementptr (i8, ptr @arr, i64 132), align 8
# | check:35'2 ? possible intended match
# | 11: @bool_global = global i8 1, align 1
# | 12: @boolArr_global = global [4 x i8] c"\01\00\01\00", align 1
# | 13:
# | 14: declare noundef i32 @_Z1fv() #0
# | 15:
# | 16: attributes #0 = { "target-features"="+cx8,+mmx,+sse,+sse2,+x87" }
# | 17:
# | 18: !llvm.module.flags = !{!0}
# | 19:
# | 20: !0 = !{i32 2, !"Debug Info Version", i32 3}
# | check:35'3 } search range end (exclusive)
# | >>>>>>
# `-----------------------------
# error: command failed with exit status: 1
--
```
</details>
<details>
<summary>Clang.CIR/CodeGen/self-ref-temporaries.cpp</summary>
```
Exit Code: 1
Command Output (stdout):
--
# RUN: at line 1
/home/gha/actions-runner/_work/llvm-project/llvm-project/build/bin/clang -cc1 -internal-isystem /home/gha/actions-runner/_work/llvm-project/llvm-project/build/lib/clang/24/include -nostdsysteminc -triple x86_64-unknown-linux-gnu -fclangir -emit-cir /home/gha/actions-runner/_work/llvm-project/llvm-project/clang/test/CIR/CodeGen/self-ref-temporaries.cpp -o - | /home/gha/actions-runner/_work/llvm-project/llvm-project/build/bin/FileCheck /home/gha/actions-runner/_work/llvm-project/llvm-project/clang/test/CIR/CodeGen/self-ref-temporaries.cpp --check-prefix=CIR
# executed command: /home/gha/actions-runner/_work/llvm-project/llvm-project/build/bin/clang -cc1 -internal-isystem /home/gha/actions-runner/_work/llvm-project/llvm-project/build/lib/clang/24/include -nostdsysteminc -triple x86_64-unknown-linux-gnu -fclangir -emit-cir /home/gha/actions-runner/_work/llvm-project/llvm-project/clang/test/CIR/CodeGen/self-ref-temporaries.cpp -o -
# note: command had no output on stdout or stderr
# executed command: /home/gha/actions-runner/_work/llvm-project/llvm-project/build/bin/FileCheck /home/gha/actions-runner/_work/llvm-project/llvm-project/clang/test/CIR/CodeGen/self-ref-temporaries.cpp --check-prefix=CIR
# note: command had no output on stdout or stderr
# RUN: at line 2
/home/gha/actions-runner/_work/llvm-project/llvm-project/build/bin/clang -cc1 -internal-isystem /home/gha/actions-runner/_work/llvm-project/llvm-project/build/lib/clang/24/include -nostdsysteminc -triple x86_64-unknown-linux-gnu -fclangir -emit-llvm /home/gha/actions-runner/_work/llvm-project/llvm-project/clang/test/CIR/CodeGen/self-ref-temporaries.cpp -o - | /home/gha/actions-runner/_work/llvm-project/llvm-project/build/bin/FileCheck /home/gha/actions-runner/_work/llvm-project/llvm-project/clang/test/CIR/CodeGen/self-ref-temporaries.cpp --check-prefix=LLVM,LLVMCIR
# executed command: /home/gha/actions-runner/_work/llvm-project/llvm-project/build/bin/clang -cc1 -internal-isystem /home/gha/actions-runner/_work/llvm-project/llvm-project/build/lib/clang/24/include -nostdsysteminc -triple x86_64-unknown-linux-gnu -fclangir -emit-llvm /home/gha/actions-runner/_work/llvm-project/llvm-project/clang/test/CIR/CodeGen/self-ref-temporaries.cpp -o -
# note: command had no output on stdout or stderr
# executed command: /home/gha/actions-runner/_work/llvm-project/llvm-project/build/bin/FileCheck /home/gha/actions-runner/_work/llvm-project/llvm-project/clang/test/CIR/CodeGen/self-ref-temporaries.cpp --check-prefix=LLVM,LLVMCIR
# .---command stderr------------
# | /home/gha/actions-runner/_work/llvm-project/llvm-project/clang/test/CIR/CodeGen/self-ref-temporaries.cpp:18:13: error: LLVMCIR: expected string not found in input
# | // LLVMCIR: @_ZGR2sr_ = {{.*}}constant %struct.SelfRef <{ ptr getelementptr inbounds nuw (i8, ptr @_ZGR2sr_, i64 8), [3 x i32] [i32 1, i32 2, i32 3], [4 x i8] zeroinitializer }>, align 8
# | ^
# | <stdin>:10:46: note: scanning from here
# | @normal = constant ptr @_ZGR6normal_, align 8
# | ^
# | <stdin>:11:1: note: possible intended match here
# | @_ZGR2sr_ = internal constant %struct.SelfRef <{ ptr getelementptr (i8, ptr @_ZGR2sr_, i64 8), [3 x i32] [i32 1, i32 2, i32 3], [4 x i8] zeroinitializer }>, align 8
# | ^
# |
# | Input file: <stdin>
# | Check file: /home/gha/actions-runner/_work/llvm-project/llvm-project/clang/test/CIR/CodeGen/self-ref-temporaries.cpp
# |
# | -dump-input=help explains the following input dump.
# |
# | Input was:
# | <<<<<<
# | .
# | .
# | .
# | 5:
# | 6: %struct.SelfRef = type <{ ptr, [3 x i32], [4 x i8] }>
# | 7: %struct.MultiSelfRef = type <{ ptr, ptr, [3 x i32], [4 x i8] }>
# | 8:
# | 9: @_ZGR6normal_ = internal constant i32 42, align 4
# | 10: @normal = constant ptr @_ZGR6normal_, align 8
# | check:18'0 { search range start (exclusive)
# | check:18'1 error: no match found in search range
# | 11: @_ZGR2sr_ = internal constant %struct.SelfRef <{ ptr getelementptr (i8, ptr @_ZGR2sr_, i64 8), [3 x i32] [i32 1, i32 2, i32 3], [4 x i8] zeroinitializer }>, align 8
# | check:18'2 ? possible intended match
# | 12: @sr = constant ptr @_ZGR2sr_, align 8
# | 13: @_ZGR3msr_ = internal constant %struct.MultiSelfRef <{ ptr getelementptr (i8, ptr @_ZGR3msr_, i64 16), ptr getelementptr (i8, ptr @_ZGR3msr_, i64 16), [3 x i32] [i32 1, i32 2, i32 3], [4 x i8] zeroinitializer }>, align 8
# | 14: @msr = constant ptr @_ZGR3msr_, align 8
# | 15:
# | 16: !llvm.module.flags = !{!0}
# | 17:
# | 18: !0 = !{i32 2, !"Debug Info Version", i32 3}
# | check:18'3 } search range end (exclusive)
# | >>>>>>
# `-----------------------------
# error: command failed with exit status: 1
--
```
</details>
<details>
<summary>Clang.CIR/CodeGen/vtt.cpp</summary>
```
Exit Code: 1
Command Output (stdout):
--
# RUN: at line 1
/home/gha/actions-runner/_work/llvm-project/llvm-project/build/bin/clang -cc1 -internal-isystem /home/gha/actions-runner/_work/llvm-project/llvm-project/build/lib/clang/24/include -nostdsysteminc -triple x86_64-unknown-linux-gnu -fno-rtti -fclangir -emit-cir /home/gha/actions-runner/_work/llvm-project/llvm-project/clang/test/CIR/CodeGen/vtt.cpp -o /home/gha/actions-runner/_work/llvm-project/llvm-project/build/tools/clang/test/CIR/CodeGen/Output/vtt.cpp.tmp.cir
# executed command: /home/gha/actions-runner/_work/llvm-project/llvm-project/build/bin/clang -cc1 -internal-isystem /home/gha/actions-runner/_work/llvm-project/llvm-project/build/lib/clang/24/include -nostdsysteminc -triple x86_64-unknown-linux-gnu -fno-rtti -fclangir -emit-cir /home/gha/actions-runner/_work/llvm-project/llvm-project/clang/test/CIR/CodeGen/vtt.cpp -o /home/gha/actions-runner/_work/llvm-project/llvm-project/build/tools/clang/test/CIR/CodeGen/Output/vtt.cpp.tmp.cir
# note: command had no output on stdout or stderr
# RUN: at line 2
/home/gha/actions-runner/_work/llvm-project/llvm-project/build/bin/FileCheck --check-prefixes=CIR-NO-RTTI,CIR-COMMON --input-file=/home/gha/actions-runner/_work/llvm-project/llvm-project/build/tools/clang/test/CIR/CodeGen/Output/vtt.cpp.tmp.cir /home/gha/actions-runner/_work/llvm-project/llvm-project/clang/test/CIR/CodeGen/vtt.cpp
# executed command: /home/gha/actions-runner/_work/llvm-project/llvm-project/build/bin/FileCheck --check-prefixes=CIR-NO-RTTI,CIR-COMMON --input-file=/home/gha/actions-runner/_work/llvm-project/llvm-project/build/tools/clang/test/CIR/CodeGen/Output/vtt.cpp.tmp.cir /home/gha/actions-runner/_work/llvm-project/llvm-project/clang/test/CIR/CodeGen/vtt.cpp
# note: command had no output on stdout or stderr
# RUN: at line 3
/home/gha/actions-runner/_work/llvm-project/llvm-project/build/bin/clang -cc1 -internal-isystem /home/gha/actions-runner/_work/llvm-project/llvm-project/build/lib/clang/24/include -nostdsysteminc -triple x86_64-unknown-linux-gnu -fno-rtti -fclangir -emit-llvm /home/gha/actions-runner/_work/llvm-project/llvm-project/clang/test/CIR/CodeGen/vtt.cpp -o /home/gha/actions-runner/_work/llvm-project/llvm-project/build/tools/clang/test/CIR/CodeGen/Output/vtt.cpp.tmp-cir.ll
# executed command: /home/gha/actions-runner/_work/llvm-project/llvm-project/build/bin/clang -cc1 -internal-isystem /home/gha/actions-runner/_work/llvm-project/llvm-project/build/lib/clang/24/include -nostdsysteminc -triple x86_64-unknown-linux-gnu -fno-rtti -fclangir -emit-llvm /home/gha/actions-runner/_work/llvm-project/llvm-project/clang/test/CIR/CodeGen/vtt.cpp -o /home/gha/actions-runner/_work/llvm-project/llvm-project/build/tools/clang/test/CIR/CodeGen/Output/vtt.cpp.tmp-cir.ll
# note: command had no output on stdout or stderr
# RUN: at line 4
/home/gha/actions-runner/_work/llvm-project/llvm-project/build/bin/FileCheck --check-prefixes=LLVM-NO-RTTI,LLVM-COMMON --input-file=/home/gha/actions-runner/_work/llvm-project/llvm-project/build/tools/clang/test/CIR/CodeGen/Output/vtt.cpp.tmp-cir.ll /home/gha/actions-runner/_work/llvm-project/llvm-project/clang/test/CIR/CodeGen/vtt.cpp
# executed command: /home/gha/actions-runner/_work/llvm-project/llvm-project/build/bin/FileCheck --check-prefixes=LLVM-NO-RTTI,LLVM-COMMON --input-file=/home/gha/actions-runner/_work/llvm-project/llvm-project/build/tools/clang/test/CIR/CodeGen/Output/vtt.cpp.tmp-cir.ll /home/gha/actions-runner/_work/llvm-project/llvm-project/clang/test/CIR/CodeGen/vtt.cpp
# .---command stderr------------
# | /home/gha/actions-runner/_work/llvm-project/llvm-project/clang/test/CIR/CodeGen/vtt.cpp:120:22: error: LLVM-COMMON-SAME: is not on the same line as the previous match
# | // LLVM-COMMON-SAME: ptr getelementptr inbounds nuw (i8, ptr @_ZTV1D, i64 24),
# | ^
# | /home/gha/actions-runner/_work/llvm-project/llvm-project/build/tools/clang/test/CIR/CodeGen/Output/vtt.cpp.tmp-cir.ll:112:8: note: 'next' match was here
# | store ptr getelementptr inbounds nuw (i8, ptr @_ZTV1D, i64 24), ptr %3, align 8
# | ^
# | /home/gha/actions-runner/_work/llvm-project/llvm-project/build/tools/clang/test/CIR/CodeGen/Output/vtt.cpp.tmp-cir.ll:13:31: note: previous match ended here
# | @_ZTT1D = constant [7 x ptr] [ptr getelementptr (i8, ptr @_ZTV1D, i64 24), ptr getelementptr (i8, ptr @_ZTC1D0_1B, i64 24), ptr getelementptr (i8, ptr @_ZTC1D0_1B, i64 56), ptr getelementptr (i8, ptr @_ZTC1D16_1C, i64 24), ptr getelementptr (i8, ptr @_ZTC1D16_1C, i64 56), ptr getelementptr (i8, ptr @_ZTV1D, i64 96), ptr getelementptr (i8, ptr @_ZTV1D, i64 64)], align 8
# | ^
# |
# | Input file: /home/gha/actions-runner/_work/llvm-project/llvm-project/build/tools/clang/test/CIR/CodeGen/Output/vtt.cpp.tmp-cir.ll
# | Check file: /home/gha/actions-runner/_work/llvm-project/llvm-project/clang/test/CIR/CodeGen/vtt.cpp
# |
# | -dump-input=help explains the following input dump.
# |
# | Input was:
# | <<<<<<
# | .
# | .
# | .
# | 8: $_ZN1CC2Ev = comdat any
# | 9:
# | 10: $_ZN1AC2Ev = comdat any
# | 11:
# | 12: @_ZTV1D = constant { [5 x ptr], [4 x ptr], [4 x ptr] } { [5 x ptr] [ptr inttoptr (i64 40 to ptr), ptr null, ptr null, ptr @_ZN1B1wEv, ptr @_ZN1D1yEv], [4 x ptr] [ptr inttoptr (i64 24 to ptr), ptr inttoptr (i64 -16 to ptr), ptr null, ptr @_ZN1C1xEv], [4 x ptr] [ptr null, ptr inttoptr (i64 -40 to ptr), ptr null, ptr @_ZN1A1vEv] }, align 8
# | 13: @_ZTT1D = constant [7 x ptr] [ptr getelementptr (i8, ptr @_ZTV1D, i64 24), ptr getelementptr (i8, ptr @_ZTC1D0_1B, i64 24), ptr getelementptr (i8, ptr @_ZTC1D0_1B, i64 56), ptr getelementptr (i8, ptr @_ZTC1D16_1C, i64 24), ptr getelementptr (i8, ptr @_ZTC1D16_1C, i64 56), ptr getelementptr (i8, ptr @_ZTV1D, i64 96), ptr getelementptr (i8, ptr @_ZTV1D, i64 64)], align 8
# | same:120'0 { search range start (exclusive)
# | 14: @_ZTC1D0_1B = constant { [4 x ptr], [4 x ptr] } { [4 x ptr] [ptr inttoptr (i64 40 to ptr), ptr null, ptr null, ptr @_ZN1B1wEv], [4 x ptr] [ptr null, ptr inttoptr (i64 -40 to ptr), ptr null, ptr @_ZN1A1vEv] }, align 8
# | 15: @_ZTC1D16_1C = constant { [4 x ptr], [4 x ptr] } { [4 x ptr] [ptr inttoptr (i64 24 to ptr), ptr null, ptr null, ptr @_ZN1C1xEv], [4 x ptr] [ptr null, ptr inttoptr (i64 -24 to ptr), ptr null, ptr @_ZN1A1vEv] }, align 8
# | 16: @_ZTV1A = external constant { [3 x ptr] }, align 8
# | 17:
# | 18: ; Function Attrs: noinline
# | .
# | .
# | .
# | 107: %4 = getelementptr i8, ptr %3, i32 40
# | 108: call void @_ZN1AC2Ev(ptr noundef nonnull align 8 dereferenceable(12) %4) #2
# | 109: call void @_ZN1BC2Ev(ptr noundef nonnull align 8 dereferenceable(12) %3, ptr noundef getelementptr inbounds nuw (i8, ptr @_ZTT1D, i64 8)) #2
# | 110: %5 = getelementptr i8, ptr %3, i32 16
# | 111: call void @_ZN1CC2Ev(ptr noundef nonnull align 8 dereferenceable(16) %5, ptr noundef getelementptr inbounds nuw (i8, ptr @_ZTT1D, i64 24)) #2
# | 112: store ptr getelementptr inbounds nuw (i8, ptr @_ZTV1D, i64 24), ptr %3, align 8
# | same:120'1 !~~~~~~~~~~~~~~~~~~~~~~~~~~~~~~~~~~~~~~~~~~~~~~~~~~~~~~~~ error: match on wrong line
# | 113: %6 = getelementptr i8, ptr %3, i32 40
# | 114: store ptr getelementptr inbounds nuw (i8, ptr @_ZTV1D, i64 96), ptr %6, align 8
# | 115: %7 = getelementptr i8, ptr %3, i32 16
# | 116: store ptr getelementptr inbounds nuw (i8, ptr @_ZTV1D, i64 64), ptr %7, align 8
# | 117: ret void
# | .
# | .
# | .
# | 136: attributes #1 = { "target-features"="+cx8,+mmx,+sse,+sse2,+x87" }
# | 137: attributes #2 = { nounwind }
# | 138:
# | 139: !llvm.module.flags = !{!0}
# | 140:
# | 141: !0 = !{i32 2, !"Debug Info Version", i32 3}
# | same:120'2 } search range end (exclusive)
# | >>>>>>
# `-----------------------------
# error: command failed with exit status: 1
--
```
</details>
<details>
<summary>Clang.CIR/CodeGenCXX/base-layout.cpp</summary>
```
Exit Code: 1
Command Output (stdout):
--
# RUN: at line 1
/home/gha/actions-runner/_work/llvm-project/llvm-project/build/bin/clang -cc1 -internal-isystem /home/gha/actions-runner/_work/llvm-project/llvm-project/build/lib/clang/24/include -nostdsysteminc -std=c++20 -triple x86_64-unknown-linux-gnu -fclangir -emit-cir /home/gha/actions-runner/_work/llvm-project/llvm-project/clang/test/CIR/CodeGenCXX/base-layout.cpp -o /home/gha/actions-runner/_work/llvm-project/llvm-project/build/tools/clang/test/CIR/CodeGenCXX/Output/base-layout.cpp.tmp.cir
# executed command: /home/gha/actions-runner/_work/llvm-project/llvm-project/build/bin/clang -cc1 -internal-isystem /home/gha/actions-runner/_work/llvm-project/llvm-project/build/lib/clang/24/include -nostdsysteminc -std=c++20 -triple x86_64-unknown-linux-gnu -fclangir -emit-cir /home/gha/actions-runner/_work/llvm-project/llvm-project/clang/test/CIR/CodeGenCXX/base-layout.cpp -o /home/gha/actions-runner/_work/llvm-project/llvm-project/build/tools/clang/test/CIR/CodeGenCXX/Output/base-layout.cpp.tmp.cir
# note: command had no output on stdout or stderr
# RUN: at line 2
/home/gha/actions-runner/_work/llvm-project/llvm-project/build/bin/FileCheck --input-file=/home/gha/actions-runner/_work/llvm-project/llvm-project/build/tools/clang/test/CIR/CodeGenCXX/Output/base-layout.cpp.tmp.cir /home/gha/actions-runner/_work/llvm-project/llvm-project/clang/test/CIR/CodeGenCXX/base-layout.cpp -check-prefix=CIR
# executed command: /home/gha/actions-runner/_work/llvm-project/llvm-project/build/bin/FileCheck --input-file=/home/gha/actions-runner/_work/llvm-project/llvm-project/build/tools/clang/test/CIR/CodeGenCXX/Output/base-layout.cpp.tmp.cir /home/gha/actions-runner/_work/llvm-project/llvm-project/clang/test/CIR/CodeGenCXX/base-layout.cpp -check-prefix=CIR
# note: command had no output on stdout or stderr
# RUN: at line 3
/home/gha/actions-runner/_work/llvm-project/llvm-project/build/bin/clang -cc1 -internal-isystem /home/gha/actions-runner/_work/llvm-project/llvm-project/build/lib/clang/24/include -nostdsysteminc -std=c++20 -triple x86_64-unknown-linux-gnu -fclangir -emit-llvm /home/gha/actions-runner/_work/llvm-project/llvm-project/clang/test/CIR/CodeGenCXX/base-layout.cpp -o /home/gha/actions-runner/_work/llvm-project/llvm-project/build/tools/clang/test/CIR/CodeGenCXX/Output/base-layout.cpp.tmp-cir.ll
# executed command: /home/gha/actions-runner/_work/llvm-project/llvm-project/build/bin/clang -cc1 -internal-isystem /home/gha/actions-runner/_work/llvm-project/llvm-project/build/lib/clang/24/include -nostdsysteminc -std=c++20 -triple x86_64-unknown-linux-gnu -fclangir -emit-llvm /home/gha/actions-runner/_work/llvm-project/llvm-project/clang/test/CIR/CodeGenCXX/base-layout.cpp -o /home/gha/actions-runner/_work/llvm-project/llvm-project/build/tools/clang/test/CIR/CodeGenCXX/Output/base-layout.cpp.tmp-cir.ll
# note: command had no output on stdout or stderr
# RUN: at line 4
/home/gha/actions-runner/_work/llvm-project/llvm-project/build/bin/FileCheck --input-file=/home/gha/actions-runner/_work/llvm-project/llvm-project/build/tools/clang/test/CIR/CodeGenCXX/Output/base-layout.cpp.tmp-cir.ll /home/gha/actions-runner/_work/llvm-project/llvm-project/clang/test/CIR/CodeGenCXX/base-layout.cpp -check-prefix=LLVM
# executed command: /home/gha/actions-runner/_work/llvm-project/llvm-project/build/bin/FileCheck --input-file=/home/gha/actions-runner/_work/llvm-project/llvm-project/build/tools/clang/test/CIR/CodeGenCXX/Output/base-layout.cpp.tmp-cir.ll /home/gha/actions-runner/_work/llvm-project/llvm-project/clang/test/CIR/CodeGenCXX/base-layout.cpp -check-prefix=LLVM
# .---command stderr------------
# | /home/gha/actions-runner/_work/llvm-project/llvm-project/clang/test/CIR/CodeGenCXX/base-layout.cpp:18:10: error: LLVM: expected string not found in input
# | // LLVM: @d = global %struct.D { %struct.V3 { ptr getelementptr inbounds nuw (i8, ptr @_ZTV1D, i64 16) }, %struct.B { %struct.V1 { ptr getelementptr inbounds nuw (i8, ptr @_ZTV1D, i64 40) }, %struct.V2 { ptr getelementptr inbounds nuw (i8, ptr @_ZTV1D, i64 64) } } }
# | ^
# | /home/gha/actions-runner/_work/llvm-project/llvm-project/build/tools/clang/test/CIR/CodeGenCXX/Output/base-layout.cpp.tmp-cir.ll:1:1: note: scanning from here
# | ; ModuleID = '/home/gha/actions-runner/_work/llvm-project/llvm-project/clang/test/CIR/CodeGenCXX/base-layout.cpp'
# | ^
# | /home/gha/actions-runner/_work/llvm-project/llvm-project/build/tools/clang/test/CIR/CodeGenCXX/Output/base-layout.cpp.tmp-cir.ll:25:1: note: possible intended match here
# | @d = global %struct.D { %struct.V3 { ptr getelementptr (i8, ptr @_ZTV1D, i64 16) }, %struct.B { %struct.V1 { ptr getelementptr (i8, ptr @_ZTV1D, i64 40) }, %struct.V2 { ptr getelementptr (i8, ptr @_ZTV1D, i64 64) } } }, align 8
# | ^
# |
# | Input file: /home/gha/actions-runner/_work/llvm-project/llvm-project/build/tools/clang/test/CIR/CodeGenCXX/Output/base-layout.cpp.tmp-cir.ll
# | Check file: /home/gha/actions-runner/_work/llvm-project/llvm-project/clang/test/CIR/CodeGenCXX/base-layout.cpp
# |
# | -dump-input=help explains the following input dump.
# |
# | Input was:
# | <<<<<<
# | 1: ; ModuleID = '/home/gha/actions-runner/_work/llvm-project/llvm-project/clang/test/CIR/CodeGenCXX/base-layout.cpp'
# | check:18'0 { search range start (exclusive)
# | check:18'1 error: no match found in search range
# | 2: source_filename = "/home/gha/actions-runner/_work/llvm-project/llvm-project/clang/test/CIR/CodeGenCXX/base-layout.cpp"
# | 3: target datalayout = "e-m:e-p270:32:32-p271:32:32-p272:64:64-i64:64-i128:128-f80:128-n8:16:32:64-S128"
# | 4: target triple = "x86_64-unknown-linux-gnu"
# | 5:
# | 6: %struct.D = type { %struct.V3, %struct.B }
# | .
# | .
# | .
# | 20: $_ZTI1B = comdat any
# | 21:
# | 22: $_ZTI1D = comdat any
# | 23:
# | 24: @_ZTV1D = linkonce_odr constant { [3 x ptr], [3 x ptr], [3 x ptr] } { [3 x ptr] [ptr null, ptr @_ZTI1D, ptr @_ZN2V32v3Ev], [3 x ptr] [ptr inttoptr (i64 -8 to ptr), ptr @_ZTI1D, ptr @_ZN2V12v1Ev], [3 x ptr] [ptr inttoptr (i64 -16 to ptr), ptr @_ZTI1D, ptr @_ZN2V22v2Ev] }, comdat, align 8
# | 25: @d = global %struct.D { %struct.V3 { ptr getelementptr (i8, ptr @_ZTV1D, i64 16) }, %struct.B { %struct.V1 { ptr getelementptr (i8, ptr @_ZTV1D, i64 40) }, %struct.V2 { ptr getelementptr (i8, ptr @_ZTV1D, i64 64) } } }, align 8
# | check:18'2 ? possible intended match
# | 26: @gd = global %struct.Derived { %struct.Base.base <{ i32 1, i8 2 }>, i8 3, [2 x i8] zeroinitializer }, align 4
# | 27: @_ZTVN10__cxxabiv121__vmi_class_type_infoE = external global ptr, align 8
# | 28: @_ZTS1D = linkonce_odr constant [3 x i8] c"1D\00", comdat, align 1
# | 29: @_ZTI2V3 = external constant ptr
# | 30: @_ZTS1B = linkonce_odr constant [3 x i8] c"1B\00", comdat, align 1
# | .
# | .
# | .
# | 41:
# | 42: attributes #0 = { "target-features"="+cx8,+mmx,+sse,+sse2,+x87" }
# | 43:
# | 44: !llvm.module.flags = !{!0}
# | 45:
# | 46: !0 = !{i32 2, !"Debug Info Version", i32 3}
# | check:18'3 } search range end (exclusive)
# | >>>>>>
# `-----------------------------
# error: command failed with exit status: 1
--
```
</details>
<details>
<summary>Clang.CIR/CodeGenCXX/vtable-linkage.cpp</summary>
```
Exit Code: 1
Command Output (stdout):
--
# RUN: at line 1
/home/gha/actions-runner/_work/llvm-project/llvm-project/build/bin/clang -cc1 -internal-isystem /home/gha/actions-runner/_work/llvm-project/llvm-project/build/lib/clang/24/include -nostdsysteminc -triple x86_64-pc-linux -fclangir -emit-cir -mmlir --mlir-print-ir-before=cir-lowering-prepare /home/gha/actions-runner/_work/llvm-project/llvm-project/clang/test/CIR/CodeGenCXX/vtable-linkage.cpp -o /home/gha/actions-runner/_work/llvm-project/llvm-project/build/tools/clang/test/CIR/CodeGenCXX/Output/vtable-linkage.cpp.tmp.cir 2> /home/gha/actions-runner/_work/llvm-project/llvm-project/build/tools/clang/test/CIR/CodeGenCXX/Output/vtable-linkage.cpp.tmp-before.cir
# executed command: /home/gha/actions-runner/_work/llvm-project/llvm-project/build/bin/clang -cc1 -internal-isystem /home/gha/actions-runner/_work/llvm-project/llvm-project/build/lib/clang/24/include -nostdsysteminc -triple x86_64-pc-linux -fclangir -emit-cir -mmlir --mlir-print-ir-before=cir-lowering-prepare /home/gha/actions-runner/_work/llvm-project/llvm-project/clang/test/CIR/CodeGenCXX/vtable-linkage.cpp -o /home/gha/actions-runner/_work/llvm-project/llvm-project/build/tools/clang/test/CIR/CodeGenCXX/Output/vtable-linkage.cpp.tmp.cir
# note: command had no output on stdout or stderr
# RUN: at line 2
/home/gha/actions-runner/_work/llvm-project/llvm-project/build/bin/FileCheck /home/gha/actions-runner/_work/llvm-project/llvm-project/clang/test/CIR/CodeGenCXX/vtable-linkage.cpp --input-file=/home/gha/actions-runner/_work/llvm-project/llvm-project/build/tools/clang/test/CIR/CodeGenCXX/Output/vtable-linkage.cpp.tmp-before.cir --check-prefixes=CIR
# executed command: /home/gha/actions-runner/_work/llvm-project/llvm-project/build/bin/FileCheck /home/gha/actions-runner/_work/llvm-project/llvm-project/clang/test/CIR/CodeGenCXX/vtable-linkage.cpp --input-file=/home/gha/actions-runner/_work/llvm-project/llvm-project/build/tools/clang/test/CIR/CodeGenCXX/Output/vtable-linkage.cpp.tmp-before.cir --check-prefixes=CIR
# note: command had no output on stdout or stderr
# RUN: at line 3
/home/gha/actions-runner/_work/llvm-project/llvm-project/build/bin/FileCheck /home/gha/actions-runner/_work/llvm-project/llvm-project/clang/test/CIR/CodeGenCXX/vtable-linkage.cpp --input-file=/home/gha/actions-runner/_work/llvm-project/llvm-project/build/tools/clang/test/CIR/CodeGenCXX/Output/vtable-linkage.cpp.tmp.cir --check-prefixes=CIR
# executed command: /home/gha/actions-runner/_work/llvm-project/llvm-project/build/bin/FileCheck /home/gha/actions-runner/_work/llvm-project/llvm-project/clang/test/CIR/CodeGenCXX/vtable-linkage.cpp --input-file=/home/gha/actions-runner/_work/llvm-project/llvm-project/build/tools/clang/test/CIR/CodeGenCXX/Output/vtable-linkage.cpp.tmp.cir --check-prefixes=CIR
# note: command had no output on stdout or stderr
# RUN: at line 4
/home/gha/actions-runner/_work/llvm-project/llvm-project/build/bin/clang -cc1 -internal-isystem /home/gha/actions-runner/_work/llvm-project/llvm-project/build/lib/clang/24/include -nostdsysteminc /home/gha/actions-runner/_work/llvm-project/llvm-project/clang/test/CIR/CodeGenCXX/vtable-linkage.cpp -triple=x86_64-pc-linux -fclangir -emit-llvm -o /home/gha/actions-runner/_work/llvm-project/llvm-project/build/tools/clang/test/CIR/CodeGenCXX/Output/vtable-linkage.cpp.tmp-cir.ll
# executed command: /home/gha/actions-runner/_work/llvm-project/llvm-project/build/bin/clang -cc1 -internal-isystem /home/gha/actions-runner/_work/llvm-project/llvm-project/build/lib/clang/24/include -nostdsysteminc /home/gha/actions-runner/_work/llvm-project/llvm-project/clang/test/CIR/CodeGenCXX/vtable-linkage.cpp -triple=x86_64-pc-linux -fclangir -emit-llvm -o /home/gha/actions-runner/_work/llvm-project/llvm-project/build/tools/clang/test/CIR/CodeGenCXX/Output/vtable-linkage.cpp.tmp-cir.ll
# note: command had no output on stdout or stderr
# RUN: at line 5
/home/gha/actions-runner/_work/llvm-project/llvm-project/build/bin/FileCheck /home/gha/actions-runner/_work/llvm-project/llvm-project/clang/test/CIR/CodeGenCXX/vtable-linkage.cpp --input-file=/home/gha/actions-runner/_work/llvm-project/llvm-project/build/tools/clang/test/CIR/CodeGenCXX/Output/vtable-linkage.cpp.tmp-cir.ll --check-prefixes=LLVM
# executed command: /home/gha/actions-runner/_work/llvm-project/llvm-project/build/bin/FileCheck /home/gha/actions-runner/_work/llvm-project/llvm-project/clang/test/CIR/CodeGenCXX/vtable-linkage.cpp --input-file=/home/gha/actions-runner/_work/llvm-project/llvm-project/build/tools/clang/test/CIR/CodeGenCXX/Output/vtable-linkage.cpp.tmp-cir.ll --check-prefixes=LLVM
# .---command stderr------------
# | /home/gha/actions-runner/_work/llvm-project/llvm-project/clang/test/CIR/CodeGenCXX/vtable-linkage.cpp:124:14: error: LLVM-DAG: expected string not found in input
# | // LLVM-DAG: @_ZTT1C = linkonce_odr{{.*}} constant [2 x ptr] [ptr getelementptr inbounds{{.*}}({{.*}}, ptr @_ZTV1C, {{.*}}, ptr getelementptr inbounds {{.*}}({{.*}}, ptr @_ZTV1C{{.*}})]
# | ^
# | /home/gha/actions-runner/_work/llvm-project/llvm-project/build/tools/clang/test/CIR/CodeGenCXX/Output/vtable-linkage.cpp.tmp-cir.ll:1:1: note: scanning from here
# | ; ModuleID = '/home/gha/actions-runner/_work/llvm-project/llvm-project/clang/test/CIR/CodeGenCXX/vtable-linkage.cpp'
# | ^
# |
# | Input file: /home/gha/actions-runner/_work/llvm-project/llvm-project/build/tools/clang/test/CIR/CodeGenCXX/Output/vtable-linkage.cpp.tmp-cir.ll
# | Check file: /home/gha/actions-runner/_work/llvm-project/llvm-project/clang/test/CIR/CodeGenCXX/vtable-linkage.cpp
# |
# | -dump-input=help explains the following input dump.
# |
# | Input was:
# | <<<<<<
# | 1: ; ModuleID = '/home/gha/actions-runner/_work/llvm-project/llvm-project/clang/test/CIR/CodeGenCXX/vtable-linkage.cpp'
# | dag:124'0 { search range start (exclusive)
# | dag:124'1 error: no match found in search range
# | 2: source_filename = "/home/gha/actions-runner/_work/llvm-project/llvm-project/clang/test/CIR/CodeGenCXX/vtable-linkage.cpp"
# | 3: target datalayout = "e-m:e-p270:32:32-p271:32:32-p272:64:64-i64:64-i128:128-f80:128-n8:16:32:64-S128"
# | 4: target triple = "x86_64-pc-linux"
# | 5:
# | 6: %struct.anon.0 = type { %struct.D }
# | .
# | .
# | .
# | 692: attributes #5 = { builtin nounwind }
# | 693: attributes #6 = { builtin allocsize(0) }
# | 694:
# | 695: !llvm.module.flags = !{!0}
# | 696:
# | 697: !0 = !{i32 2, !"Debug Info Version", i32 3}
# | dag:124'2 } search range end (exclusive)
# | >>>>>>
# `-----------------------------
# error: command failed with exit status: 1
--
```
</details>
<details>
<summary>Clang.CIR/CodeGen/constexpr-ptr-offset.cpp</summary>
```
Exit Code: 1
Command Output (stdout):
--
# RUN: at line 1
/home/gha/actions-runner/_work/llvm-project/llvm-project/build/bin/clang -cc1 -internal-isystem /home/gha/actions-runner/_work/llvm-project/llvm-project/build/lib/clang/24/include -nostdsysteminc -std=c++17 -triple x86_64-unknown-linux-gnu -fclangir -emit-cir /home/gha/actions-runner/_work/llvm-project/llvm-project/clang/test/CIR/CodeGen/constexpr-ptr-offset.cpp -o /home/gha/actions-runner/_work/llvm-project/llvm-project/build/tools/clang/test/CIR/CodeGen/Output/constexpr-ptr-offset.cpp.tmp.cir
# executed command: /home/gha/actions-runner/_work/llvm-project/llvm-project/build/bin/clang -cc1 -internal-isystem /home/gha/actions-runner/_work/llvm-project/llvm-project/build/lib/clang/24/include -nostdsysteminc -std=c++17 -triple x86_64-unknown-linux-gnu -fclangir -emit-cir /home/gha/actions-runner/_work/llvm-project/llvm-project/clang/test/CIR/CodeGen/constexpr-ptr-offset.cpp -o /home/gha/actions-runner/_work/llvm-project/llvm-project/build/tools/clang/test/CIR/CodeGen/Output/constexpr-ptr-offset.cpp.tmp.cir
# note: command had no output on stdout or stderr
# RUN: at line 2
/home/gha/actions-runner/_work/llvm-project/llvm-project/build/bin/FileCheck --check-prefix=CIR --input-file=/home/gha/actions-runner/_work/llvm-project/llvm-project/build/tools/clang/test/CIR/CodeGen/Output/constexpr-ptr-offset.cpp.tmp.cir /home/gha/actions-runner/_work/llvm-project/llvm-project/clang/test/CIR/CodeGen/constexpr-ptr-offset.cpp
# executed command: /home/gha/actions-runner/_work/llvm-project/llvm-project/build/bin/FileCheck --check-prefix=CIR --input-file=/home/gha/actions-runner/_work/llvm-project/llvm-project/build/tools/clang/test/CIR/CodeGen/Output/constexpr-ptr-offset.cpp.tmp.cir /home/gha/actions-runner/_work/llvm-project/llvm-project/clang/test/CIR/CodeGen/constexpr-ptr-offset.cpp
# note: command had no output on stdout or stderr
# RUN: at line 3
/home/gha/actions-runner/_work/llvm-project/llvm-project/build/bin/clang -cc1 -internal-isystem /home/gha/actions-runner/_work/llvm-project/llvm-project/build/lib/clang/24/include -nostdsysteminc -std=c++17 -triple x86_64-unknown-linux-gnu -fclangir -emit-llvm /home/gha/actions-runner/_work/llvm-project/llvm-project/clang/test/CIR/CodeGen/constexpr-ptr-offset.cpp -o /home/gha/actions-runner/_work/llvm-project/llvm-project/build/tools/clang/test/CIR/CodeGen/Output/constexpr-ptr-offset.cpp.tmp-cir.ll
# executed command: /home/gha/actions-runner/_work/llvm-project/llvm-project/build/bin/clang -cc1 -internal-isystem /home/gha/actions-runner/_work/llvm-project/llvm-project/build/lib/clang/24/include -nostdsysteminc -std=c++17 -triple x86_64-unknown-linux-gnu -fclangir -emit-llvm /home/gha/actions-runner/_work/llvm-project/llvm-project/clang/test/CIR/CodeGen/constexpr-ptr-offset.cpp -o /home/gha/actions-runner/_work/llvm-project/llvm-project/build/tools/clang/test/CIR/CodeGen/Output/constexpr-ptr-offset.cpp.tmp-cir.ll
# note: command had no output on stdout or stderr
# RUN: at line 4
/home/gha/actions-runner/_work/llvm-project/llvm-project/build/bin/FileCheck --check-prefix=LLVM,LLVMCIR --input-file=/home/gha/actions-runner/_work/llvm-project/llvm-project/build/tools/clang/test/CIR/CodeGen/Output/constexpr-ptr-offset.cpp.tmp-cir.ll /home/gha/actions-runner/_work/llvm-project/llvm-project/clang/test/CIR/CodeGen/constexpr-ptr-offset.cpp
# executed command: /home/gha/actions-runner/_work/llvm-project/llvm-project/build/bin/FileCheck --check-prefix=LLVM,LLVMCIR --input-file=/home/gha/actions-runner/_work/llvm-project/llvm-project/build/tools/clang/test/CIR/CodeGen/Output/constexpr-ptr-offset.cpp.tmp-cir.ll /home/gha/actions-runner/_work/llvm-project/llvm-project/clang/test/CIR/CodeGen/constexpr-ptr-offset.cpp
# .---command stderr------------
# | /home/gha/actions-runner/_work/llvm-project/llvm-project/clang/test/CIR/CodeGen/constexpr-ptr-offset.cpp:23:13: error: LLVMCIR: expected string not found in input
# | // LLVMCIR: @__const._Z4testv.v = private constant %struct.View <{ ptr getelementptr inbounds nuw (i8, ptr @[[STR_NAME:.*]], i64 2), i32 3, [4 x i8] zeroinitializer }>
# | ^
# | /home/gha/actions-runner/_work/llvm-project/llvm-project/build/tools/clang/test/CIR/CodeGen/Output/constexpr-ptr-offset.cpp.tmp-cir.ll:1:1: note: scanning from here
# | ; ModuleID = '/home/gha/actions-runner/_work/llvm-project/llvm-project/clang/test/CIR/CodeGen/constexpr-ptr-offset.cpp'
# | ^
# | /home/gha/actions-runner/_work/llvm-project/llvm-project/build/tools/clang/test/CIR/CodeGen/Output/constexpr-ptr-offset.cpp.tmp-cir.ll:1:1: note: pattern attempts to capture variables: "STR_NAME"
# | ; ModuleID = '/home/gha/actions-runner/_work/llvm-project/llvm-project/clang/test/CIR/CodeGen/constexpr-ptr-offset.cpp'
# | ^
# | /home/gha/actions-runner/_work/llvm-project/llvm-project/build/tools/clang/test/CIR/CodeGen/Output/constexpr-ptr-offset.cpp.tmp-cir.ll:8:1: note: possible intended match here
# | @__const._Z4testv.v = private constant %struct.View <{ ptr getelementptr (i8, ptr @.str, i64 2), i32 3, [4 x i8] zeroinitializer }>, align 8
# | ^
# |
# | Input file: /home/gha/actions-runner/_work/llvm-project/llvm-project/build/tools/clang/test/CIR/CodeGen/Output/constexpr-ptr-offset.cpp.tmp-cir.ll
# | Check file: /home/gha/actions-runner/_work/llvm-project/llvm-project/clang/test/CIR/CodeGen/constexpr-ptr-offset.cpp
# |
# | -dump-input=help explains the following input dump.
# |
# | Input was:
# | <<<<<<
# | 1: ; ModuleID = '/home/gha/actions-runner/_work/llvm-project/llvm-project/clang/test/CIR/CodeGen/constexpr-ptr-offset.cpp'
# | check:23'0 { search range start (exclusive)
# | check:23'1 error: no match found in search range
# | check:23'2 pattern attempts to capture variables: "STR_NAME"
# | 2: source_filename = "/home/gha/actions-runner/_work/llvm-project/llvm-project/clang/test/CIR/CodeGen/constexpr-ptr-offset.cpp"
# | 3: target datalayout = "e-m:e-p270:32:32-p271:32:32-p272:64:64-i64:64-i128:128-f80:128-n8:16:32:64-S128"
# | 4: target triple = "x86_64-unknown-linux-gnu"
# | 5:
# | 6: %struct.View = type <{ ptr, i32, [4 x i8] }>
# | 7:
# | 8: @__const._Z4testv.v = private constant %struct.View <{ ptr getelementptr (i8, ptr @.str, i64 2), i32 3, [4 x i8] zeroinitializer }>, align 8
# | check:23'3 ? possible intended match
# | 9: @.str = private constant [6 x i8] c"hello\00", align 1
# | 10:
# | 11: ; Function Attrs: noinline
# | 12: define dso_local void @_Z4testv() #0 {
# | check:23'4 } search range end (exclusive)
# | 13: %1 = alloca %struct.View, align 8
# | 14: call void @llvm.memcpy.p0.p0.i64(ptr align 8 %1, ptr align 8 @__const._Z4testv.v, i64 16, i1 false)
# | 15: ret void
# | 16: }
# | 17:
# | .
# | .
# | .
# | >>>>>>
# `-----------------------------
# error: command failed with exit status: 1
--
```
</details>
<details>
<summary>Clang.CIR/CodeGen/global-ptr-init.cpp</summary>
```
Exit Code: 1
Command Output (stdout):
--
# RUN: at line 1
/home/gha/actions-runner/_work/llvm-project/llvm-project/build/bin/clang -cc1 -internal-isystem /home/gha/actions-runner/_work/llvm-project/llvm-project/build/lib/clang/24/include -nostdsysteminc -triple=x86_64-linux-gnu -std=gnu++14 -fclangir -emit-cir -o /home/gha/actions-runner/_work/llvm-project/llvm-project/build/tools/clang/test/CIR/CodeGen/Output/global-ptr-init.cpp.tmp.cir /home/gha/actions-runner/_work/llvm-project/llvm-project/clang/test/CIR/CodeGen/global-ptr-init.cpp
# executed command: /home/gha/actions-runner/_work/llvm-project/llvm-project/build/bin/clang -cc1 -internal-isystem /home/gha/actions-runner/_work/llvm-project/llvm-project/build/lib/clang/24/include -nostdsysteminc -triple=x86_64-linux-gnu -std=gnu++14 -fclangir -emit-cir -o /home/gha/actions-runner/_work/llvm-project/llvm-project/build/tools/clang/test/CIR/CodeGen/Output/global-ptr-init.cpp.tmp.cir /home/gha/actions-runner/_work/llvm-project/llvm-project/clang/test/CIR/CodeGen/global-ptr-init.cpp
# note: command had no output on stdout or stderr
# RUN: at line 2
/home/gha/actions-runner/_work/llvm-project/llvm-project/build/bin/FileCheck -check-prefix=CIR --input-file=/home/gha/actions-runner/_work/llvm-project/llvm-project/build/tools/clang/test/CIR/CodeGen/Output/global-ptr-init.cpp.tmp.cir /home/gha/actions-runner/_work/llvm-project/llvm-project/clang/test/CIR/CodeGen/global-ptr-init.cpp
# executed command: /home/gha/actions-runner/_work/llvm-project/llvm-project/build/bin/FileCheck -check-prefix=CIR --input-file=/home/gha/actions-runner/_work/llvm-project/llvm-project/build/tools/clang/test/CIR/CodeGen/Output/global-ptr-init.cpp.tmp.cir /home/gha/actions-runner/_work/llvm-project/llvm-project/clang/test/CIR/CodeGen/global-ptr-init.cpp
# note: command had no output on stdout or stderr
# RUN: at line 3
/home/gha/actions-runner/_work/llvm-project/llvm-project/build/bin/clang -cc1 -internal-isystem /home/gha/actions-runner/_work/llvm-project/llvm-project/build/lib/clang/24/include -nostdsysteminc -triple=x86_64-linux-gnu -std=gnu++14 -fclangir -emit-llvm -o /home/gha/actions-runner/_work/llvm-project/llvm-project/build/tools/clang/test/CIR/CodeGen/Output/global-ptr-init.cpp.tmp-cir.ll /home/gha/actions-runner/_work/llvm-project/llvm-project/clang/test/CIR/CodeGen/global-ptr-init.cpp
# executed command: /home/gha/actions-runner/_work/llvm-project/llvm-project/build/bin/clang -cc1 -internal-isystem /home/gha/actions-runner/_work/llvm-project/llvm-project/build/lib/clang/24/include -nostdsysteminc -triple=x86_64-linux-gnu -std=gnu++14 -fclangir -emit-llvm -o /home/gha/actions-runner/_work/llvm-project/llvm-project/build/tools/clang/test/CIR/CodeGen/Output/global-ptr-init.cpp.tmp-cir.ll /home/gha/actions-runner/_work/llvm-project/llvm-project/clang/test/CIR/CodeGen/global-ptr-init.cpp
# note: command had no output on stdout or stderr
# RUN: at line 4
/home/gha/actions-runner/_work/llvm-project/llvm-project/build/bin/FileCheck -check-prefix=LLVM --input-file=/home/gha/actions-runner/_work/llvm-project/llvm-project/build/tools/clang/test/CIR/CodeGen/Output/global-ptr-init.cpp.tmp-cir.ll /home/gha/actions-runner/_work/llvm-project/llvm-project/clang/test/CIR/CodeGen/global-ptr-init.cpp
# executed command: /home/gha/actions-runner/_work/llvm-project/llvm-project/build/bin/FileCheck -check-prefix=LLVM --input-file=/home/gha/actions-runner/_work/llvm-project/llvm-project/build/tools/clang/test/CIR/CodeGen/Output/global-ptr-init.cpp.tmp-cir.ll /home/gha/actions-runner/_work/llvm-project/llvm-project/clang/test/CIR/CodeGen/global-ptr-init.cpp
# .---command stderr------------
# | /home/gha/actions-runner/_work/llvm-project/llvm-project/clang/test/CIR/CodeGen/global-ptr-init.cpp:15:10: error: LLVM: expected string not found in input
# | // LLVM: @x = global %struct.B { ptr getelementptr inbounds nuw (i8, ptr @_ZTV1B, i64 16) }, align 8
# | ^
# | /home/gha/actions-runner/_work/llvm-project/llvm-project/build/tools/clang/test/CIR/CodeGen/Output/global-ptr-init.cpp.tmp-cir.ll:1:1: note: scanning from here
# | ; ModuleID = '/home/gha/actions-runner/_work/llvm-project/llvm-project/clang/test/CIR/CodeGen/global-ptr-init.cpp'
# | ^
# | /home/gha/actions-runner/_work/llvm-project/llvm-project/build/tools/clang/test/CIR/CodeGen/Output/global-ptr-init.cpp.tmp-cir.ll:24:1: note: possible intended match here
# | @x = global %struct.B { ptr getelementptr (i8, ptr @_ZTV1B, i64 16) }, align 8
# | ^
# |
# | Input file: /home/gha/actions-runner/_work/llvm-project/llvm-project/build/tools/clang/test/CIR/CodeGen/Output/global-ptr-init.cpp.tmp-cir.ll
# | Check file: /home/gha/actions-runner/_work/llvm-project/llvm-project/clang/test/CIR/CodeGen/global-ptr-init.cpp
# |
# | -dump-input=help explains the following input dump.
# |
# | Input was:
# | <<<<<<
# | 1: ; ModuleID = '/home/gha/actions-runner/_work/llvm-project/llvm-project/clang/test/CIR/CodeGen/global-ptr-init.cpp'
# | check:15'0 { search range start (exclusive)
# | check:15'1 error: no match found in search range
# | 2: source_filename = "/home/gha/actions-runner/_work/llvm-project/llvm-project/clang/test/CIR/CodeGen/global-ptr-init.cpp"
# | 3: target datalayout = "e-m:e-p270:32:32-p271:32:32-p272:64:64-i64:64-i128:128-f80:128-n8:16:32:64-S128"
# | 4: target triple = "x86_64-unknown-linux-gnu"
# | 5:
# | 6: %struct.B = type { ptr }
# | .
# | .
# | .
# | 19:
# | 20: $_ZTI1B = comdat any
# | 21:
# | 22: @__dso_handle = external hidden global i8
# | 23: @_ZTV1B = linkonce_odr constant { [5 x ptr] } { [5 x ptr] [ptr null, ptr @_ZTI1B, ptr @_ZN1B1fEv, ptr @_ZN1BD1Ev, ptr @_ZN1BD0Ev] }, comdat, align 8
# | 24: @x = global %struct.B { ptr getelementptr (i8, ptr @_ZTV1B, i64 16) }, align 8
# | check:15'2 ? possible intended match
# | 25: @_ZTVN10__cxxabiv117__class_type_infoE = external global ptr, align 8
# | 26: @_ZTS1B = linkonce_odr constant [3 x i8] c"1B\00", comdat, align 1
# | 27: @_ZTI1B = linkonce_odr constant { ptr, ptr } { ptr getelementptr (i8, ptr @_ZTVN10__cxxabiv117__class_type_infoE, i64 16), ptr @_ZTS1B }, comdat, align 8
# | 28: @llvm.global_ctors = appending global [1 x { i32, ptr, ptr }] [{ i32, ptr, ptr } { i32 65535, ptr @_GLOBAL__sub_I_global_ptr_init.cpp, ptr null }]
# | 29:
# | .
# | .
# | .
# | 94: attributes #2 = { nounwind }
# | 95: attributes #3 = { builtin nounwind }
# | 96:
# | 97: !llvm.module.flags = !{!0}
# | 98:
# | 99: !0 = !{i32 2, !"Debug Info Version", i32 3}
# | check:15'3 } search range end (exclusive)
# | >>>>>>
# `-----------------------------
# error: command failed with exit status: 1
--
```
</details>
<details>
<summary>Clang.CIR/CodeGen/globals.cpp</summary>
```
Exit Code: 1
Command Output (stdout):
--
# RUN: at line 1
/home/gha/actions-runner/_work/llvm-project/llvm-project/build/bin/clang -cc1 -internal-isystem /home/gha/actions-runner/_work/llvm-project/llvm-project/build/lib/clang/24/include -nostdsysteminc -std=c++17 -triple x86_64-unknown-linux-gnu -fclangir -emit-cir /home/gha/actions-runner/_work/llvm-project/llvm-project/clang/test/CIR/CodeGen/globals.cpp -o /home/gha/actions-runner/_work/llvm-project/llvm-project/build/tools/clang/test/CIR/CodeGen/Output/globals.cpp.tmp.cir
# executed command: /home/gha/actions-runner/_work/llvm-project/llvm-project/build/bin/clang -cc1 -internal-isystem /home/gha/actions-runner/_work/llvm-project/llvm-project/build/lib/clang/24/include -nostdsysteminc -std=c++17 -triple x86_64-unknown-linux-gnu -fclangir -emit-cir /home/gha/actions-runner/_work/llvm-project/llvm-project/clang/test/CIR/CodeGen/globals.cpp -o /home/gha/actions-runner/_work/llvm-project/llvm-project/build/tools/clang/test/CIR/CodeGen/Output/globals.cpp.tmp.cir
# note: command had no output on stdout or stderr
# RUN: at line 2
/home/gha/actions-runner/_work/llvm-project/llvm-project/build/bin/FileCheck --input-file=/home/gha/actions-runner/_work/llvm-project/llvm-project/build/tools/clang/test/CIR/CodeGen/Output/globals.cpp.tmp.cir /home/gha/actions-runner/_work/llvm-project/llvm-project/clang/test/CIR/CodeGen/globals.cpp --check-prefix=CIR
# executed command: /home/gha/actions-runner/_work/llvm-project/llvm-project/build/bin/FileCheck --input-file=/home/gha/actions-runner/_work/llvm-project/llvm-project/build/tools/clang/test/CIR/CodeGen/Output/globals.cpp.tmp.cir /home/gha/actions-runner/_work/llvm-project/llvm-project/clang/test/CIR/CodeGen/globals.cpp --check-prefix=CIR
# note: command had no output on stdout or stderr
# RUN: at line 3
/home/gha/actions-runner/_work/llvm-project/llvm-project/build/bin/clang -cc1 -internal-isystem /home/gha/actions-runner/_work/llvm-project/llvm-project/build/lib/clang/24/include -nostdsysteminc -std=c++17 -triple x86_64-unknown-linux-gnu -fclangir -emit-llvm /home/gha/actions-runner/_work/llvm-project/llvm-project/clang/test/CIR/CodeGen/globals.cpp -o /home/gha/actions-runner/_work/llvm-project/llvm-project/build/tools/clang/test/CIR/CodeGen/Output/globals.cpp.tmp-cir.ll
# executed command: /home/gha/actions-runner/_work/llvm-project/llvm-project/build/bin/clang -cc1 -internal-isystem /home/gha/actions-runner/_work/llvm-project/llvm-project/build/lib/clang/24/include -nostdsysteminc -std=c++17 -triple x86_64-unknown-linux-gnu -fclangir -emit-llvm /home/gha/actions-runner/_work/llvm-project/llvm-project/clang/test/CIR/CodeGen/globals.cpp -o /home/gha/actions-runner/_work/llvm-project/llvm-project/build/tools/clang/test/CIR/CodeGen/Output/globals.cpp.tmp-cir.ll
# note: command had no output on stdout or stderr
# RUN: at line 4
/home/gha/actions-runner/_work/llvm-project/llvm-project/build/bin/FileCheck --input-file=/home/gha/actions-runner/_work/llvm-project/llvm-project/build/tools/clang/test/CIR/CodeGen/Output/globals.cpp.tmp-cir.ll /home/gha/actions-runner/_work/llvm-project/llvm-project/clang/test/CIR/CodeGen/globals.cpp --check-prefix=LLVM
# executed command: /home/gha/actions-runner/_work/llvm-project/llvm-project/build/bin/FileCheck --input-file=/home/gha/actions-runner/_work/llvm-project/llvm-project/build/tools/clang/test/CIR/CodeGen/Output/globals.cpp.tmp-cir.ll /home/gha/actions-runner/_work/llvm-project/llvm-project/clang/test/CIR/CodeGen/globals.cpp --check-prefix=LLVM
# .---command stderr------------
# | /home/gha/actions-runner/_work/llvm-project/llvm-project/clang/test/CIR/CodeGen/globals.cpp:35:10: error: LLVM: expected string not found in input
# | // LLVM: @constArrAddr = global ptr getelementptr inbounds nuw (i8, ptr @arr, i64 132), align 8
# | ^
# | /home/gha/actions-runner/_work/llvm-project/llvm-project/build/tools/clang/test/CIR/CodeGen/Output/globals.cpp.tmp-cir.ll:8:42: note: scanning from here
# | @constFnAddr = global ptr @_Z1fv, align 8
# | ^
# | /home/gha/actions-runner/_work/llvm-project/llvm-project/build/tools/clang/test/CIR/CodeGen/Output/globals.cpp.tmp-cir.ll:10:1: note: possible intended match here
# | @constArrAddr = global ptr getelementptr (i8, ptr @arr, i64 132), align 8
# | ^
# |
# | Input file: /home/gha/actions-runner/_work/llvm-project/llvm-project/build/tools/clang/test/CIR/CodeGen/Output/globals.cpp.tmp-cir.ll
# | Check file: /home/gha/actions-runner/_work/llvm-project/llvm-project/clang/test/CIR/CodeGen/globals.cpp
# |
# | -dump-input=help explains the following input dump.
# |
# | Input was:
# | <<<<<<
# | 1: ; ModuleID = '/home/gha/actions-runner/_work/llvm-project/llvm-project/clang/test/CIR/CodeGen/globals.cpp'
# | 2: source_filename = "/home/gha/actions-runner/_work/llvm-project/llvm-project/clang/test/CIR/CodeGen/globals.cpp"
# | 3: target datalayout = "e-m:e-p270:32:32-p271:32:32-p272:64:64-i64:64-i128:128-f80:128-n8:16:32:64-S128"
# | 4: target triple = "x86_64-unknown-linux-gnu"
# | 5:
# | 6: @var = global i32 1, align 4
# | 7: @constAddr = global ptr @var, align 8
# | 8: @constFnAddr = global ptr @_Z1fv, align 8
# | check:35'0 { search range start (exclusive)
# | check:35'1 error: no match found in search range
# | 9: @arr = global [4 x [16 x i32]] zeroinitializer, align 16
# | 10: @constArrAddr = global ptr getelementptr (i8, ptr @arr, i64 132), align 8
# | check:35'2 ? possible intended match
# | 11: @bool_global = global i8 1, align 1
# | 12: @boolArr_global = global [4 x i8] c"\01\00\01\00", align 1
# | 13:
# | 14: declare noundef i32 @_Z1fv() #0
# | 15:
# | 16: attributes #0 = { "target-features"="+cx8,+mmx,+sse,+sse2,+x87" }
# | 17:
# | 18: !llvm.module.flags = !{!0}
# | 19:
# | 20: !0 = !{i32 2, !"Debug Info Version", i32 3}
# | check:35'3 } search range end (exclusive)
# | >>>>>>
# `-----------------------------
# error: command failed with exit status: 1
--
```
</details>
<details>
<summary>Clang.CIR/CodeGen/self-ref-temporaries.cpp</summary>
```
Exit Code: 1
Command Output (stdout):
--
# RUN: at line 1
/home/gha/actions-runner/_work/llvm-project/llvm-project/build/bin/clang -cc1 -internal-isystem /home/gha/actions-runner/_work/llvm-project/llvm-project/build/lib/clang/24/include -nostdsysteminc -triple x86_64-unknown-linux-gnu -fclangir -emit-cir /home/gha/actions-runner/_work/llvm-project/llvm-project/clang/test/CIR/CodeGen/self-ref-temporaries.cpp -o - | /home/gha/actions-runner/_work/llvm-project/llvm-project/build/bin/FileCheck /home/gha/actions-runner/_work/llvm-project/llvm-project/clang/test/CIR/CodeGen/self-ref-temporaries.cpp --check-prefix=CIR
# executed command: /home/gha/actions-runner/_work/llvm-project/llvm-project/build/bin/clang -cc1 -internal-isystem /home/gha/actions-runner/_work/llvm-project/llvm-project/build/lib/clang/24/include -nostdsysteminc -triple x86_64-unknown-linux-gnu -fclangir -emit-cir /home/gha/actions-runner/_work/llvm-project/llvm-project/clang/test/CIR/CodeGen/self-ref-temporaries.cpp -o -
# note: command had no output on stdout or stderr
# executed command: /home/gha/actions-runner/_work/llvm-project/llvm-project/build/bin/FileCheck /home/gha/actions-runner/_work/llvm-project/llvm-project/clang/test/CIR/CodeGen/self-ref-temporaries.cpp --check-prefix=CIR
# note: command had no output on stdout or stderr
# RUN: at line 2
/home/gha/actions-runner/_work/llvm-project/llvm-project/build/bin/clang -cc1 -internal-isystem /home/gha/actions-runner/_work/llvm-project/llvm-project/build/lib/clang/24/include -nostdsysteminc -triple x86_64-unknown-linux-gnu -fclangir -emit-llvm /home/gha/actions-runner/_work/llvm-project/llvm-project/clang/test/CIR/CodeGen/self-ref-temporaries.cpp -o - | /home/gha/actions-runner/_work/llvm-project/llvm-project/build/bin/FileCheck /home/gha/actions-runner/_work/llvm-project/llvm-project/clang/test/CIR/CodeGen/self-ref-temporaries.cpp --check-prefix=LLVM,LLVMCIR
# executed command: /home/gha/actions-runner/_work/llvm-project/llvm-project/build/bin/clang -cc1 -internal-isystem /home/gha/actions-runner/_work/llvm-project/llvm-project/build/lib/clang/24/include -nostdsysteminc -triple x86_64-unknown-linux-gnu -fclangir -emit-llvm /home/gha/actions-runner/_work/llvm-project/llvm-project/clang/test/CIR/CodeGen/self-ref-temporaries.cpp -o -
# note: command had no output on stdout or stderr
# executed command: /home/gha/actions-runner/_work/llvm-project/llvm-project/build/bin/FileCheck /home/gha/actions-runner/_work/llvm-project/llvm-project/clang/test/CIR/CodeGen/self-ref-temporaries.cpp --check-prefix=LLVM,LLVMCIR
# .---command stderr------------
# | /home/gha/actions-runner/_work/llvm-project/llvm-project/clang/test/CIR/CodeGen/self-ref-temporaries.cpp:18:13: error: LLVMCIR: expected string not found in input
# | // LLVMCIR: @_ZGR2sr_ = {{.*}}constant %struct.SelfRef <{ ptr getelementptr inbounds nuw (i8, ptr @_ZGR2sr_, i64 8), [3 x i32] [i32 1, i32 2, i32 3], [4 x i8] zeroinitializer }>, align 8
# | ^
# | <stdin>:10:46: note: scanning from here
# | @normal = constant ptr @_ZGR6normal_, align 8
# | ^
# | <stdin>:11:1: note: possible intended match here
# | @_ZGR2sr_ = internal constant %struct.SelfRef <{ ptr getelementptr (i8, ptr @_ZGR2sr_, i64 8), [3 x i32] [i32 1, i32 2, i32 3], [4 x i8] zeroinitializer }>, align 8
# | ^
# |
# | Input file: <stdin>
# | Check file: /home/gha/actions-runner/_work/llvm-project/llvm-project/clang/test/CIR/CodeGen/self-ref-temporaries.cpp
# |
# | -dump-input=help explains the following input dump.
# |
# | Input was:
# | <<<<<<
# | .
# | .
# | .
# | 5:
# | 6: %struct.SelfRef = type <{ ptr, [3 x i32], [4 x i8] }>
# | 7: %struct.MultiSelfRef = type <{ ptr, ptr, [3 x i32], [4 x i8] }>
# | 8:
# | 9: @_ZGR6normal_ = internal constant i32 42, align 4
# | 10: @normal = constant ptr @_ZGR6normal_, align 8
# | check:18'0 { search range start (exclusive)
# | check:18'1 error: no match found in search range
# | 11: @_ZGR2sr_ = internal constant %struct.SelfRef <{ ptr getelementptr (i8, ptr @_ZGR2sr_, i64 8), [3 x i32] [i32 1, i32 2, i32 3], [4 x i8] zeroinitializer }>, align 8
# | check:18'2 ? possible intended match
# | 12: @sr = constant ptr @_ZGR2sr_, align 8
# | 13: @_ZGR3msr_ = internal constant %struct.MultiSelfRef <{ ptr getelementptr (i8, ptr @_ZGR3msr_, i64 16), ptr getelementptr (i8, ptr @_ZGR3msr_, i64 16), [3 x i32] [i32 1, i32 2, i32 3], [4 x i8] zeroinitializer }>, align 8
# | 14: @msr = constant ptr @_ZGR3msr_, align 8
# | 15:
# | 16: !llvm.module.flags = !{!0}
# | 17:
# | 18: !0 = !{i32 2, !"Debug Info Version", i32 3}
# | check:18'3 } search range end (exclusive)
# | >>>>>>
# `-----------------------------
# error: command failed with exit status: 1
--
```
</details>
<details>
<summary>Clang.CIR/CodeGen/vtt.cpp</summary>
```
Exit Code: 1
Command Output (stdout):
--
# RUN: at line 1
/home/gha/actions-runner/_work/llvm-project/llvm-project/build/bin/clang -cc1 -internal-isystem /home/gha/actions-runner/_work/llvm-project/llvm-project/build/lib/clang/24/include -nostdsysteminc -triple x86_64-unknown-linux-gnu -fno-rtti -fclangir -emit-cir /home/gha/actions-runner/_work/llvm-project/llvm-project/clang/test/CIR/CodeGen/vtt.cpp -o /home/gha/actions-runner/_work/llvm-project/llvm-project/build/tools/clang/test/CIR/CodeGen/Output/vtt.cpp.tmp.cir
# executed command: /home/gha/actions-runner/_work/llvm-project/llvm-project/build/bin/clang -cc1 -internal-isystem /home/gha/actions-runner/_work/llvm-project/llvm-project/build/lib/clang/24/include -nostdsysteminc -triple x86_64-unknown-linux-gnu -fno-rtti -fclangir -emit-cir /home/gha/actions-runner/_work/llvm-project/llvm-project/clang/test/CIR/CodeGen/vtt.cpp -o /home/gha/actions-runner/_work/llvm-project/llvm-project/build/tools/clang/test/CIR/CodeGen/Output/vtt.cpp.tmp.cir
# note: command had no output on stdout or stderr
# RUN: at line 2
/home/gha/actions-runner/_work/llvm-project/llvm-project/build/bin/FileCheck --check-prefixes=CIR-NO-RTTI,CIR-COMMON --input-file=/home/gha/actions-runner/_work/llvm-project/llvm-project/build/tools/clang/test/CIR/CodeGen/Output/vtt.cpp.tmp.cir /home/gha/actions-runner/_work/llvm-project/llvm-project/clang/test/CIR/CodeGen/vtt.cpp
# executed command: /home/gha/actions-runner/_work/llvm-project/llvm-project/build/bin/FileCheck --check-prefixes=CIR-NO-RTTI,CIR-COMMON --input-file=/home/gha/actions-runner/_work/llvm-project/llvm-project/build/tools/clang/test/CIR/CodeGen/Output/vtt.cpp.tmp.cir /home/gha/actions-runner/_work/llvm-project/llvm-project/clang/test/CIR/CodeGen/vtt.cpp
# note: command had no output on stdout or stderr
# RUN: at line 3
/home/gha/actions-runner/_work/llvm-project/llvm-project/build/bin/clang -cc1 -internal-isystem /home/gha/actions-runner/_work/llvm-project/llvm-project/build/lib/clang/24/include -nostdsysteminc -triple x86_64-unknown-linux-gnu -fno-rtti -fclangir -emit-llvm /home/gha/actions-runner/_work/llvm-project/llvm-project/clang/test/CIR/CodeGen/vtt.cpp -o /home/gha/actions-runner/_work/llvm-project/llvm-project/build/tools/clang/test/CIR/CodeGen/Output/vtt.cpp.tmp-cir.ll
# executed command: /home/gha/actions-runner/_work/llvm-project/llvm-project/build/bin/clang -cc1 -internal-isystem /home/gha/actions-runner/_work/llvm-project/llvm-project/build/lib/clang/24/include -nostdsysteminc -triple x86_64-unknown-linux-gnu -fno-rtti -fclangir -emit-llvm /home/gha/actions-runner/_work/llvm-project/llvm-project/clang/test/CIR/CodeGen/vtt.cpp -o /home/gha/actions-runner/_work/llvm-project/llvm-project/build/tools/clang/test/CIR/CodeGen/Output/vtt.cpp.tmp-cir.ll
# note: command had no output on stdout or stderr
# RUN: at line 4
/home/gha/actions-runner/_work/llvm-project/llvm-project/build/bin/FileCheck --check-prefixes=LLVM-NO-RTTI,LLVM-COMMON --input-file=/home/gha/actions-runner/_work/llvm-project/llvm-project/build/tools/clang/test/CIR/CodeGen/Output/vtt.cpp.tmp-cir.ll /home/gha/actions-runner/_work/llvm-project/llvm-project/clang/test/CIR/CodeGen/vtt.cpp
# executed command: /home/gha/actions-runner/_work/llvm-project/llvm-project/build/bin/FileCheck --check-prefixes=LLVM-NO-RTTI,LLVM-COMMON --input-file=/home/gha/actions-runner/_work/llvm-project/llvm-project/build/tools/clang/test/CIR/CodeGen/Output/vtt.cpp.tmp-cir.ll /home/gha/actions-runner/_work/llvm-project/llvm-project/clang/test/CIR/CodeGen/vtt.cpp
# .---command stderr------------
# | /home/gha/actions-runner/_work/llvm-project/llvm-project/clang/test/CIR/CodeGen/vtt.cpp:120:22: error: LLVM-COMMON-SAME: is not on the same line as the previous match
# | // LLVM-COMMON-SAME: ptr getelementptr inbounds nuw (i8, ptr @_ZTV1D, i64 24),
# | ^
# | /home/gha/actions-runner/_work/llvm-project/llvm-project/build/tools/clang/test/CIR/CodeGen/Output/vtt.cpp.tmp-cir.ll:112:8: note: 'next' match was here
# | store ptr getelementptr inbounds nuw (i8, ptr @_ZTV1D, i64 24), ptr %3, align 8
# | ^
# | /home/gha/actions-runner/_work/llvm-project/llvm-project/build/tools/clang/test/CIR/CodeGen/Output/vtt.cpp.tmp-cir.ll:13:31: note: previous match ended here
# | @_ZTT1D = constant [7 x ptr] [ptr getelementptr (i8, ptr @_ZTV1D, i64 24), ptr getelementptr (i8, ptr @_ZTC1D0_1B, i64 24), ptr getelementptr (i8, ptr @_ZTC1D0_1B, i64 56), ptr getelementptr (i8, ptr @_ZTC1D16_1C, i64 24), ptr getelementptr (i8, ptr @_ZTC1D16_1C, i64 56), ptr getelementptr (i8, ptr @_ZTV1D, i64 96), ptr getelementptr (i8, ptr @_ZTV1D, i64 64)], align 8
# | ^
# |
# | Input file: /home/gha/actions-runner/_work/llvm-project/llvm-project/build/tools/clang/test/CIR/CodeGen/Output/vtt.cpp.tmp-cir.ll
# | Check file: /home/gha/actions-runner/_work/llvm-project/llvm-project/clang/test/CIR/CodeGen/vtt.cpp
# |
# | -dump-input=help explains the following input dump.
# |
# | Input was:
# | <<<<<<
# | .
# | .
# | .
# | 8: $_ZN1CC2Ev = comdat any
# | 9:
# | 10: $_ZN1AC2Ev = comdat any
# | 11:
# | 12: @_ZTV1D = constant { [5 x ptr], [4 x ptr], [4 x ptr] } { [5 x ptr] [ptr inttoptr (i64 40 to ptr), ptr null, ptr null, ptr @_ZN1B1wEv, ptr @_ZN1D1yEv], [4 x ptr] [ptr inttoptr (i64 24 to ptr), ptr inttoptr (i64 -16 to ptr), ptr null, ptr @_ZN1C1xEv], [4 x ptr] [ptr null, ptr inttoptr (i64 -40 to ptr), ptr null, ptr @_ZN1A1vEv] }, align 8
# | 13: @_ZTT1D = constant [7 x ptr] [ptr getelementptr (i8, ptr @_ZTV1D, i64 24), ptr getelementptr (i8, ptr @_ZTC1D0_1B, i64 24), ptr getelementptr (i8, ptr @_ZTC1D0_1B, i64 56), ptr getelementptr (i8, ptr @_ZTC1D16_1C, i64 24), ptr getelementptr (i8, ptr @_ZTC1D16_1C, i64 56), ptr getelementptr (i8, ptr @_ZTV1D, i64 96), ptr getelementptr (i8, ptr @_ZTV1D, i64 64)], align 8
# | same:120'0 { search range start (exclusive)
# | 14: @_ZTC1D0_1B = constant { [4 x ptr], [4 x ptr] } { [4 x ptr] [ptr inttoptr (i64 40 to ptr), ptr null, ptr null, ptr @_ZN1B1wEv], [4 x ptr] [ptr null, ptr inttoptr (i64 -40 to ptr), ptr null, ptr @_ZN1A1vEv] }, align 8
# | 15: @_ZTC1D16_1C = constant { [4 x ptr], [4 x ptr] } { [4 x ptr] [ptr inttoptr (i64 24 to ptr), ptr null, ptr null, ptr @_ZN1C1xEv], [4 x ptr] [ptr null, ptr inttoptr (i64 -24 to ptr), ptr null, ptr @_ZN1A1vEv] }, align 8
# | 16: @_ZTV1A = external constant { [3 x ptr] }, align 8
# | 17:
# | 18: ; Function Attrs: noinline
# | .
# | .
# | .
# | 107: %4 = getelementptr i8, ptr %3, i32 40
# | 108: call void @_ZN1AC2Ev(ptr noundef nonnull align 8 dereferenceable(12) %4) #2
# | 109: call void @_ZN1BC2Ev(ptr noundef nonnull align 8 dereferenceable(12) %3, ptr noundef getelementptr inbounds nuw (i8, ptr @_ZTT1D, i64 8)) #2
# | 110: %5 = getelementptr i8, ptr %3, i32 16
# | 111: call void @_ZN1CC2Ev(ptr noundef nonnull align 8 dereferenceable(16) %5, ptr noundef getelementptr inbounds nuw (i8, ptr @_ZTT1D, i64 24)) #2
# | 112: store ptr getelementptr inbounds nuw (i8, ptr @_ZTV1D, i64 24), ptr %3, align 8
# | same:120'1 !~~~~~~~~~~~~~~~~~~~~~~~~~~~~~~~~~~~~~~~~~~~~~~~~~~~~~~~~ error: match on wrong line
# | 113: %6 = getelementptr i8, ptr %3, i32 40
# | 114: store ptr getelementptr inbounds nuw (i8, ptr @_ZTV1D, i64 96), ptr %6, align 8
# | 115: %7 = getelementptr i8, ptr %3, i32 16
# | 116: store ptr getelementptr inbounds nuw (i8, ptr @_ZTV1D, i64 64), ptr %7, align 8
# | 117: ret void
# | .
# | .
# | .
# | 136: attributes #1 = { "target-features"="+cx8,+mmx,+sse,+sse2,+x87" }
# | 137: attributes #2 = { nounwind }
# | 138:
# | 139: !llvm.module.flags = !{!0}
# | 140:
# | 141: !0 = !{i32 2, !"Debug Info Version", i32 3}
# | same:120'2 } search range end (exclusive)
# | >>>>>>
# `-----------------------------
# error: command failed with exit status: 1
--
```
</details>
<details>
<summary>Clang.CIR/CodeGenCXX/base-layout.cpp</summary>
```
Exit Code: 1
Command Output (stdout):
--
# RUN: at line 1
/home/gha/actions-runner/_work/llvm-project/llvm-project/build/bin/clang -cc1 -internal-isystem /home/gha/actions-runner/_work/llvm-project/llvm-project/build/lib/clang/24/include -nostdsysteminc -std=c++20 -triple x86_64-unknown-linux-gnu -fclangir -emit-cir /home/gha/actions-runner/_work/llvm-project/llvm-project/clang/test/CIR/CodeGenCXX/base-layout.cpp -o /home/gha/actions-runner/_work/llvm-project/llvm-project/build/tools/clang/test/CIR/CodeGenCXX/Output/base-layout.cpp.tmp.cir
# executed command: /home/gha/actions-runner/_work/llvm-project/llvm-project/build/bin/clang -cc1 -internal-isystem /home/gha/actions-runner/_work/llvm-project/llvm-project/build/lib/clang/24/include -nostdsysteminc -std=c++20 -triple x86_64-unknown-linux-gnu -fclangir -emit-cir /home/gha/actions-runner/_work/llvm-project/llvm-project/clang/test/CIR/CodeGenCXX/base-layout.cpp -o /home/gha/actions-runner/_work/llvm-project/llvm-project/build/tools/clang/test/CIR/CodeGenCXX/Output/base-layout.cpp.tmp.cir
# note: command had no output on stdout or stderr
# RUN: at line 2
/home/gha/actions-runner/_work/llvm-project/llvm-project/build/bin/FileCheck --input-file=/home/gha/actions-runner/_work/llvm-project/llvm-project/build/tools/clang/test/CIR/CodeGenCXX/Output/base-layout.cpp.tmp.cir /home/gha/actions-runner/_work/llvm-project/llvm-project/clang/test/CIR/CodeGenCXX/base-layout.cpp -check-prefix=CIR
# executed command: /home/gha/actions-runner/_work/llvm-project/llvm-project/build/bin/FileCheck --input-file=/home/gha/actions-runner/_work/llvm-project/llvm-project/build/tools/clang/test/CIR/CodeGenCXX/Output/base-layout.cpp.tmp.cir /home/gha/actions-runner/_work/llvm-project/llvm-project/clang/test/CIR/CodeGenCXX/base-layout.cpp -check-prefix=CIR
# note: command had no output on stdout or stderr
# RUN: at line 3
/home/gha/actions-runner/_work/llvm-project/llvm-project/build/bin/clang -cc1 -internal-isystem /home/gha/actions-runner/_work/llvm-project/llvm-project/build/lib/clang/24/include -nostdsysteminc -std=c++20 -triple x86_64-unknown-linux-gnu -fclangir -emit-llvm /home/gha/actions-runner/_work/llvm-project/llvm-project/clang/test/CIR/CodeGenCXX/base-layout.cpp -o /home/gha/actions-runner/_work/llvm-project/llvm-project/build/tools/clang/test/CIR/CodeGenCXX/Output/base-layout.cpp.tmp-cir.ll
# executed command: /home/gha/actions-runner/_work/llvm-project/llvm-project/build/bin/clang -cc1 -internal-isystem /home/gha/actions-runner/_work/llvm-project/llvm-project/build/lib/clang/24/include -nostdsysteminc -std=c++20 -triple x86_64-unknown-linux-gnu -fclangir -emit-llvm /home/gha/actions-runner/_work/llvm-project/llvm-project/clang/test/CIR/CodeGenCXX/base-layout.cpp -o /home/gha/actions-runner/_work/llvm-project/llvm-project/build/tools/clang/test/CIR/CodeGenCXX/Output/base-layout.cpp.tmp-cir.ll
# note: command had no output on stdout or stderr
# RUN: at line 4
/home/gha/actions-runner/_work/llvm-project/llvm-project/build/bin/FileCheck --input-file=/home/gha/actions-runner/_work/llvm-project/llvm-project/build/tools/clang/test/CIR/CodeGenCXX/Output/base-layout.cpp.tmp-cir.ll /home/gha/actions-runner/_work/llvm-project/llvm-project/clang/test/CIR/CodeGenCXX/base-layout.cpp -check-prefix=LLVM
# executed command: /home/gha/actions-runner/_work/llvm-project/llvm-project/build/bin/FileCheck --input-file=/home/gha/actions-runner/_work/llvm-project/llvm-project/build/tools/clang/test/CIR/CodeGenCXX/Output/base-layout.cpp.tmp-cir.ll /home/gha/actions-runner/_work/llvm-project/llvm-project/clang/test/CIR/CodeGenCXX/base-layout.cpp -check-prefix=LLVM
# .---command stderr------------
# | /home/gha/actions-runner/_work/llvm-project/llvm-project/clang/test/CIR/CodeGenCXX/base-layout.cpp:18:10: error: LLVM: expected string not found in input
# | // LLVM: @d = global %struct.D { %struct.V3 { ptr getelementptr inbounds nuw (i8, ptr @_ZTV1D, i64 16) }, %struct.B { %struct.V1 { ptr getelementptr inbounds nuw (i8, ptr @_ZTV1D, i64 40) }, %struct.V2 { ptr getelementptr inbounds nuw (i8, ptr @_ZTV1D, i64 64) } } }
# | ^
# | /home/gha/actions-runner/_work/llvm-project/llvm-project/build/tools/clang/test/CIR/CodeGenCXX/Output/base-layout.cpp.tmp-cir.ll:1:1: note: scanning from here
# | ; ModuleID = '/home/gha/actions-runner/_work/llvm-project/llvm-project/clang/test/CIR/CodeGenCXX/base-layout.cpp'
# | ^
# | /home/gha/actions-runner/_work/llvm-project/llvm-project/build/tools/clang/test/CIR/CodeGenCXX/Output/base-layout.cpp.tmp-cir.ll:25:1: note: possible intended match here
# | @d = global %struct.D { %struct.V3 { ptr getelementptr (i8, ptr @_ZTV1D, i64 16) }, %struct.B { %struct.V1 { ptr getelementptr (i8, ptr @_ZTV1D, i64 40) }, %struct.V2 { ptr getelementptr (i8, ptr @_ZTV1D, i64 64) } } }, align 8
# | ^
# |
# | Input file: /home/gha/actions-runner/_work/llvm-project/llvm-project/build/tools/clang/test/CIR/CodeGenCXX/Output/base-layout.cpp.tmp-cir.ll
# | Check file: /home/gha/actions-runner/_work/llvm-project/llvm-project/clang/test/CIR/CodeGenCXX/base-layout.cpp
# |
# | -dump-input=help explains the following input dump.
# |
# | Input was:
# | <<<<<<
# | 1: ; ModuleID = '/home/gha/actions-runner/_work/llvm-project/llvm-project/clang/test/CIR/CodeGenCXX/base-layout.cpp'
# | check:18'0 { search range start (exclusive)
# | check:18'1 error: no match found in search range
# | 2: source_filename = "/home/gha/actions-runner/_work/llvm-project/llvm-project/clang/test/CIR/CodeGenCXX/base-layout.cpp"
# | 3: target datalayout = "e-m:e-p270:32:32-p271:32:32-p272:64:64-i64:64-i128:128-f80:128-n8:16:32:64-S128"
# | 4: target triple = "x86_64-unknown-linux-gnu"
# | 5:
# | 6: %struct.D = type { %struct.V3, %struct.B }
# | .
# | .
# | .
# | 20: $_ZTI1B = comdat any
# | 21:
# | 22: $_ZTI1D = comdat any
# | 23:
# | 24: @_ZTV1D = linkonce_odr constant { [3 x ptr], [3 x ptr], [3 x ptr] } { [3 x ptr] [ptr null, ptr @_ZTI1D, ptr @_ZN2V32v3Ev], [3 x ptr] [ptr inttoptr (i64 -8 to ptr), ptr @_ZTI1D, ptr @_ZN2V12v1Ev], [3 x ptr] [ptr inttoptr (i64 -16 to ptr), ptr @_ZTI1D, ptr @_ZN2V22v2Ev] }, comdat, align 8
# | 25: @d = global %struct.D { %struct.V3 { ptr getelementptr (i8, ptr @_ZTV1D, i64 16) }, %struct.B { %struct.V1 { ptr getelementptr (i8, ptr @_ZTV1D, i64 40) }, %struct.V2 { ptr getelementptr (i8, ptr @_ZTV1D, i64 64) } } }, align 8
# | check:18'2 ? possible intended match
# | 26: @gd = global %struct.Derived { %struct.Base.base <{ i32 1, i8 2 }>, i8 3, [2 x i8] zeroinitializer }, align 4
# | 27: @_ZTVN10__cxxabiv121__vmi_class_type_infoE = external global ptr, align 8
# | 28: @_ZTS1D = linkonce_odr constant [3 x i8] c"1D\00", comdat, align 1
# | 29: @_ZTI2V3 = external constant ptr
# | 30: @_ZTS1B = linkonce_odr constant [3 x i8] c"1B\00", comdat, align 1
# | .
# | .
# | .
# | 41:
# | 42: attributes #0 = { "target-features"="+cx8,+mmx,+sse,+sse2,+x87" }
# | 43:
# | 44: !llvm.module.flags = !{!0}
# | 45:
# | 46: !0 = !{i32 2, !"Debug Info Version", i32 3}
# | check:18'3 } search range end (exclusive)
# | >>>>>>
# `-----------------------------
# error: command failed with exit status: 1
--
```
</details>
<details>
<summary>Clang.CIR/CodeGenCXX/vtable-linkage.cpp</summary>
```
Exit Code: 1
Command Output (stdout):
--
# RUN: at line 1
/home/gha/actions-runner/_work/llvm-project/llvm-project/build/bin/clang -cc1 -internal-isystem /home/gha/actions-runner/_work/llvm-project/llvm-project/build/lib/clang/24/include -nostdsysteminc -triple x86_64-pc-linux -fclangir -emit-cir -mmlir --mlir-print-ir-before=cir-lowering-prepare /home/gha/actions-runner/_work/llvm-project/llvm-project/clang/test/CIR/CodeGenCXX/vtable-linkage.cpp -o /home/gha/actions-runner/_work/llvm-project/llvm-project/build/tools/clang/test/CIR/CodeGenCXX/Output/vtable-linkage.cpp.tmp.cir 2> /home/gha/actions-runner/_work/llvm-project/llvm-project/build/tools/clang/test/CIR/CodeGenCXX/Output/vtable-linkage.cpp.tmp-before.cir
# executed command: /home/gha/actions-runner/_work/llvm-project/llvm-project/build/bin/clang -cc1 -internal-isystem /home/gha/actions-runner/_work/llvm-project/llvm-project/build/lib/clang/24/include -nostdsysteminc -triple x86_64-pc-linux -fclangir -emit-cir -mmlir --mlir-print-ir-before=cir-lowering-prepare /home/gha/actions-runner/_work/llvm-project/llvm-project/clang/test/CIR/CodeGenCXX/vtable-linkage.cpp -o /home/gha/actions-runner/_work/llvm-project/llvm-project/build/tools/clang/test/CIR/CodeGenCXX/Output/vtable-linkage.cpp.tmp.cir
# note: command had no output on stdout or stderr
# RUN: at line 2
/home/gha/actions-runner/_work/llvm-project/llvm-project/build/bin/FileCheck /home/gha/actions-runner/_work/llvm-project/llvm-project/clang/test/CIR/CodeGenCXX/vtable-linkage.cpp --input-file=/home/gha/actions-runner/_work/llvm-project/llvm-project/build/tools/clang/test/CIR/CodeGenCXX/Output/vtable-linkage.cpp.tmp-before.cir --check-prefixes=CIR
# executed command: /home/gha/actions-runner/_work/llvm-project/llvm-project/build/bin/FileCheck /home/gha/actions-runner/_work/llvm-project/llvm-project/clang/test/CIR/CodeGenCXX/vtable-linkage.cpp --input-file=/home/gha/actions-runner/_work/llvm-project/llvm-project/build/tools/clang/test/CIR/CodeGenCXX/Output/vtable-linkage.cpp.tmp-before.cir --check-prefixes=CIR
# note: command had no output on stdout or stderr
# RUN: at line 3
/home/gha/actions-runner/_work/llvm-project/llvm-project/build/bin/FileCheck /home/gha/actions-runner/_work/llvm-project/llvm-project/clang/test/CIR/CodeGenCXX/vtable-linkage.cpp --input-file=/home/gha/actions-runner/_work/llvm-project/llvm-project/build/tools/clang/test/CIR/CodeGenCXX/Output/vtable-linkage.cpp.tmp.cir --check-prefixes=CIR
# executed command: /home/gha/actions-runner/_work/llvm-project/llvm-project/build/bin/FileCheck /home/gha/actions-runner/_work/llvm-project/llvm-project/clang/test/CIR/CodeGenCXX/vtable-linkage.cpp --input-file=/home/gha/actions-runner/_work/llvm-project/llvm-project/build/tools/clang/test/CIR/CodeGenCXX/Output/vtable-linkage.cpp.tmp.cir --check-prefixes=CIR
# note: command had no output on stdout or stderr
# RUN: at line 4
/home/gha/actions-runner/_work/llvm-project/llvm-project/build/bin/clang -cc1 -internal-isystem /home/gha/actions-runner/_work/llvm-project/llvm-project/build/lib/clang/24/include -nostdsysteminc /home/gha/actions-runner/_work/llvm-project/llvm-project/clang/test/CIR/CodeGenCXX/vtable-linkage.cpp -triple=x86_64-pc-linux -fclangir -emit-llvm -o /home/gha/actions-runner/_work/llvm-project/llvm-project/build/tools/clang/test/CIR/CodeGenCXX/Output/vtable-linkage.cpp.tmp-cir.ll
# executed command: /home/gha/actions-runner/_work/llvm-project/llvm-project/build/bin/clang -cc1 -internal-isystem /home/gha/actions-runner/_work/llvm-project/llvm-project/build/lib/clang/24/include -nostdsysteminc /home/gha/actions-runner/_work/llvm-project/llvm-project/clang/test/CIR/CodeGenCXX/vtable-linkage.cpp -triple=x86_64-pc-linux -fclangir -emit-llvm -o /home/gha/actions-runner/_work/llvm-project/llvm-project/build/tools/clang/test/CIR/CodeGenCXX/Output/vtable-linkage.cpp.tmp-cir.ll
# note: command had no output on stdout or stderr
# RUN: at line 5
/home/gha/actions-runner/_work/llvm-project/llvm-project/build/bin/FileCheck /home/gha/actions-runner/_work/llvm-project/llvm-project/clang/test/CIR/CodeGenCXX/vtable-linkage.cpp --input-file=/home/gha/actions-runner/_work/llvm-project/llvm-project/build/tools/clang/test/CIR/CodeGenCXX/Output/vtable-linkage.cpp.tmp-cir.ll --check-prefixes=LLVM
# executed command: /home/gha/actions-runner/_work/llvm-project/llvm-project/build/bin/FileCheck /home/gha/actions-runner/_work/llvm-project/llvm-project/clang/test/CIR/CodeGenCXX/vtable-linkage.cpp --input-file=/home/gha/actions-runner/_work/llvm-project/llvm-project/build/tools/clang/test/CIR/CodeGenCXX/Output/vtable-linkage.cpp.tmp-cir.ll --check-prefixes=LLVM
# .---command stderr------------
# | /home/gha/actions-runner/_work/llvm-project/llvm-project/clang/test/CIR/CodeGenCXX/vtable-linkage.cpp:124:14: error: LLVM-DAG: expected string not found in input
# | // LLVM-DAG: @_ZTT1C = linkonce_odr{{.*}} constant [2 x ptr] [ptr getelementptr inbounds{{.*}}({{.*}}, ptr @_ZTV1C, {{.*}}, ptr getelementptr inbounds {{.*}}({{.*}}, ptr @_ZTV1C{{.*}})]
# | ^
# | /home/gha/actions-runner/_work/llvm-project/llvm-project/build/tools/clang/test/CIR/CodeGenCXX/Output/vtable-linkage.cpp.tmp-cir.ll:1:1: note: scanning from here
# | ; ModuleID = '/home/gha/actions-runner/_work/llvm-project/llvm-project/clang/test/CIR/CodeGenCXX/vtable-linkage.cpp'
# | ^
# |
# | Input file: /home/gha/actions-runner/_work/llvm-project/llvm-project/build/tools/clang/test/CIR/CodeGenCXX/Output/vtable-linkage.cpp.tmp-cir.ll
# | Check file: /home/gha/actions-runner/_work/llvm-project/llvm-project/clang/test/CIR/CodeGenCXX/vtable-linkage.cpp
# |
# | -dump-input=help explains the following input dump.
# |
# | Input was:
# | <<<<<<
# | 1: ; ModuleID = '/home/gha/actions-runner/_work/llvm-project/llvm-project/clang/test/CIR/CodeGenCXX/vtable-linkage.cpp'
# | dag:124'0 { search range start (exclusive)
# | dag:124'1 error: no match found in search range
# | 2: source_filename = "/home/gha/actions-runner/_work/llvm-project/llvm-project/clang/test/CIR/CodeGenCXX/vtable-linkage.cpp"
# | 3: target datalayout = "e-m:e-p270:32:32-p271:32:32-p272:64:64-i64:64-i128:128-f80:128-n8:16:32:64-S128"
# | 4: target triple = "x86_64-pc-linux"
# | 5:
# | 6: %struct.anon.0 = type { %struct.D }
# | .
# | .
# | .
# | 692: attributes #5 = { builtin nounwind }
# | 693: attributes #6 = { builtin allocsize(0) }
# | 694:
# | 695: !llvm.module.flags = !{!0}
# | 696:
# | 697: !0 = !{i32 2, !"Debug Info Version", i32 3}
# | dag:124'2 } search range end (exclusive)
# | >>>>>>
# `-----------------------------
# error: command failed with exit status: 1
--
```
</details>
If these failures are unrelated to your changes (for example tests are broken or flaky at HEAD), please open an issue at https://github.com/llvm/llvm-project/issues and add the `infrastructure` label.
https://github.com/llvm/llvm-project/pull/227504
More information about the llvm-commits
mailing list