[llvm] ARM: Use divmod type signatures from RuntimeLibcallsInfo (PR #217869)
LLVM Continuous Integration via llvm-commits
llvm-commits at lists.llvm.org
Fri Sep 25 06:22:37 PDT 2026
llvm-ci wrote:
LLVM Buildbot has detected a new failure on builder `sanitizer-x86_64-linux-qemu` running on `sanitizer-buildbot4` while building `llvm` at step 2 "annotate".
Full details are available at: https://lab.llvm.org/buildbot/#/builders/139/builds/38348
<details>
<summary>Here is the relevant piece of the build log for the reference</summary>
```
Step 2 (annotate) failure: 'python ../sanitizer_buildbot/sanitizers/zorg/buildbot/builders/sanitizers/buildbot_selector.py' (failure)
...
is not able to compile a simple test program.
It fails with the following output:
Change Dir: '/home/b/sanitizer-x86_64-linux-qemu/build/llvm_build2_mips_qemu/CMakeFiles/CMakeScratch/TryCompile-FJIiEH'
Run Build Command(s): /usr/bin/ninja -v cmTC_b6379
[1/2] /home/b/sanitizer-x86_64-linux-qemu/build/llvm_build2_host/bin/clang --target=mips-linux-gnu -fPIC -Wl,-z,execstack -MD -MT CMakeFiles/cmTC_b6379.dir/testCCompiler.c.o -MF CMakeFiles/cmTC_b6379.dir/testCCompiler.c.o.d -o CMakeFiles/cmTC_b6379.dir/testCCompiler.c.o -c /home/b/sanitizer-x86_64-linux-qemu/build/llvm_build2_mips_qemu/CMakeFiles/CMakeScratch/TryCompile-FJIiEH/testCCompiler.c
clang: warning: -Wl,-z,execstack: 'linker' input unused [-Wunused-command-line-argument]
[2/2] : && /home/b/sanitizer-x86_64-linux-qemu/build/llvm_build2_host/bin/clang --target=mips-linux-gnu -fPIC -Wl,-z,execstack -fuse-ld=lld -Wl,-z,execstack CMakeFiles/cmTC_b6379.dir/testCCompiler.c.o -o cmTC_b6379 && :
FAILED: [code=1] cmTC_b6379
: && /home/b/sanitizer-x86_64-linux-qemu/build/llvm_build2_host/bin/clang --target=mips-linux-gnu -fPIC -Wl,-z,execstack -fuse-ld=lld -Wl,-z,execstack CMakeFiles/cmTC_b6379.dir/testCCompiler.c.o -o cmTC_b6379 && :
ld.lld: error: cannot open Scrt1.o: No such file or directory
ld.lld: error: cannot open crti.o: No such file or directory
ld.lld: error: cannot open crtbeginS.o: No such file or directory
ld.lld: error: unable to find library -lgcc
ld.lld: error: unable to find library -lgcc_s
ld.lld: error: unable to find library -lc
ld.lld: error: unable to find library -lgcc
ld.lld: error: unable to find library -lgcc_s
ld.lld: error: cannot open crtendS.o: No such file or directory
ld.lld: error: cannot open crtn.o: No such file or directory
clang: error: linker command failed with exit code 1 (use -v to see invocation)
ninja: build stopped: subcommand failed.
CMake will not be able to correctly generate this project.
Call Stack (most recent call first):
CMakeLists.txt:30 (project)
-- Configuring incomplete, errors occurred!
+ ninja install-scudo_standalone
ninja: error: loading 'build.ninja': No such file or directory
+ ninja check-scudo_standalone
ninja: error: loading 'build.ninja': No such file or directory
+ exit 3
+ [[ mips_qemu =~ mips.* ]]
+ build_warning
+ for _ in 0 1 2
+ echo
+ echo @@@STEP_WARNINGS@@@
+ [[ -v BUILDBOT_BUILDERNAME ]]
+ sleep 5
@@@STEP_WARNINGS@@@
Step 22 (scudo debug_aarch64_qemu) failure: scudo debug_aarch64_qemu (failure)
...
[74/80] Generating ScudoUnitTestsObjects.wrappers_c_test.cpp.aarch64.o
[75/80] Generating ScudoUnitTestsObjects.gtest-all.cc.aarch64.o
[76/80] Generating ScudoCUnitTest-aarch64-Test
[77/80] Generating ScudoCxxUnitTest-aarch64-Test
[78/80] Generating ScudoUnitTestsObjects.combined_test.cpp.aarch64.o
[79/80] Generating ScudoUnitTest-aarch64-Test
[79/80] Running Scudo Standalone tests
-- Testing: 248 tests, 64 workers --
Testing: 0.. 10.. 20.. 30.. 40.. 50.. 60.. 70.. 80.. 90..
TIMEOUT: ScudoStandalone-Unit-GwpAsanTorture :: ./ScudoUnitTest-aarch64-Test/54/97 (248 of 248)
******************** TEST 'ScudoStandalone-Unit-GwpAsanTorture :: ./ScudoUnitTest-aarch64-Test/54/97' FAILED ********************
Script(shard):
--
GTEST_OUTPUT=json:/home/b/sanitizer-x86_64-linux-qemu/build/llvm_build2_debug_aarch64_qemu/lib/scudo/standalone/tests/./ScudoUnitTest-aarch64-Test-ScudoStandalone-Unit-GwpAsanTorture-3862826-54-97.json GTEST_SHUFFLE=0 GTEST_TOTAL_SHARDS=97 GTEST_SHARD_INDEX=54 /home/b/sanitizer-x86_64-linux-qemu/build/qemu_build/qemu-aarch64 -L /usr/aarch64-linux-gnu /home/b/sanitizer-x86_64-linux-qemu/build/llvm_build2_debug_aarch64_qemu/lib/scudo/standalone/tests/./ScudoUnitTest-aarch64-Test
--
Note: This is test shard 55 of 97.
[==========] Running 4 tests from 4 test suites.
[----------] Global test environment set-up.
[----------] 1 test from ScudoCombinedDeathTestBasicCombined4_TestConditionVariableConfig
[ RUN ] ScudoCombinedDeathTestBasicCombined4_TestConditionVariableConfig.BasicCombined4
[ OK ] ScudoCombinedDeathTestBasicCombined4_TestConditionVariableConfig.BasicCombined4 (12724 ms)
[----------] 1 test from ScudoCombinedDeathTestBasicCombined4_TestConditionVariableConfig (12727 ms total)
[----------] 1 test from ScudoCombinedDeathTestReallocateDecreasingTagged_TestNoCacheConfig
[ RUN ] ScudoCombinedDeathTestReallocateDecreasingTagged_TestNoCacheConfig.ReallocateDecreasingTagged
[ OK ] ScudoCombinedDeathTestReallocateDecreasingTagged_TestNoCacheConfig.ReallocateDecreasingTagged (680 ms)
[----------] 1 test from ScudoCombinedDeathTestReallocateDecreasingTagged_TestNoCacheConfig (680 ms total)
[----------] 1 test from ScudoCombinedTestAllocAfterFork_TestConditionVariableConfig
[ RUN ] ScudoCombinedTestAllocAfterFork_TestConditionVariableConfig.AllocAfterFork
--
exit: -9
--
Reached timeout of 900 seconds
********************
Testing: 0.. 10.. 20.. 30.. 40.. 50.. 60.. 70.. 80.. 90..
Slowest Tests (20 of 827):
--------------------------------------------------------------------------
900.01s: ScudoStandalone-Unit-GwpAsanTorture :: ./ScudoUnitTest-aarch64-Test/54/97
140.81s: ScudoStandalone-Unit-GwpAsanTorture :: ./ScudoUnitTest-aarch64-Test/ScudoCombinedTestDisableMemInit_AndroidConfig/DisableMemInit
136.51s: ScudoStandalone-Unit :: ./ScudoUnitTest-aarch64-Test/ScudoCombinedTestDisableMemInit_TestNoCacheConfig/DisableMemInit
132.59s: ScudoStandalone-Unit :: ./ScudoUnitTest-aarch64-Test/ScudoCombinedTestDisableMemInit_AndroidConfig/DisableMemInit
125.70s: ScudoStandalone-Unit-GwpAsanTorture :: ./ScudoUnitTest-aarch64-Test/ScudoCombinedTestDisableMemInit_TestNoCacheConfig/DisableMemInit
104.50s: ScudoStandalone-Unit-GwpAsanTorture :: ./ScudoUnitTest-aarch64-Test/ScudoCombinedTestDisableMemInit_DefaultConfig/DisableMemInit
94.48s: ScudoStandalone-Unit :: ./ScudoUnitTest-aarch64-Test/ScudoCombinedTestDisableMemInit_DefaultConfig/DisableMemInit
83.43s: ScudoStandalone-Unit-GwpAsanTorture :: ./ScudoUnitTest-aarch64-Test/ScudoCombinedTestDisableMemInit_TestConditionVariableConfig/DisableMemInit
83.03s: ScudoStandalone-Unit :: ./ScudoUnitTest-aarch64-Test/ScudoCombinedTestDisableMemInit_TestConditionVariableConfig/DisableMemInit
```
</details>
https://github.com/llvm/llvm-project/pull/217869
More information about the llvm-commits
mailing list