[llvm] Analysis: Move LibcallLoweringInfo from CodeGen to Analysis (PR #210322)

LLVM Continuous Integration via llvm-commits llvm-commits at lists.llvm.org
Wed Aug 19 19:56:27 PDT 2026


llvm-ci wrote:

LLVM Buildbot has detected a new failure on builder `llvm-nvptx64-nvidia-ubuntu` running on `as-builder-7` while building `llvm` at step 6 "test-build-unified-tree-check-llvm".

Full details are available at: https://lab.llvm.org/buildbot/#/builders/160/builds/43913

<details>
<summary>Here is the relevant piece of the build log for the reference</summary>

```
Step 6 (test-build-unified-tree-check-llvm) failure: test (failure)
...
14.009 [3/11/813] Linking CXX executable unittests/MIR/MIRTests
14.264 [3/10/814] Building CXX object unittests/CodeGen/GlobalISel/CMakeFiles/GlobalISelTests.dir/LegalizerInfoTest.cpp.o
14.528 [3/9/815] Building CXX object unittests/CodeGen/CMakeFiles/CodeGenTests.dir/LexicalScopesTest.cpp.o
14.762 [3/8/816] Building CXX object unittests/CodeGen/GlobalISel/CMakeFiles/GlobalISelTests.dir/KnownFPClassTest.cpp.o
14.763 [3/7/817] Building CXX object unittests/CodeGen/GlobalISel/CMakeFiles/GlobalISelTests.dir/PatternMatchTest.cpp.o
15.117 [3/6/818] Building CXX object unittests/CodeGen/GlobalISel/CMakeFiles/GlobalISelTests.dir/KnownBitsTest.cpp.o
15.162 [3/5/819] Building CXX object unittests/CodeGen/CMakeFiles/CodeGenTests.dir/MachineInstrTest.cpp.o
15.321 [3/4/820] Building CXX object unittests/CodeGen/GlobalISel/CMakeFiles/GlobalISelTests.dir/CSETest.cpp.o
19.975 [3/3/821] Building CXX object unittests/CodeGen/GlobalISel/CMakeFiles/GlobalISelTests.dir/LegalizerHelperTest.cpp.o
20.180 [2/3/822] Linking CXX executable unittests/CodeGen/GlobalISel/GlobalISelTests
FAILED: unittests/CodeGen/GlobalISel/GlobalISelTests 
: && /usr/bin/c++ -fPIC -fno-semantic-interposition -fvisibility-inlines-hidden -Werror=date-time -Wall -Wextra -Wno-unused-parameter -Wwrite-strings -Wcast-qual -Wno-missing-field-initializers -pedantic -Wno-long-long -Wimplicit-fallthrough -Wno-uninitialized -Wno-nonnull -Wno-class-memaccess -Wno-dangling-reference -Wno-redundant-move -Wno-pessimizing-move -Wno-array-bounds -Wno-stringop-overread -Wno-dangling-pointer -Wno-noexcept-type -Wdelete-non-virtual-dtor -Wsuggest-override -Wno-comment -Wno-misleading-indentation -Wctad-maybe-unsupported -fdiagnostics-color -ffunction-sections -fdata-sections -O3 -DNDEBUG -fuse-ld=gold     -Wl,--gc-sections  -Wl,--dependency-file=unittests/CodeGen/GlobalISel/CMakeFiles/GlobalISelTests.dir/link.d unittests/CodeGen/GlobalISel/CMakeFiles/GlobalISelTests.dir/IRTranslatorBF16Test.cpp.o unittests/CodeGen/GlobalISel/CMakeFiles/GlobalISelTests.dir/ConstantFoldingTest.cpp.o unittests/CodeGen/GlobalISel/CMakeFiles/GlobalISelTests.dir/CSETest.cpp.o unittests/CodeGen/GlobalISel/CMakeFiles/GlobalISelTests.dir/GIMatchTableExecutorTest.cpp.o unittests/CodeGen/GlobalISel/CMakeFiles/GlobalISelTests.dir/LegalizerTest.cpp.o unittests/CodeGen/GlobalISel/CMakeFiles/GlobalISelTests.dir/LegalizerHelperTest.cpp.o unittests/CodeGen/GlobalISel/CMakeFiles/GlobalISelTests.dir/LegalizerInfoTest.cpp.o unittests/CodeGen/GlobalISel/CMakeFiles/GlobalISelTests.dir/MachineIRBuilderTest.cpp.o unittests/CodeGen/GlobalISel/CMakeFiles/GlobalISelTests.dir/GISelMITest.cpp.o unittests/CodeGen/GlobalISel/CMakeFiles/GlobalISelTests.dir/PatternMatchTest.cpp.o unittests/CodeGen/GlobalISel/CMakeFiles/GlobalISelTests.dir/KnownBitsTest.cpp.o unittests/CodeGen/GlobalISel/CMakeFiles/GlobalISelTests.dir/KnownFPClassTest.cpp.o unittests/CodeGen/GlobalISel/CMakeFiles/GlobalISelTests.dir/KnownBitsVectorTest.cpp.o unittests/CodeGen/GlobalISel/CMakeFiles/GlobalISelTests.dir/GISelUtilsTest.cpp.o unittests/CodeGen/GlobalISel/CMakeFiles/GlobalISelTests.dir/GISelAliasTest.cpp.o unittests/CodeGen/GlobalISel/CMakeFiles/GlobalISelTests.dir/CallLowering.cpp.o unittests/CodeGen/GlobalISel/CMakeFiles/GlobalISelTests.dir/InstructionSelectTest.cpp.o -o unittests/CodeGen/GlobalISel/GlobalISelTests  -Wl,-rpath,/home/buildbot/worker/as-builder-7/llvm-nvptx64-nvidia-ubuntu/build/lib  lib/libLLVMX86CodeGen.so.24.0git  lib/libLLVMX86AsmParser.so.24.0git  lib/libLLVMX86Desc.so.24.0git  lib/libLLVMX86Disassembler.so.24.0git  lib/libLLVMX86Info.so.24.0git  lib/libLLVMNVPTXCodeGen.so.24.0git  lib/libLLVMNVPTXDesc.so.24.0git  lib/libLLVMNVPTXInfo.so.24.0git  lib/libLLVMFileCheck.so.24.0git  lib/libLLVMGlobalISel.so.24.0git  lib/libLLVMMIRParser.so.24.0git  lib/libllvm_gtest_main.so.24.0git  lib/libllvm_gtest.so.24.0git  lib/libLLVMCodeGen.so.24.0git  lib/libLLVMCodeGenTypes.so.24.0git  lib/libLLVMTarget.so.24.0git  lib/libLLVMMC.so.24.0git  lib/libLLVMAsmParser.so.24.0git  lib/libLLVMCore.so.24.0git  lib/libLLVMTargetParser.so.24.0git  lib/libLLVMSupport.so.24.0git  -Wl,-rpath-link,/home/buildbot/worker/as-builder-7/llvm-nvptx64-nvidia-ubuntu/build/lib && :
unittests/CodeGen/GlobalISel/CMakeFiles/GlobalISelTests.dir/ConstantFoldingTest.cpp.o:ConstantFoldingTest.cpp:function GISelMITest::setUp(llvm::StringRef):(.text._ZN11GISelMITest5setUpEN4llvm9StringRefE+0x773): error: undefined reference to 'llvm::LibcallLoweringInfo::LibcallLoweringInfo(llvm::RTLIB::RuntimeLibcallsInfo const&, llvm::function_ref<void (llvm::LibcallLoweringInfo&)>)'
collect2: error: ld returned 1 exit status
20.744 [2/2/823] Building CXX object unittests/CodeGen/CMakeFiles/CodeGenTests.dir/SelectionDAGPatternMatchTest.cpp.o
21.979 [2/1/824] Building CXX object unittests/CodeGen/CMakeFiles/CodeGenTests.dir/InstrRefLDVTest.cpp.o
ninja: build stopped: subcommand failed.

```

</details>

https://github.com/llvm/llvm-project/pull/210322


More information about the llvm-commits mailing list