[llvm] AMDGPU: Move AMDGPUTargetID to AMDGPUTargetParser (PR #205268)

LLVM Continuous Integration via llvm-commits llvm-commits at lists.llvm.org
Tue Jun 23 02:52:47 PDT 2026


llvm-ci wrote:

LLVM Buildbot has detected a new failure on builder `openmp-offload-libc-amdgpu-runtime` running on `omp-vega20-1` while building `llvm` at step 4 "annotate".

Full details are available at: https://lab.llvm.org/buildbot/#/builders/73/builds/27613

<details>
<summary>Here is the relevant piece of the build log for the reference</summary>

```
Step 4 (annotate) failure: '../llvm-zorg/zorg/buildbot/builders/annotated/amdgpu-offload-cmake.py --cmake-file=AMDGPULibcBot.cmake' (failure)
...
[4920/5044] Linking CXX shared library lib/libLLVMAMDGPUUtils.so.23.0git
[4921/5044] Creating library symlink lib/libLLVMAMDGPUUtils.so
[4922/5044] Building CXX object lib/Target/AMDGPU/MCTargetDesc/CMakeFiles/LLVMAMDGPUDesc.dir/AMDGPUMCTargetDesc.cpp.o
[4923/5044] Building CXX object lib/Target/AMDGPU/AsmParser/CMakeFiles/LLVMAMDGPUAsmParser.dir/AMDGPUAsmParser.cpp.o
[4924/5044] Building CXX object lib/Target/AMDGPU/Disassembler/CMakeFiles/LLVMAMDGPUDisassembler.dir/AMDGPUDisassembler.cpp.o
[4925/5044] Building CXX object lib/Target/AMDGPU/MCTargetDesc/CMakeFiles/LLVMAMDGPUDesc.dir/AMDGPUMCCodeEmitter.cpp.o
[4926/5044] Linking CXX shared library lib/libLLVMAMDGPUDesc.so.23.0git
[4927/5044] Creating library symlink lib/libLLVMAMDGPUDesc.so
[4928/5044] Linking CXX shared library lib/libLLVMAMDGPUTargetMCA.so.23.0git
[4929/5044] Linking CXX shared library lib/libLLVMAMDGPUDisassembler.so.23.0git
FAILED: lib/libLLVMAMDGPUDisassembler.so.23.0git 
: && /usr/bin/c++ -fPIC -fPIC -fno-semantic-interposition -fvisibility-inlines-hidden -Werror=date-time -Wall -Wextra -Wno-unused-parameter -Wwrite-strings -Wcast-qual -Wno-missing-field-initializers -pedantic -Wno-long-long -Wimplicit-fallthrough -Wno-uninitialized -Wno-nonnull -Wno-class-memaccess -Wno-redundant-move -Wno-pessimizing-move -Wno-array-bounds -Wno-stringop-overread -Wno-noexcept-type -Wdelete-non-virtual-dtor -Wsuggest-override -Wno-comment -Wno-misleading-indentation -Wctad-maybe-unsupported -fdiagnostics-color -ffunction-sections -fdata-sections -O3 -DNDEBUG  -Wl,-z,defs -Wl,-z,nodelete   -Wl,-rpath-link,/home/botworker/bbot/openmp-offload-libc-amdgpu-runtime/build/./lib  -Wl,--gc-sections -shared -Wl,-soname,libLLVMAMDGPUDisassembler.so.23.0git -o lib/libLLVMAMDGPUDisassembler.so.23.0git lib/Target/AMDGPU/Disassembler/CMakeFiles/LLVMAMDGPUDisassembler.dir/AMDGPUDisassembler.cpp.o  -Wl,-rpath,"\$ORIGIN/../lib:\$ORIGIN/../lib/x86_64-unknown-linux-gnu:/home/botworker/bbot/openmp-offload-libc-amdgpu-runtime/build/lib:"  lib/libLLVMAMDGPUDesc.so.23.0git  lib/libLLVMAMDGPUInfo.so.23.0git  lib/libLLVMAMDGPUUtils.so.23.0git  lib/libLLVMCodeGenTypes.so.23.0git  lib/libLLVMMCDisassembler.so.23.0git  lib/libLLVMMC.so.23.0git  lib/libLLVMSupport.so.23.0git  -Wl,-rpath-link,/home/botworker/bbot/openmp-offload-libc-amdgpu-runtime/build/lib && :
/usr/bin/ld: lib/Target/AMDGPU/Disassembler/CMakeFiles/LLVMAMDGPUDisassembler.dir/AMDGPUDisassembler.cpp.o: in function `llvm::AMDGPUDisassembler::emitTargetIDIfSupported(llvm::raw_ostream&, unsigned int) const [clone .localalias]':
AMDGPUDisassembler.cpp:(.text._ZNK4llvm18AMDGPUDisassembler23emitTargetIDIfSupportedERNS_11raw_ostreamEj+0x68): undefined reference to `llvm::Triple::normalize[abi:cxx11](llvm::StringRef, llvm::Triple::CanonicalForm)'
collect2: error: ld returned 1 exit status
[4930/5044] Creating library symlink lib/libLLVMAMDGPUTargetMCA.so
[4931/5044] Linking CXX shared library lib/libLLVMAMDGPUAsmParser.so.23.0git
[4932/5044] Linking CXX executable bin/llvm-dwarfdump
[4933/5044] Linking CXX shared library lib/libLLVMAMDGPUCodeGen.so.23.0git
ninja: build stopped: subcommand failed.
['ninja'] exited with return code 1.
The build step threw an exception...
Traceback (most recent call last):
  File "/home/botworker/bbot/openmp-offload-libc-amdgpu-runtime/build/../llvm-zorg/zorg/buildbot/builders/annotated/amdgpu-offload-cmake.py", line 62, in step
    yield
  File "/home/botworker/bbot/openmp-offload-libc-amdgpu-runtime/build/../llvm-zorg/zorg/buildbot/builders/annotated/amdgpu-offload-cmake.py", line 53, in main
    run_command(["ninja"])
  File "/home/botworker/bbot/openmp-offload-libc-amdgpu-runtime/build/../llvm-zorg/zorg/buildbot/builders/annotated/amdgpu-offload-cmake.py", line 75, in run_command
    util.report_run_cmd(cmd, cwd=directory)
  File "/home/botworker/bbot/openmp-offload-libc-amdgpu-runtime/llvm-zorg/zorg/buildbot/builders/annotated/util.py", line 49, in report_run_cmd
    subprocess.check_call(cmd, shell=shell, *args, **kwargs)
  File "/usr/lib/python3.10/subprocess.py", line 369, in check_call
    raise CalledProcessError(retcode, cmd)
subprocess.CalledProcessError: Command '['ninja']' returned non-zero exit status 1.
@@@STEP_FAILURE@@@
Step 7 (build cmake config) failure: build cmake config (failure)
...
[4920/5044] Linking CXX shared library lib/libLLVMAMDGPUUtils.so.23.0git
[4921/5044] Creating library symlink lib/libLLVMAMDGPUUtils.so
[4922/5044] Building CXX object lib/Target/AMDGPU/MCTargetDesc/CMakeFiles/LLVMAMDGPUDesc.dir/AMDGPUMCTargetDesc.cpp.o
[4923/5044] Building CXX object lib/Target/AMDGPU/AsmParser/CMakeFiles/LLVMAMDGPUAsmParser.dir/AMDGPUAsmParser.cpp.o
[4924/5044] Building CXX object lib/Target/AMDGPU/Disassembler/CMakeFiles/LLVMAMDGPUDisassembler.dir/AMDGPUDisassembler.cpp.o
[4925/5044] Building CXX object lib/Target/AMDGPU/MCTargetDesc/CMakeFiles/LLVMAMDGPUDesc.dir/AMDGPUMCCodeEmitter.cpp.o
[4926/5044] Linking CXX shared library lib/libLLVMAMDGPUDesc.so.23.0git
[4927/5044] Creating library symlink lib/libLLVMAMDGPUDesc.so
[4928/5044] Linking CXX shared library lib/libLLVMAMDGPUTargetMCA.so.23.0git
[4929/5044] Linking CXX shared library lib/libLLVMAMDGPUDisassembler.so.23.0git
FAILED: lib/libLLVMAMDGPUDisassembler.so.23.0git 
: && /usr/bin/c++ -fPIC -fPIC -fno-semantic-interposition -fvisibility-inlines-hidden -Werror=date-time -Wall -Wextra -Wno-unused-parameter -Wwrite-strings -Wcast-qual -Wno-missing-field-initializers -pedantic -Wno-long-long -Wimplicit-fallthrough -Wno-uninitialized -Wno-nonnull -Wno-class-memaccess -Wno-redundant-move -Wno-pessimizing-move -Wno-array-bounds -Wno-stringop-overread -Wno-noexcept-type -Wdelete-non-virtual-dtor -Wsuggest-override -Wno-comment -Wno-misleading-indentation -Wctad-maybe-unsupported -fdiagnostics-color -ffunction-sections -fdata-sections -O3 -DNDEBUG  -Wl,-z,defs -Wl,-z,nodelete   -Wl,-rpath-link,/home/botworker/bbot/openmp-offload-libc-amdgpu-runtime/build/./lib  -Wl,--gc-sections -shared -Wl,-soname,libLLVMAMDGPUDisassembler.so.23.0git -o lib/libLLVMAMDGPUDisassembler.so.23.0git lib/Target/AMDGPU/Disassembler/CMakeFiles/LLVMAMDGPUDisassembler.dir/AMDGPUDisassembler.cpp.o  -Wl,-rpath,"\$ORIGIN/../lib:\$ORIGIN/../lib/x86_64-unknown-linux-gnu:/home/botworker/bbot/openmp-offload-libc-amdgpu-runtime/build/lib:"  lib/libLLVMAMDGPUDesc.so.23.0git  lib/libLLVMAMDGPUInfo.so.23.0git  lib/libLLVMAMDGPUUtils.so.23.0git  lib/libLLVMCodeGenTypes.so.23.0git  lib/libLLVMMCDisassembler.so.23.0git  lib/libLLVMMC.so.23.0git  lib/libLLVMSupport.so.23.0git  -Wl,-rpath-link,/home/botworker/bbot/openmp-offload-libc-amdgpu-runtime/build/lib && :
/usr/bin/ld: lib/Target/AMDGPU/Disassembler/CMakeFiles/LLVMAMDGPUDisassembler.dir/AMDGPUDisassembler.cpp.o: in function `llvm::AMDGPUDisassembler::emitTargetIDIfSupported(llvm::raw_ostream&, unsigned int) const [clone .localalias]':
AMDGPUDisassembler.cpp:(.text._ZNK4llvm18AMDGPUDisassembler23emitTargetIDIfSupportedERNS_11raw_ostreamEj+0x68): undefined reference to `llvm::Triple::normalize[abi:cxx11](llvm::StringRef, llvm::Triple::CanonicalForm)'
collect2: error: ld returned 1 exit status
[4930/5044] Creating library symlink lib/libLLVMAMDGPUTargetMCA.so
[4931/5044] Linking CXX shared library lib/libLLVMAMDGPUAsmParser.so.23.0git
[4932/5044] Linking CXX executable bin/llvm-dwarfdump
[4933/5044] Linking CXX shared library lib/libLLVMAMDGPUCodeGen.so.23.0git
ninja: build stopped: subcommand failed.
['ninja'] exited with return code 1.
The build step threw an exception...
Traceback (most recent call last):
  File "/home/botworker/bbot/openmp-offload-libc-amdgpu-runtime/build/../llvm-zorg/zorg/buildbot/builders/annotated/amdgpu-offload-cmake.py", line 62, in step
    yield
  File "/home/botworker/bbot/openmp-offload-libc-amdgpu-runtime/build/../llvm-zorg/zorg/buildbot/builders/annotated/amdgpu-offload-cmake.py", line 53, in main
    run_command(["ninja"])
  File "/home/botworker/bbot/openmp-offload-libc-amdgpu-runtime/build/../llvm-zorg/zorg/buildbot/builders/annotated/amdgpu-offload-cmake.py", line 75, in run_command
    util.report_run_cmd(cmd, cwd=directory)
  File "/home/botworker/bbot/openmp-offload-libc-amdgpu-runtime/llvm-zorg/zorg/buildbot/builders/annotated/util.py", line 49, in report_run_cmd
    subprocess.check_call(cmd, shell=shell, *args, **kwargs)
  File "/usr/lib/python3.10/subprocess.py", line 369, in check_call
    raise CalledProcessError(retcode, cmd)
subprocess.CalledProcessError: Command '['ninja']' returned non-zero exit status 1.
program finished with exit code 0
elapsedTime=117.875906

```

</details>

https://github.com/llvm/llvm-project/pull/205268


More information about the llvm-commits mailing list