[llvm] [CodeGen] Port mir-debugify to new pass manager (PR #193201)
via llvm-commits
llvm-commits at lists.llvm.org
Wed Apr 29 12:56:46 PDT 2026
github-actions[bot] wrote:
<!--PREMERGE ADVISOR COMMENT: Windows-->
# :window: Windows x64 Test Results
The build failed before running any tests. Click on a failure below to see the details.
<details>
<summary>[code=1] lib/CodeGen/CMakeFiles/LLVMCodeGen.dir/MachineDebugify.cpp.obj</summary>
```
FAILED: [code=1] lib/CodeGen/CMakeFiles/LLVMCodeGen.dir/MachineDebugify.cpp.obj
sccache C:\clang\clang-msvc\bin\clang-cl.exe /nologo -TP -DUNICODE -D_CRT_NONSTDC_NO_DEPRECATE -D_CRT_NONSTDC_NO_WARNINGS -D_CRT_SECURE_NO_DEPRECATE -D_CRT_SECURE_NO_WARNINGS -D_GLIBCXX_ASSERTIONS -D_HAS_EXCEPTIONS=0 -D_LIBCPP_HARDENING_MODE=_LIBCPP_HARDENING_MODE_EXTENSIVE -D_SCL_SECURE_NO_DEPRECATE -D_SCL_SECURE_NO_WARNINGS -D_UNICODE -D__STDC_CONSTANT_MACROS -D__STDC_FORMAT_MACROS -D__STDC_LIMIT_MACROS -IC:\_work\llvm-project\llvm-project\build\lib\CodeGen -IC:\_work\llvm-project\llvm-project\llvm\lib\CodeGen -IC:\_work\llvm-project\llvm-project\build\include -IC:\_work\llvm-project\llvm-project\llvm\include /DWIN32 /D_WINDOWS /Zc:inline /Zc:__cplusplus /Oi /Brepro /bigobj /permissive- -Werror=unguarded-availability-new /W4 -Wextra -Wno-unused-parameter -Wwrite-strings -Wcast-qual -Wmissing-field-initializers -Wimplicit-fallthrough -Wcovered-switch-default -Wno-noexcept-type -Wnon-virtual-dtor -Wdelete-non-virtual-dtor -Wsuggest-override -Wstring-conversion -Wno-pass-failed -Wmisleading-indentation -Wctad-maybe-unsupported /Gw /O2 /Ob2 -std:c++17 -MD -UNDEBUG /EHs-c- /GR- /showIncludes /Folib\CodeGen\CMakeFiles\LLVMCodeGen.dir\MachineDebugify.cpp.obj /Fdlib\CodeGen\CMakeFiles\LLVMCodeGen.dir\LLVMCodeGen.pdb -c -- C:\_work\llvm-project\llvm-project\llvm\lib\CodeGen\MachineDebugify.cpp
In file included from C:\_work\llvm-project\llvm-project\llvm\lib\CodeGen\MachineDebugify.cpp:16:
C:\_work\llvm-project\llvm-project\llvm\include\llvm/CodeGen/MachineDebugify.h(25,24): error: use of undeclared identifier 'MachineFunction'
25 | llvm::function_ref<MachineFunction *(Function &)> GetMF);
| ^~~~~~~~~~~~~~~
C:\_work\llvm-project\llvm-project\llvm\include\llvm/CodeGen/MachineDebugify.h(25,53): error: expected expression
25 | llvm::function_ref<MachineFunction *(Function &)> GetMF);
| ^
C:\_work\llvm-project\llvm-project\llvm\lib\CodeGen\MachineDebugify.cpp(32,12): error: out-of-line definition of 'applyDebugifyMetadataToMachineFunction' does not match any declaration in namespace 'llvm'
32 | bool llvm::applyDebugifyMetadataToMachineFunction(
| ^~~~~~~~~~~~~~~~~~~~~~~~~~~~~~~~~~~~~~
3 errors generated.
```
</details>
If these failures are unrelated to your changes (for example tests are broken or flaky at HEAD), please open an issue at https://github.com/llvm/llvm-project/issues and add the `infrastructure` label.
https://github.com/llvm/llvm-project/pull/193201
More information about the llvm-commits
mailing list