[llvm] [NVPTX] Implement fp.control/fp.except operand bundle support (PR #191614)
via llvm-commits
llvm-commits at lists.llvm.org
Sat Apr 11 03:56:38 PDT 2026
github-actions[bot] wrote:
<!--PREMERGE ADVISOR COMMENT: Linux-->
# :penguin: Linux x64 Test Results
The build failed before running any tests. Click on a failure below to see the details.
<details>
<summary>lib/IR/CMakeFiles/LLVMCore.dir/Instructions.cpp.o</summary>
```
FAILED: lib/IR/CMakeFiles/LLVMCore.dir/Instructions.cpp.o
sccache /opt/llvm/bin/clang++ -D_DEBUG -D_GLIBCXX_ASSERTIONS -D_GLIBCXX_USE_CXX11_ABI=1 -D_GNU_SOURCE -D_LIBCPP_HARDENING_MODE=_LIBCPP_HARDENING_MODE_EXTENSIVE -D__STDC_CONSTANT_MACROS -D__STDC_FORMAT_MACROS -D__STDC_LIMIT_MACROS -I/home/gha/actions-runner/_work/llvm-project/llvm-project/build/lib/IR -I/home/gha/actions-runner/_work/llvm-project/llvm-project/llvm/lib/IR -I/home/gha/actions-runner/_work/llvm-project/llvm-project/build/include -I/home/gha/actions-runner/_work/llvm-project/llvm-project/llvm/include -gmlt -fPIC -fno-semantic-interposition -fvisibility-inlines-hidden -Werror -Werror=date-time -Werror=unguarded-availability-new -Wall -Wextra -Wno-unused-parameter -Wwrite-strings -Wcast-qual -Wmissing-field-initializers -pedantic -Wno-long-long -Wc++98-compat-extra-semi -Wimplicit-fallthrough -Wcovered-switch-default -Wno-noexcept-type -Wnon-virtual-dtor -Wdelete-non-virtual-dtor -Wsuggest-override -Wstring-conversion -Wno-pass-failed -Wmisleading-indentation -Wctad-maybe-unsupported -fdiagnostics-color -ffunction-sections -fdata-sections -O3 -DNDEBUG -std=c++17 -UNDEBUG -fno-exceptions -funwind-tables -fno-rtti -MD -MT lib/IR/CMakeFiles/LLVMCore.dir/Instructions.cpp.o -MF lib/IR/CMakeFiles/LLVMCore.dir/Instructions.cpp.o.d -o lib/IR/CMakeFiles/LLVMCore.dir/Instructions.cpp.o -c /home/gha/actions-runner/_work/llvm-project/llvm-project/llvm/lib/IR/Instructions.cpp
/home/gha/actions-runner/_work/llvm-project/llvm-project/llvm/lib/IR/Instructions.cpp:637:31: error: unused variable 'RM' [-Werror,-Wunused-variable]
637 | std::optional<RoundingMode> RM;
| ^~
1 error generated.
```
</details>
<details>
<summary>lib/CodeGen/CMakeFiles/LLVMCodeGen.dir/TargetLoweringBase.cpp.o</summary>
```
FAILED: lib/CodeGen/CMakeFiles/LLVMCodeGen.dir/TargetLoweringBase.cpp.o
sccache /opt/llvm/bin/clang++ -D_DEBUG -D_GLIBCXX_ASSERTIONS -D_GLIBCXX_USE_CXX11_ABI=1 -D_GNU_SOURCE -D_LIBCPP_HARDENING_MODE=_LIBCPP_HARDENING_MODE_EXTENSIVE -D__STDC_CONSTANT_MACROS -D__STDC_FORMAT_MACROS -D__STDC_LIMIT_MACROS -I/home/gha/actions-runner/_work/llvm-project/llvm-project/build/lib/CodeGen -I/home/gha/actions-runner/_work/llvm-project/llvm-project/llvm/lib/CodeGen -I/home/gha/actions-runner/_work/llvm-project/llvm-project/build/include -I/home/gha/actions-runner/_work/llvm-project/llvm-project/llvm/include -gmlt -fPIC -fno-semantic-interposition -fvisibility-inlines-hidden -Werror -Werror=date-time -Werror=unguarded-availability-new -Wall -Wextra -Wno-unused-parameter -Wwrite-strings -Wcast-qual -Wmissing-field-initializers -pedantic -Wno-long-long -Wc++98-compat-extra-semi -Wimplicit-fallthrough -Wcovered-switch-default -Wno-noexcept-type -Wnon-virtual-dtor -Wdelete-non-virtual-dtor -Wsuggest-override -Wstring-conversion -Wno-pass-failed -Wmisleading-indentation -Wctad-maybe-unsupported -fdiagnostics-color -ffunction-sections -fdata-sections -O3 -DNDEBUG -std=c++17 -UNDEBUG -fno-exceptions -funwind-tables -fno-rtti -MD -MT lib/CodeGen/CMakeFiles/LLVMCodeGen.dir/TargetLoweringBase.cpp.o -MF lib/CodeGen/CMakeFiles/LLVMCodeGen.dir/TargetLoweringBase.cpp.o.d -o lib/CodeGen/CMakeFiles/LLVMCodeGen.dir/TargetLoweringBase.cpp.o -c /home/gha/actions-runner/_work/llvm-project/llvm-project/llvm/lib/CodeGen/TargetLoweringBase.cpp
/home/gha/actions-runner/_work/llvm-project/llvm-project/llvm/lib/CodeGen/TargetLoweringBase.cpp:1210:7: error: misleading indentation; statement is not part of the previous 'if' [-Werror,-Wmisleading-indentation]
1210 | setOperationAction({
| ^
/home/gha/actions-runner/_work/llvm-project/llvm-project/llvm/lib/CodeGen/TargetLoweringBase.cpp:1201:5: note: previous statement is here
1201 | if (VT.isVector())
| ^
1 error generated.
```
</details>
<details>
<summary>lib/CodeGen/SelectionDAG/CMakeFiles/LLVMSelectionDAG.dir/SelectionDAGBuilder.cpp.o</summary>
```
FAILED: lib/CodeGen/SelectionDAG/CMakeFiles/LLVMSelectionDAG.dir/SelectionDAGBuilder.cpp.o
sccache /opt/llvm/bin/clang++ -D_DEBUG -D_GLIBCXX_ASSERTIONS -D_GLIBCXX_USE_CXX11_ABI=1 -D_GNU_SOURCE -D_LIBCPP_HARDENING_MODE=_LIBCPP_HARDENING_MODE_EXTENSIVE -D__STDC_CONSTANT_MACROS -D__STDC_FORMAT_MACROS -D__STDC_LIMIT_MACROS -I/home/gha/actions-runner/_work/llvm-project/llvm-project/build/lib/CodeGen/SelectionDAG -I/home/gha/actions-runner/_work/llvm-project/llvm-project/llvm/lib/CodeGen/SelectionDAG -I/home/gha/actions-runner/_work/llvm-project/llvm-project/build/include -I/home/gha/actions-runner/_work/llvm-project/llvm-project/llvm/include -gmlt -fPIC -fno-semantic-interposition -fvisibility-inlines-hidden -Werror -Werror=date-time -Werror=unguarded-availability-new -Wall -Wextra -Wno-unused-parameter -Wwrite-strings -Wcast-qual -Wmissing-field-initializers -pedantic -Wno-long-long -Wc++98-compat-extra-semi -Wimplicit-fallthrough -Wcovered-switch-default -Wno-noexcept-type -Wnon-virtual-dtor -Wdelete-non-virtual-dtor -Wsuggest-override -Wstring-conversion -Wno-pass-failed -Wmisleading-indentation -Wctad-maybe-unsupported -fdiagnostics-color -ffunction-sections -fdata-sections -O3 -DNDEBUG -std=c++17 -UNDEBUG -fno-exceptions -funwind-tables -fno-rtti -MD -MT lib/CodeGen/SelectionDAG/CMakeFiles/LLVMSelectionDAG.dir/SelectionDAGBuilder.cpp.o -MF lib/CodeGen/SelectionDAG/CMakeFiles/LLVMSelectionDAG.dir/SelectionDAGBuilder.cpp.o.d -o lib/CodeGen/SelectionDAG/CMakeFiles/LLVMSelectionDAG.dir/SelectionDAGBuilder.cpp.o -c /home/gha/actions-runner/_work/llvm-project/llvm-project/llvm/lib/CodeGen/SelectionDAG/SelectionDAGBuilder.cpp
/home/gha/actions-runner/_work/llvm-project/llvm-project/llvm/lib/CodeGen/SelectionDAG/SelectionDAGBuilder.cpp:8725:9: error: no viable conversion from 'Type *' to 'EVT'
8725 | I.getType(), OpVT.getVectorElementCount(), ZeroIsPoison, &VScaleRange);
| ^~~~~~~~~~~
/home/gha/actions-runner/_work/llvm-project/llvm-project/llvm/include/llvm/CodeGen/ValueTypes.h:35:10: note: candidate constructor (the implicit copy constructor) not viable: no known conversion from 'Type *' to 'const EVT &' for 1st argument
35 | struct EVT {
| ^~~
/home/gha/actions-runner/_work/llvm-project/llvm-project/llvm/include/llvm/CodeGen/ValueTypes.h:35:10: note: candidate constructor (the implicit move constructor) not viable: no known conversion from 'Type *' to 'EVT &&' for 1st argument
35 | struct EVT {
| ^~~
/home/gha/actions-runner/_work/llvm-project/llvm-project/llvm/include/llvm/CodeGen/ValueTypes.h:42:15: note: candidate constructor not viable: no known conversion from 'Type *' to 'MVT::SimpleValueType' for 1st argument
42 | constexpr EVT(MVT::SimpleValueType SVT) : V(SVT) {}
| ^ ~~~~~~~~~~~~~~~~~~~~~~~~
/home/gha/actions-runner/_work/llvm-project/llvm-project/llvm/include/llvm/CodeGen/ValueTypes.h:43:15: note: candidate constructor not viable: no known conversion from 'Type *' to 'MVT' for 1st argument
43 | constexpr EVT(MVT S) : V(S) {}
| ^ ~~~~~
/home/gha/actions-runner/_work/llvm-project/llvm-project/llvm/include/llvm/CodeGen/TargetLowering.h:518:43: note: passing argument to parameter 'RetVT' here
518 | unsigned getBitWidthForCttzElements(EVT RetVT, ElementCount EC,
| ^
1 error generated.
```
</details>
<details>
<summary>lib/Transforms/Utils/CMakeFiles/LLVMTransformUtils.dir/CloneFunction.cpp.o</summary>
```
FAILED: lib/Transforms/Utils/CMakeFiles/LLVMTransformUtils.dir/CloneFunction.cpp.o
sccache /opt/llvm/bin/clang++ -D_DEBUG -D_GLIBCXX_ASSERTIONS -D_GLIBCXX_USE_CXX11_ABI=1 -D_GNU_SOURCE -D_LIBCPP_HARDENING_MODE=_LIBCPP_HARDENING_MODE_EXTENSIVE -D__STDC_CONSTANT_MACROS -D__STDC_FORMAT_MACROS -D__STDC_LIMIT_MACROS -I/home/gha/actions-runner/_work/llvm-project/llvm-project/build/lib/Transforms/Utils -I/home/gha/actions-runner/_work/llvm-project/llvm-project/llvm/lib/Transforms/Utils -I/home/gha/actions-runner/_work/llvm-project/llvm-project/build/include -I/home/gha/actions-runner/_work/llvm-project/llvm-project/llvm/include -gmlt -fPIC -fno-semantic-interposition -fvisibility-inlines-hidden -Werror -Werror=date-time -Werror=unguarded-availability-new -Wall -Wextra -Wno-unused-parameter -Wwrite-strings -Wcast-qual -Wmissing-field-initializers -pedantic -Wno-long-long -Wc++98-compat-extra-semi -Wimplicit-fallthrough -Wcovered-switch-default -Wno-noexcept-type -Wnon-virtual-dtor -Wdelete-non-virtual-dtor -Wsuggest-override -Wstring-conversion -Wno-pass-failed -Wmisleading-indentation -Wctad-maybe-unsupported -fdiagnostics-color -ffunction-sections -fdata-sections -O3 -DNDEBUG -std=c++17 -UNDEBUG -fno-exceptions -funwind-tables -fno-rtti -MD -MT lib/Transforms/Utils/CMakeFiles/LLVMTransformUtils.dir/CloneFunction.cpp.o -MF lib/Transforms/Utils/CMakeFiles/LLVMTransformUtils.dir/CloneFunction.cpp.o.d -o lib/Transforms/Utils/CMakeFiles/LLVMTransformUtils.dir/CloneFunction.cpp.o -c /home/gha/actions-runner/_work/llvm-project/llvm-project/llvm/lib/Transforms/Utils/CloneFunction.cpp
/home/gha/actions-runner/_work/llvm-project/llvm-project/llvm/lib/Transforms/Utils/CloneFunction.cpp:661:12: error: out-of-line definition of 'CloneAndPruneIntoFromInst' does not match any declaration in namespace 'llvm'
661 | void llvm::CloneAndPruneIntoFromInst(Function *NewFunc, const Function *OldFunc,
| ^~~~~~~~~~~~~~~~~~~~~~~~~
/home/gha/actions-runner/_work/llvm-project/llvm-project/llvm/include/llvm/Transforms/Utils/Cloning.h:238:51: note: type of 8th parameter of member declaration does not match definition ('ClonedCodeInfo &' vs 'ClonedCodeInfo *')
238 | const char *NameSuffix, ClonedCodeInfo &CodeInfo);
| ^
/home/gha/actions-runner/_work/llvm-project/llvm-project/llvm/lib/Transforms/Utils/CloneFunction.cpp:947:12: error: out-of-line definition of 'CloneAndPruneFunctionInto' does not match any declaration in namespace 'llvm'
947 | void llvm::CloneAndPruneFunctionInto(
| ^~~~~~~~~~~~~~~~~~~~~~~~~
/home/gha/actions-runner/_work/llvm-project/llvm-project/llvm/include/llvm/Transforms/Utils/Cloning.h:255:51: note: type of 7th parameter of member declaration does not match definition ('ClonedCodeInfo &' vs 'ClonedCodeInfo *')
255 | const char *NameSuffix, ClonedCodeInfo &CodeInfo);
| ^
2 errors generated.
```
</details>
<details>
<summary>tools/clang/lib/CodeGen/CMakeFiles/obj.clangCodeGen.dir/CGBuiltin.cpp.o</summary>
```
FAILED: tools/clang/lib/CodeGen/CMakeFiles/obj.clangCodeGen.dir/CGBuiltin.cpp.o
sccache /opt/llvm/bin/clang++ -DCLANG_EXPORTS -D_DEBUG -D_GLIBCXX_ASSERTIONS -D_GLIBCXX_USE_CXX11_ABI=1 -D_GNU_SOURCE -D_LIBCPP_HARDENING_MODE=_LIBCPP_HARDENING_MODE_EXTENSIVE -D__STDC_CONSTANT_MACROS -D__STDC_FORMAT_MACROS -D__STDC_LIMIT_MACROS -I/home/gha/actions-runner/_work/llvm-project/llvm-project/build/tools/clang/lib/CodeGen -I/home/gha/actions-runner/_work/llvm-project/llvm-project/clang/lib/CodeGen -I/home/gha/actions-runner/_work/llvm-project/llvm-project/clang/include -I/home/gha/actions-runner/_work/llvm-project/llvm-project/build/tools/clang/include -I/home/gha/actions-runner/_work/llvm-project/llvm-project/build/include -I/home/gha/actions-runner/_work/llvm-project/llvm-project/llvm/include -gmlt -fPIC -fno-semantic-interposition -fvisibility-inlines-hidden -Werror -Werror=date-time -Werror=unguarded-availability-new -Wall -Wextra -Wno-unused-parameter -Wwrite-strings -Wcast-qual -Wmissing-field-initializers -pedantic -Wno-long-long -Wc++98-compat-extra-semi -Wimplicit-fallthrough -Wcovered-switch-default -Wno-noexcept-type -Wnon-virtual-dtor -Wdelete-non-virtual-dtor -Wsuggest-override -Wstring-conversion -Wno-pass-failed -Wmisleading-indentation -Wctad-maybe-unsupported -fdiagnostics-color -ffunction-sections -fdata-sections -fno-common -Woverloaded-virtual -Wno-nested-anon-types -O3 -DNDEBUG -std=c++17 -UNDEBUG -fno-exceptions -funwind-tables -fno-rtti -MD -MT tools/clang/lib/CodeGen/CMakeFiles/obj.clangCodeGen.dir/CGBuiltin.cpp.o -MF tools/clang/lib/CodeGen/CMakeFiles/obj.clangCodeGen.dir/CGBuiltin.cpp.o.d -o tools/clang/lib/CodeGen/CMakeFiles/obj.clangCodeGen.dir/CGBuiltin.cpp.o -c /home/gha/actions-runner/_work/llvm-project/llvm-project/clang/lib/CodeGen/CGBuiltin.cpp
/home/gha/actions-runner/_work/llvm-project/llvm-project/clang/lib/CodeGen/CGBuiltin.cpp:601:24: error: no member named 'CreateConstrainedFPCall' in 'clang::CodeGen::CGBuilderTy'
601 | return CGF.Builder.CreateConstrainedFPCall(F, { Src0 });
| ~~~~~~~~~~~ ^
/home/gha/actions-runner/_work/llvm-project/llvm-project/clang/lib/CodeGen/CGBuiltin.cpp:619:24: error: no member named 'CreateConstrainedFPCall' in 'clang::CodeGen::CGBuilderTy'
619 | return CGF.Builder.CreateConstrainedFPCall(F, { Src0, Src1 });
| ~~~~~~~~~~~ ^
/home/gha/actions-runner/_work/llvm-project/llvm-project/clang/lib/CodeGen/CGBuiltin.cpp:638:24: error: no member named 'CreateConstrainedFPCall' in 'clang::CodeGen::CGBuilderTy'
638 | return CGF.Builder.CreateConstrainedFPCall(F, {Src0, Src1});
| ~~~~~~~~~~~ ^
/home/gha/actions-runner/_work/llvm-project/llvm-project/clang/lib/CodeGen/CGBuiltin.cpp:658:24: error: no member named 'CreateConstrainedFPCall' in 'clang::CodeGen::CGBuilderTy'
658 | return CGF.Builder.CreateConstrainedFPCall(F, { Src0, Src1, Src2 });
| ~~~~~~~~~~~ ^
/home/gha/actions-runner/_work/llvm-project/llvm-project/clang/lib/CodeGen/CGBuiltin.cpp:677:24: error: no member named 'CreateConstrainedFPCall' in 'clang::CodeGen::CGBuilderTy'
677 | return CGF.Builder.CreateConstrainedFPCall(F, {Src0});
| ~~~~~~~~~~~ ^
/home/gha/actions-runner/_work/llvm-project/llvm-project/clang/lib/CodeGen/CGBuiltin.cpp:2712:49: error: no member named 'experimental_constrained_acos' in namespace 'llvm::Intrinsic'
2712 | *this, E, Intrinsic::acos, Intrinsic::experimental_constrained_acos));
| ^~~~~~~~~~~~~~~~~~~~~~~~~~~~~
/home/gha/actions-runner/_work/llvm-project/llvm-project/clang/lib/CodeGen/CGBuiltin.cpp:2724:49: error: no member named 'experimental_constrained_asin' in namespace 'llvm::Intrinsic'; did you mean 'experimental_vp_strided_load'?
2724 | *this, E, Intrinsic::asin, Intrinsic::experimental_constrained_asin));
| ^~~~~~~~~~~~~~~~~~~~~~~~~~~~~
| experimental_vp_strided_load
/home/gha/actions-runner/_work/llvm-project/llvm-project/build/include/llvm/IR/IntrinsicEnums.inc:140:5: note: 'experimental_vp_strided_load' declared here
140 | experimental_vp_strided_load, // llvm.experimental.vp.strided.load (Intrinsics.td:1907)
| ^
/home/gha/actions-runner/_work/llvm-project/llvm-project/clang/lib/CodeGen/CGBuiltin.cpp:2736:49: error: no member named 'experimental_constrained_atan' in namespace 'llvm::Intrinsic'; did you mean 'experimental_vp_strided_load'?
2736 | *this, E, Intrinsic::atan, Intrinsic::experimental_constrained_atan));
| ^~~~~~~~~~~~~~~~~~~~~~~~~~~~~
| experimental_vp_strided_load
/home/gha/actions-runner/_work/llvm-project/llvm-project/build/include/llvm/IR/IntrinsicEnums.inc:140:5: note: 'experimental_vp_strided_load' declared here
140 | experimental_vp_strided_load, // llvm.experimental.vp.strided.load (Intrinsics.td:1907)
| ^
/home/gha/actions-runner/_work/llvm-project/llvm-project/clang/lib/CodeGen/CGBuiltin.cpp:2749:22: error: no member named 'experimental_constrained_atan2' in namespace 'llvm::Intrinsic'
2749 | Intrinsic::experimental_constrained_atan2));
| ^~~~~~~~~~~~~~~~~~~~~~~~~~~~~~
/home/gha/actions-runner/_work/llvm-project/llvm-project/clang/lib/CodeGen/CGBuiltin.cpp:2762:47: error: no member named 'experimental_constrained_ceil' in namespace 'llvm::Intrinsic'; did you mean 'experimental_vp_strided_load'?
2762 | Intrinsic::experimental_constrained_ceil));
| ^~~~~~~~~~~~~~~~~~~~~~~~~~~~~
| experimental_vp_strided_load
/home/gha/actions-runner/_work/llvm-project/llvm-project/build/include/llvm/IR/IntrinsicEnums.inc:140:5: note: 'experimental_vp_strided_load' declared here
140 | experimental_vp_strided_load, // llvm.experimental.vp.strided.load (Intrinsics.td:1907)
| ^
/home/gha/actions-runner/_work/llvm-project/llvm-project/clang/lib/CodeGen/CGBuiltin.cpp:2786:47: error: no member named 'experimental_constrained_cos' in namespace 'llvm::Intrinsic'
2786 | Intrinsic::experimental_constrained_cos));
| ^~~~~~~~~~~~~~~~~~~~~~~~~~~~
/home/gha/actions-runner/_work/llvm-project/llvm-project/clang/lib/CodeGen/CGBuiltin.cpp:2798:49: error: no member named 'experimental_constrained_cosh' in namespace 'llvm::Intrinsic'
2798 | *this, E, Intrinsic::cosh, Intrinsic::experimental_constrained_cosh));
| ^~~~~~~~~~~~~~~~~~~~~~~~~~~~~
/home/gha/actions-runner/_work/llvm-project/llvm-project/clang/lib/CodeGen/CGBuiltin.cpp:2811:47: error: no member named 'experimental_constrained_exp' in namespace 'llvm::Intrinsic'
2811 | Intrinsic::experimental_constrained_exp));
| ^~~~~~~~~~~~~~~~~~~~~~~~~~~~
/home/gha/actions-runner/_work/llvm-project/llvm-project/clang/lib/CodeGen/CGBuiltin.cpp:2824:47: error: no member named 'experimental_constrained_exp2' in namespace 'llvm::Intrinsic'; did you mean 'experimental_vp_strided_load'?
2824 | Intrinsic::experimental_constrained_exp2));
| ^~~~~~~~~~~~~~~~~~~~~~~~~~~~~
| experimental_vp_strided_load
/home/gha/actions-runner/_work/llvm-project/llvm-project/build/include/llvm/IR/IntrinsicEnums.inc:140:5: note: 'experimental_vp_strided_load' declared here
140 | experimental_vp_strided_load, // llvm.experimental.vp.strided.load (Intrinsics.td:1907)
| ^
/home/gha/actions-runner/_work/llvm-project/llvm-project/clang/lib/CodeGen/CGBuiltin.cpp:2859:47: error: no member named 'experimental_constrained_floor' in namespace 'llvm::Intrinsic'
2859 | Intrinsic::experimental_constrained_floor));
| ^~~~~~~~~~~~~~~~~~~~~~~~~~~~~~
/home/gha/actions-runner/_work/llvm-project/llvm-project/clang/lib/CodeGen/CGBuiltin.cpp:2872:47: error: no member named 'experimental_constrained_fma' in namespace 'llvm::Intrinsic'; did you mean 'experimental_vp_strided_load'?
2872 | Intrinsic::experimental_constrained_fma));
| ^~~~~~~~~~~~~~~~~~~~~~~~~~~~
| experimental_vp_strided_load
/home/gha/actions-runner/_work/llvm-project/llvm-project/build/include/llvm/IR/IntrinsicEnums.inc:140:5: note: 'experimental_vp_strided_load' declared here
140 | experimental_vp_strided_load, // llvm.experimental.vp.strided.load (Intrinsics.td:1907)
| ^
/home/gha/actions-runner/_work/llvm-project/llvm-project/clang/lib/CodeGen/CGBuiltin.cpp:2886:22: error: no member named 'experimental_constrained_maxnum' in namespace 'llvm::Intrinsic'
2886 | Intrinsic::experimental_constrained_maxnum));
| ^~~~~~~~~~~~~~~~~~~~~~~~~~~~~~~
/home/gha/actions-runner/_work/llvm-project/llvm-project/clang/lib/CodeGen/CGBuiltin.cpp:2901:22: error: no member named 'experimental_constrained_minnum' in namespace 'llvm::Intrinsic'
2901 | Intrinsic::experimental_constrained_minnum));
| ^~~~~~~~~~~~~~~~~~~~~~~~~~~~~~~
/home/gha/actions-runner/_work/llvm-project/llvm-project/clang/lib/CodeGen/CGBuiltin.cpp:2941:51: error: no member named 'experimental_constrained_frem' in namespace 'llvm::Intrinsic'
2941 | Function *F = CGM.getIntrinsic(Intrinsic::experimental_constrained_frem,
| ^~~~~~~~~~~~~~~~~~~~~~~~~~~~~
fatal error: too many errors emitted, stopping now [-ferror-limit=]
20 errors generated.
```
</details>
<details>
<summary>tools/clang/lib/CodeGen/CMakeFiles/obj.clangCodeGen.dir/CGExprScalar.cpp.o</summary>
```
FAILED: tools/clang/lib/CodeGen/CMakeFiles/obj.clangCodeGen.dir/CGExprScalar.cpp.o
sccache /opt/llvm/bin/clang++ -DCLANG_EXPORTS -D_DEBUG -D_GLIBCXX_ASSERTIONS -D_GLIBCXX_USE_CXX11_ABI=1 -D_GNU_SOURCE -D_LIBCPP_HARDENING_MODE=_LIBCPP_HARDENING_MODE_EXTENSIVE -D__STDC_CONSTANT_MACROS -D__STDC_FORMAT_MACROS -D__STDC_LIMIT_MACROS -I/home/gha/actions-runner/_work/llvm-project/llvm-project/build/tools/clang/lib/CodeGen -I/home/gha/actions-runner/_work/llvm-project/llvm-project/clang/lib/CodeGen -I/home/gha/actions-runner/_work/llvm-project/llvm-project/clang/include -I/home/gha/actions-runner/_work/llvm-project/llvm-project/build/tools/clang/include -I/home/gha/actions-runner/_work/llvm-project/llvm-project/build/include -I/home/gha/actions-runner/_work/llvm-project/llvm-project/llvm/include -gmlt -fPIC -fno-semantic-interposition -fvisibility-inlines-hidden -Werror -Werror=date-time -Werror=unguarded-availability-new -Wall -Wextra -Wno-unused-parameter -Wwrite-strings -Wcast-qual -Wmissing-field-initializers -pedantic -Wno-long-long -Wc++98-compat-extra-semi -Wimplicit-fallthrough -Wcovered-switch-default -Wno-noexcept-type -Wnon-virtual-dtor -Wdelete-non-virtual-dtor -Wsuggest-override -Wstring-conversion -Wno-pass-failed -Wmisleading-indentation -Wctad-maybe-unsupported -fdiagnostics-color -ffunction-sections -fdata-sections -fno-common -Woverloaded-virtual -Wno-nested-anon-types -O3 -DNDEBUG -std=c++17 -UNDEBUG -fno-exceptions -funwind-tables -fno-rtti -MD -MT tools/clang/lib/CodeGen/CMakeFiles/obj.clangCodeGen.dir/CGExprScalar.cpp.o -MF tools/clang/lib/CodeGen/CMakeFiles/obj.clangCodeGen.dir/CGExprScalar.cpp.o.d -o tools/clang/lib/CodeGen/CMakeFiles/obj.clangCodeGen.dir/CGExprScalar.cpp.o -c /home/gha/actions-runner/_work/llvm-project/llvm-project/clang/lib/CodeGen/CGExprScalar.cpp
/home/gha/actions-runner/_work/llvm-project/llvm-project/clang/lib/CodeGen/CGExprScalar.cpp:4614:16: error: no member named 'ConstrainedFPIntrinsic' in namespace 'llvm'; did you mean 'llvm::Intrinsic::isConstrainedFPIntrinsic'?
4614 | assert(isa<llvm::ConstrainedFPIntrinsic>(MulOp) &&
| ^~~~~~~~~~~~~~~~~~~~~~~~~~~~
| llvm::Intrinsic::isConstrainedFPIntrinsic
/usr/include/assert.h:103:27: note: expanded from macro 'assert'
103 | (static_cast <bool> (expr) \
| ^~~~
/home/gha/actions-runner/_work/llvm-project/llvm-project/llvm/include/llvm/IR/Intrinsics.h:147:17: note: 'llvm::Intrinsic::isConstrainedFPIntrinsic' declared here
147 | LLVM_ABI bool isConstrainedFPIntrinsic(ID QID);
| ^
/home/gha/actions-runner/_work/llvm-project/llvm-project/clang/lib/CodeGen/CGExprScalar.cpp:4614:12: error: no matching function for call to 'isa'
4614 | assert(isa<llvm::ConstrainedFPIntrinsic>(MulOp) &&
| ^~~~~~~~~~~~~~~~~~~~~~~~~~~~~~~~~
/usr/include/assert.h:103:27: note: expanded from macro 'assert'
103 | (static_cast <bool> (expr) \
| ^~~~
/home/gha/actions-runner/_work/llvm-project/llvm-project/llvm/include/llvm/Support/Casting.h:547:27: note: candidate template ignored: invalid explicitly-specified argument for template parameter 'To'
547 | [[nodiscard]] inline bool isa(const From &Val) {
| ^
/home/gha/actions-runner/_work/llvm-project/llvm-project/clang/lib/CodeGen/Address.h:330:32: note: candidate template ignored: invalid explicitly-specified argument for template parameter 'U'
330 | template <class U> inline bool isa(CodeGen::Address addr) {
| ^
/home/gha/actions-runner/_work/llvm-project/llvm-project/clang/lib/CodeGen/CGExprScalar.cpp:4617:23: error: no member named 'CreateConstrainedFPCall' in 'clang::CodeGen::CGBuilderTy'
4617 | FMulAdd = Builder.CreateConstrainedFPCall(
| ~~~~~~~ ^
/home/gha/actions-runner/_work/llvm-project/llvm-project/clang/lib/CodeGen/CGExprScalar.cpp:4618:47: error: no member named 'experimental_constrained_fmuladd' in namespace 'llvm::Intrinsic'; did you mean 'experimental_vp_strided_load'?
4618 | CGF.CGM.getIntrinsic(llvm::Intrinsic::experimental_constrained_fmuladd,
| ^~~~~~~~~~~~~~~~~~~~~~~~~~~~~~~~
| experimental_vp_strided_load
/home/gha/actions-runner/_work/llvm-project/llvm-project/build/include/llvm/IR/IntrinsicEnums.inc:140:5: note: 'experimental_vp_strided_load' declared here
140 | experimental_vp_strided_load, // llvm.experimental.vp.strided.load (Intrinsics.td:1907)
| ^
/home/gha/actions-runner/_work/llvm-project/llvm-project/clang/lib/CodeGen/CGExprScalar.cpp:4696:30: error: no member named 'experimental_constrained_fmul' in namespace 'llvm::Intrinsic'; did you mean 'experimental_vp_strided_load'?
4696 | llvm::Intrinsic::experimental_constrained_fmul &&
| ^~~~~~~~~~~~~~~~~~~~~~~~~~~~~
| experimental_vp_strided_load
/home/gha/actions-runner/_work/llvm-project/llvm-project/build/include/llvm/IR/IntrinsicEnums.inc:140:5: note: 'experimental_vp_strided_load' declared here
140 | experimental_vp_strided_load, // llvm.experimental.vp.strided.load (Intrinsics.td:1907)
| ^
/home/gha/actions-runner/_work/llvm-project/llvm-project/clang/lib/CodeGen/CGExprScalar.cpp:4706:30: error: no member named 'experimental_constrained_fmul' in namespace 'llvm::Intrinsic'; did you mean 'experimental_vp_strided_load'?
4706 | llvm::Intrinsic::experimental_constrained_fmul &&
| ^~~~~~~~~~~~~~~~~~~~~~~~~~~~~
| experimental_vp_strided_load
/home/gha/actions-runner/_work/llvm-project/llvm-project/build/include/llvm/IR/IntrinsicEnums.inc:140:5: note: 'experimental_vp_strided_load' declared here
140 | experimental_vp_strided_load, // llvm.experimental.vp.strided.load (Intrinsics.td:1907)
| ^
6 errors generated.
```
</details>
<details>
<summary>tools/clang/lib/CodeGen/CMakeFiles/obj.clangCodeGen.dir/TargetBuiltins/SystemZ.cpp.o</summary>
```
FAILED: tools/clang/lib/CodeGen/CMakeFiles/obj.clangCodeGen.dir/TargetBuiltins/SystemZ.cpp.o
sccache /opt/llvm/bin/clang++ -DCLANG_EXPORTS -D_DEBUG -D_GLIBCXX_ASSERTIONS -D_GLIBCXX_USE_CXX11_ABI=1 -D_GNU_SOURCE -D_LIBCPP_HARDENING_MODE=_LIBCPP_HARDENING_MODE_EXTENSIVE -D__STDC_CONSTANT_MACROS -D__STDC_FORMAT_MACROS -D__STDC_LIMIT_MACROS -I/home/gha/actions-runner/_work/llvm-project/llvm-project/build/tools/clang/lib/CodeGen -I/home/gha/actions-runner/_work/llvm-project/llvm-project/clang/lib/CodeGen -I/home/gha/actions-runner/_work/llvm-project/llvm-project/clang/include -I/home/gha/actions-runner/_work/llvm-project/llvm-project/build/tools/clang/include -I/home/gha/actions-runner/_work/llvm-project/llvm-project/build/include -I/home/gha/actions-runner/_work/llvm-project/llvm-project/llvm/include -gmlt -fPIC -fno-semantic-interposition -fvisibility-inlines-hidden -Werror -Werror=date-time -Werror=unguarded-availability-new -Wall -Wextra -Wno-unused-parameter -Wwrite-strings -Wcast-qual -Wmissing-field-initializers -pedantic -Wno-long-long -Wc++98-compat-extra-semi -Wimplicit-fallthrough -Wcovered-switch-default -Wno-noexcept-type -Wnon-virtual-dtor -Wdelete-non-virtual-dtor -Wsuggest-override -Wstring-conversion -Wno-pass-failed -Wmisleading-indentation -Wctad-maybe-unsupported -fdiagnostics-color -ffunction-sections -fdata-sections -fno-common -Woverloaded-virtual -Wno-nested-anon-types -O3 -DNDEBUG -std=c++17 -UNDEBUG -fno-exceptions -funwind-tables -fno-rtti -MD -MT tools/clang/lib/CodeGen/CMakeFiles/obj.clangCodeGen.dir/TargetBuiltins/SystemZ.cpp.o -MF tools/clang/lib/CodeGen/CMakeFiles/obj.clangCodeGen.dir/TargetBuiltins/SystemZ.cpp.o.d -o tools/clang/lib/CodeGen/CMakeFiles/obj.clangCodeGen.dir/TargetBuiltins/SystemZ.cpp.o -c /home/gha/actions-runner/_work/llvm-project/llvm-project/clang/lib/CodeGen/TargetBuiltins/SystemZ.cpp
/home/gha/actions-runner/_work/llvm-project/llvm-project/clang/lib/CodeGen/TargetBuiltins/SystemZ.cpp:132:49: error: no member named 'experimental_constrained_sqrt' in namespace 'llvm::Intrinsic'; did you mean 'experimental_vp_strided_store'?
132 | Function *F = CGM.getIntrinsic(Intrinsic::experimental_constrained_sqrt, ResultType);
| ^~~~~~~~~~~~~~~~~~~~~~~~~~~~~
| experimental_vp_strided_store
/home/gha/actions-runner/_work/llvm-project/llvm-project/build/include/llvm/IR/IntrinsicEnums.inc:141:5: note: 'experimental_vp_strided_store' declared here
141 | experimental_vp_strided_store, // llvm.experimental.vp.strided.store (Intrinsics.td:1899)
| ^
/home/gha/actions-runner/_work/llvm-project/llvm-project/clang/lib/CodeGen/TargetBuiltins/SystemZ.cpp:133:22: error: no member named 'CreateConstrainedFPCall' in 'clang::CodeGen::CGBuilderTy'
133 | return Builder.CreateConstrainedFPCall(F, { X });
| ~~~~~~~ ^
/home/gha/actions-runner/_work/llvm-project/llvm-project/clang/lib/CodeGen/TargetBuiltins/SystemZ.cpp:146:49: error: no member named 'experimental_constrained_fma' in namespace 'llvm::Intrinsic'; did you mean 'experimental_vp_strided_load'?
146 | Function *F = CGM.getIntrinsic(Intrinsic::experimental_constrained_fma, ResultType);
| ^~~~~~~~~~~~~~~~~~~~~~~~~~~~
| experimental_vp_strided_load
/home/gha/actions-runner/_work/llvm-project/llvm-project/build/include/llvm/IR/IntrinsicEnums.inc:140:5: note: 'experimental_vp_strided_load' declared here
140 | experimental_vp_strided_load, // llvm.experimental.vp.strided.load (Intrinsics.td:1907)
| ^
/home/gha/actions-runner/_work/llvm-project/llvm-project/clang/lib/CodeGen/TargetBuiltins/SystemZ.cpp:147:22: error: no member named 'CreateConstrainedFPCall' in 'clang::CodeGen::CGBuilderTy'
147 | return Builder.CreateConstrainedFPCall(F, {X, Y, Z});
| ~~~~~~~ ^
/home/gha/actions-runner/_work/llvm-project/llvm-project/clang/lib/CodeGen/TargetBuiltins/SystemZ.cpp:160:49: error: no member named 'experimental_constrained_fma' in namespace 'llvm::Intrinsic'; did you mean 'experimental_vp_strided_load'?
160 | Function *F = CGM.getIntrinsic(Intrinsic::experimental_constrained_fma, ResultType);
| ^~~~~~~~~~~~~~~~~~~~~~~~~~~~
| experimental_vp_strided_load
/home/gha/actions-runner/_work/llvm-project/llvm-project/build/include/llvm/IR/IntrinsicEnums.inc:140:5: note: 'experimental_vp_strided_load' declared here
140 | experimental_vp_strided_load, // llvm.experimental.vp.strided.load (Intrinsics.td:1907)
| ^
/home/gha/actions-runner/_work/llvm-project/llvm-project/clang/lib/CodeGen/TargetBuiltins/SystemZ.cpp:161:22: error: no member named 'CreateConstrainedFPCall' in 'clang::CodeGen::CGBuilderTy'
161 | return Builder.CreateConstrainedFPCall(F, {X, Y, Builder.CreateFNeg(Z, "neg")});
| ~~~~~~~ ^
/home/gha/actions-runner/_work/llvm-project/llvm-project/clang/lib/CodeGen/TargetBuiltins/SystemZ.cpp:174:49: error: no member named 'experimental_constrained_fma' in namespace 'llvm::Intrinsic'; did you mean 'experimental_vp_strided_load'?
174 | Function *F = CGM.getIntrinsic(Intrinsic::experimental_constrained_fma, ResultType);
| ^~~~~~~~~~~~~~~~~~~~~~~~~~~~
| experimental_vp_strided_load
/home/gha/actions-runner/_work/llvm-project/llvm-project/build/include/llvm/IR/IntrinsicEnums.inc:140:5: note: 'experimental_vp_strided_load' declared here
140 | experimental_vp_strided_load, // llvm.experimental.vp.strided.load (Intrinsics.td:1907)
| ^
/home/gha/actions-runner/_work/llvm-project/llvm-project/clang/lib/CodeGen/TargetBuiltins/SystemZ.cpp:175:41: error: no member named 'CreateConstrainedFPCall' in 'clang::CodeGen::CGBuilderTy'
175 | return Builder.CreateFNeg(Builder.CreateConstrainedFPCall(F, {X, Y, Z}), "neg");
| ~~~~~~~ ^
/home/gha/actions-runner/_work/llvm-project/llvm-project/clang/lib/CodeGen/TargetBuiltins/SystemZ.cpp:188:49: error: no member named 'experimental_constrained_fma' in namespace 'llvm::Intrinsic'; did you mean 'experimental_vp_strided_load'?
188 | Function *F = CGM.getIntrinsic(Intrinsic::experimental_constrained_fma, ResultType);
| ^~~~~~~~~~~~~~~~~~~~~~~~~~~~
| experimental_vp_strided_load
/home/gha/actions-runner/_work/llvm-project/llvm-project/build/include/llvm/IR/IntrinsicEnums.inc:140:5: note: 'experimental_vp_strided_load' declared here
140 | experimental_vp_strided_load, // llvm.experimental.vp.strided.load (Intrinsics.td:1907)
| ^
/home/gha/actions-runner/_work/llvm-project/llvm-project/clang/lib/CodeGen/TargetBuiltins/SystemZ.cpp:190:41: error: no member named 'CreateConstrainedFPCall' in 'clang::CodeGen::CGBuilderTy'
190 | return Builder.CreateFNeg(Builder.CreateConstrainedFPCall(F, {X, Y, NegZ}));
| ~~~~~~~ ^
/home/gha/actions-runner/_work/llvm-project/llvm-project/clang/lib/CodeGen/TargetBuiltins/SystemZ.cpp:228:31: error: no member named 'experimental_constrained_rint' in namespace 'llvm::Intrinsic'
228 | CI = Intrinsic::experimental_constrained_rint; break;
| ^~~~~~~~~~~~~~~~~~~~~~~~~~~~~
/home/gha/actions-runner/_work/llvm-project/llvm-project/clang/lib/CodeGen/TargetBuiltins/SystemZ.cpp:235:31: error: no member named 'experimental_constrained_nearbyint' in namespace 'llvm::Intrinsic'
235 | CI = Intrinsic::experimental_constrained_nearbyint; break;
| ^~~~~~~~~~~~~~~~~~~~~~~~~~~~~~~~~~
/home/gha/actions-runner/_work/llvm-project/llvm-project/clang/lib/CodeGen/TargetBuiltins/SystemZ.cpp:237:31: error: no member named 'experimental_constrained_round' in namespace 'llvm::Intrinsic'; did you mean 'experimental_vp_strided_load'?
237 | CI = Intrinsic::experimental_constrained_round; break;
| ^~~~~~~~~~~~~~~~~~~~~~~~~~~~~~
| experimental_vp_strided_load
/home/gha/actions-runner/_work/llvm-project/llvm-project/build/include/llvm/IR/IntrinsicEnums.inc:140:5: note: 'experimental_vp_strided_load' declared here
140 | experimental_vp_strided_load, // llvm.experimental.vp.strided.load (Intrinsics.td:1907)
| ^
/home/gha/actions-runner/_work/llvm-project/llvm-project/clang/lib/CodeGen/TargetBuiltins/SystemZ.cpp:239:31: error: no member named 'experimental_constrained_roundeven' in namespace 'llvm::Intrinsic'
239 | CI = Intrinsic::experimental_constrained_roundeven; break;
| ^~~~~~~~~~~~~~~~~~~~~~~~~~~~~~~~~~
/home/gha/actions-runner/_work/llvm-project/llvm-project/clang/lib/CodeGen/TargetBuiltins/SystemZ.cpp:241:31: error: no member named 'experimental_constrained_trunc' in namespace 'llvm::Intrinsic'
241 | CI = Intrinsic::experimental_constrained_trunc; break;
| ^~~~~~~~~~~~~~~~~~~~~~~~~~~~~~
/home/gha/actions-runner/_work/llvm-project/llvm-project/clang/lib/CodeGen/TargetBuiltins/SystemZ.cpp:243:31: error: no member named 'experimental_constrained_ceil' in namespace 'llvm::Intrinsic'
243 | CI = Intrinsic::experimental_constrained_ceil; break;
| ^~~~~~~~~~~~~~~~~~~~~~~~~~~~~
/home/gha/actions-runner/_work/llvm-project/llvm-project/clang/lib/CodeGen/TargetBuiltins/SystemZ.cpp:245:31: error: no member named 'experimental_constrained_floor' in namespace 'llvm::Intrinsic'
245 | CI = Intrinsic::experimental_constrained_floor; break;
| ^~~~~~~~~~~~~~~~~~~~~~~~~~~~~~
/home/gha/actions-runner/_work/llvm-project/llvm-project/clang/lib/CodeGen/TargetBuiltins/SystemZ.cpp:252:24: error: no member named 'CreateConstrainedFPCall' in 'clang::CodeGen::CGBuilderTy'
252 | return Builder.CreateConstrainedFPCall(F, X);
| ~~~~~~~ ^
/home/gha/actions-runner/_work/llvm-project/llvm-project/clang/lib/CodeGen/TargetBuiltins/SystemZ.cpp:282:29: error: no member named 'experimental_constrained_maxnum' in namespace 'llvm::Intrinsic'
282 | CI = Intrinsic::experimental_constrained_maxnum; break;
| ^~~~~~~~~~~~~~~~~~~~~~~~~~~~~~~
fatal error: too many errors emitted, stopping now [-ferror-limit=]
20 errors generated.
```
</details>
<details>
<summary>tools/clang/lib/CodeGen/CMakeFiles/obj.clangCodeGen.dir/TargetBuiltins/AMDGPU.cpp.o</summary>
```
FAILED: tools/clang/lib/CodeGen/CMakeFiles/obj.clangCodeGen.dir/TargetBuiltins/AMDGPU.cpp.o
sccache /opt/llvm/bin/clang++ -DCLANG_EXPORTS -D_DEBUG -D_GLIBCXX_ASSERTIONS -D_GLIBCXX_USE_CXX11_ABI=1 -D_GNU_SOURCE -D_LIBCPP_HARDENING_MODE=_LIBCPP_HARDENING_MODE_EXTENSIVE -D__STDC_CONSTANT_MACROS -D__STDC_FORMAT_MACROS -D__STDC_LIMIT_MACROS -I/home/gha/actions-runner/_work/llvm-project/llvm-project/build/tools/clang/lib/CodeGen -I/home/gha/actions-runner/_work/llvm-project/llvm-project/clang/lib/CodeGen -I/home/gha/actions-runner/_work/llvm-project/llvm-project/clang/include -I/home/gha/actions-runner/_work/llvm-project/llvm-project/build/tools/clang/include -I/home/gha/actions-runner/_work/llvm-project/llvm-project/build/include -I/home/gha/actions-runner/_work/llvm-project/llvm-project/llvm/include -gmlt -fPIC -fno-semantic-interposition -fvisibility-inlines-hidden -Werror -Werror=date-time -Werror=unguarded-availability-new -Wall -Wextra -Wno-unused-parameter -Wwrite-strings -Wcast-qual -Wmissing-field-initializers -pedantic -Wno-long-long -Wc++98-compat-extra-semi -Wimplicit-fallthrough -Wcovered-switch-default -Wno-noexcept-type -Wnon-virtual-dtor -Wdelete-non-virtual-dtor -Wsuggest-override -Wstring-conversion -Wno-pass-failed -Wmisleading-indentation -Wctad-maybe-unsupported -fdiagnostics-color -ffunction-sections -fdata-sections -fno-common -Woverloaded-virtual -Wno-nested-anon-types -O3 -DNDEBUG -std=c++17 -UNDEBUG -fno-exceptions -funwind-tables -fno-rtti -MD -MT tools/clang/lib/CodeGen/CMakeFiles/obj.clangCodeGen.dir/TargetBuiltins/AMDGPU.cpp.o -MF tools/clang/lib/CodeGen/CMakeFiles/obj.clangCodeGen.dir/TargetBuiltins/AMDGPU.cpp.o.d -o tools/clang/lib/CodeGen/CMakeFiles/obj.clangCodeGen.dir/TargetBuiltins/AMDGPU.cpp.o -c /home/gha/actions-runner/_work/llvm-project/llvm-project/clang/lib/CodeGen/TargetBuiltins/AMDGPU.cpp
/home/gha/actions-runner/_work/llvm-project/llvm-project/clang/lib/CodeGen/TargetBuiltins/AMDGPU.cpp:46:24: error: no member named 'CreateConstrainedFPCall' in 'clang::CodeGen::CGBuilderTy'
46 | return CGF.Builder.CreateConstrainedFPCall(F, {Src0, Src1});
| ~~~~~~~~~~~ ^
/home/gha/actions-runner/_work/llvm-project/llvm-project/clang/lib/CodeGen/TargetBuiltins/AMDGPU.cpp:2204:48: error: no member named 'experimental_constrained_ldexp' in namespace 'llvm::Intrinsic'
2204 | *this, E, Intrinsic::ldexp, Intrinsic::experimental_constrained_ldexp);
| ^~~~~~~~~~~~~~~~~~~~~~~~~~~~~~
2 errors generated.
```
</details>
<details>
<summary>tools/clang/lib/CodeGen/CMakeFiles/obj.clangCodeGen.dir/TargetBuiltins/ARM.cpp.o</summary>
```
FAILED: tools/clang/lib/CodeGen/CMakeFiles/obj.clangCodeGen.dir/TargetBuiltins/ARM.cpp.o
sccache /opt/llvm/bin/clang++ -DCLANG_EXPORTS -D_DEBUG -D_GLIBCXX_ASSERTIONS -D_GLIBCXX_USE_CXX11_ABI=1 -D_GNU_SOURCE -D_LIBCPP_HARDENING_MODE=_LIBCPP_HARDENING_MODE_EXTENSIVE -D__STDC_CONSTANT_MACROS -D__STDC_FORMAT_MACROS -D__STDC_LIMIT_MACROS -I/home/gha/actions-runner/_work/llvm-project/llvm-project/build/tools/clang/lib/CodeGen -I/home/gha/actions-runner/_work/llvm-project/llvm-project/clang/lib/CodeGen -I/home/gha/actions-runner/_work/llvm-project/llvm-project/clang/include -I/home/gha/actions-runner/_work/llvm-project/llvm-project/build/tools/clang/include -I/home/gha/actions-runner/_work/llvm-project/llvm-project/build/include -I/home/gha/actions-runner/_work/llvm-project/llvm-project/llvm/include -gmlt -fPIC -fno-semantic-interposition -fvisibility-inlines-hidden -Werror -Werror=date-time -Werror=unguarded-availability-new -Wall -Wextra -Wno-unused-parameter -Wwrite-strings -Wcast-qual -Wmissing-field-initializers -pedantic -Wno-long-long -Wc++98-compat-extra-semi -Wimplicit-fallthrough -Wcovered-switch-default -Wno-noexcept-type -Wnon-virtual-dtor -Wdelete-non-virtual-dtor -Wsuggest-override -Wstring-conversion -Wno-pass-failed -Wmisleading-indentation -Wctad-maybe-unsupported -fdiagnostics-color -ffunction-sections -fdata-sections -fno-common -Woverloaded-virtual -Wno-nested-anon-types -O3 -DNDEBUG -std=c++17 -UNDEBUG -fno-exceptions -funwind-tables -fno-rtti -MD -MT tools/clang/lib/CodeGen/CMakeFiles/obj.clangCodeGen.dir/TargetBuiltins/ARM.cpp.o -MF tools/clang/lib/CodeGen/CMakeFiles/obj.clangCodeGen.dir/TargetBuiltins/ARM.cpp.o.d -o tools/clang/lib/CodeGen/CMakeFiles/obj.clangCodeGen.dir/TargetBuiltins/ARM.cpp.o -c /home/gha/actions-runner/_work/llvm-project/llvm-project/clang/lib/CodeGen/TargetBuiltins/ARM.cpp
/home/gha/actions-runner/_work/llvm-project/llvm-project/clang/lib/CodeGen/TargetBuiltins/ARM.cpp:356:24: error: no member named 'CreateConstrainedFPCall' in 'clang::CodeGen::CGBuilderTy'
356 | return CGF.Builder.CreateConstrainedFPCall(F, Args);
| ~~~~~~~~~~~ ^
/home/gha/actions-runner/_work/llvm-project/llvm-project/clang/lib/CodeGen/TargetBuiltins/ARM.cpp:443:20: error: no member named 'CreateConstrainedFPCall' in 'clang::CodeGen::CGBuilderTy'
443 | return Builder.CreateConstrainedFPCall(F, Ops, name);
| ~~~~~~~ ^
/home/gha/actions-runner/_work/llvm-project/llvm-project/clang/lib/CodeGen/TargetBuiltins/ARM.cpp:1465:43: error: no member named 'experimental_constrained_fma' in namespace 'llvm::Intrinsic'; did you mean 'experimental_vp_strided_load'?
1465 | *this, Intrinsic::fma, Intrinsic::experimental_constrained_fma, Ty,
| ^~~~~~~~~~~~~~~~~~~~~~~~~~~~
| experimental_vp_strided_load
/home/gha/actions-runner/_work/llvm-project/llvm-project/build/include/llvm/IR/IntrinsicEnums.inc:140:5: note: 'experimental_vp_strided_load' declared here
140 | experimental_vp_strided_load, // llvm.experimental.vp.strided.load (Intrinsics.td:1907)
| ^
/home/gha/actions-runner/_work/llvm-project/llvm-project/clang/lib/CodeGen/TargetBuiltins/ARM.cpp:1618:28: error: no member named 'experimental_constrained_nearbyint' in namespace 'llvm::Intrinsic'
1618 | ? Intrinsic::experimental_constrained_nearbyint
| ^~~~~~~~~~~~~~~~~~~~~~~~~~~~~~~~~~
/home/gha/actions-runner/_work/llvm-project/llvm-project/clang/lib/CodeGen/TargetBuiltins/ARM.cpp:5817:43: error: no member named 'experimental_constrained_fma' in namespace 'llvm::Intrinsic'; did you mean 'experimental_vp_strided_load'?
5817 | *this, Intrinsic::fma, Intrinsic::experimental_constrained_fma, HalfTy,
| ^~~~~~~~~~~~~~~~~~~~~~~~~~~~
| experimental_vp_strided_load
/home/gha/actions-runner/_work/llvm-project/llvm-project/build/include/llvm/IR/IntrinsicEnums.inc:140:5: note: 'experimental_vp_strided_load' declared here
140 | experimental_vp_strided_load, // llvm.experimental.vp.strided.load (Intrinsics.td:1907)
| ^
/home/gha/actions-runner/_work/llvm-project/llvm-project/clang/lib/CodeGen/TargetBuiltins/ARM.cpp:5824:43: error: no member named 'experimental_constrained_fma' in namespace 'llvm::Intrinsic'; did you mean 'experimental_vp_strided_load'?
5824 | *this, Intrinsic::fma, Intrinsic::experimental_constrained_fma, HalfTy,
| ^~~~~~~~~~~~~~~~~~~~~~~~~~~~
| experimental_vp_strided_load
/home/gha/actions-runner/_work/llvm-project/llvm-project/build/include/llvm/IR/IntrinsicEnums.inc:140:5: note: 'experimental_vp_strided_load' declared here
140 | experimental_vp_strided_load, // llvm.experimental.vp.strided.load (Intrinsics.td:1907)
| ^
/home/gha/actions-runner/_work/llvm-project/llvm-project/clang/lib/CodeGen/TargetBuiltins/ARM.cpp:6105:53: error: no member named 'experimental_constrained_fma' in namespace 'llvm::Intrinsic'; did you mean 'experimental_vp_strided_load'?
6105 | Int = Builder.getIsFPConstrained() ? Intrinsic::experimental_constrained_fma
| ^~~~~~~~~~~~~~~~~~~~~~~~~~~~
| experimental_vp_strided_load
/home/gha/actions-runner/_work/llvm-project/llvm-project/build/include/llvm/IR/IntrinsicEnums.inc:140:5: note: 'experimental_vp_strided_load' declared here
140 | experimental_vp_strided_load, // llvm.experimental.vp.strided.load (Intrinsics.td:1907)
| ^
/home/gha/actions-runner/_work/llvm-project/llvm-project/clang/lib/CodeGen/TargetBuiltins/ARM.cpp:6121:45: error: no member named 'experimental_constrained_fma' in namespace 'llvm::Intrinsic'; did you mean 'experimental_vp_strided_load'?
6121 | *this, Intrinsic::fma, Intrinsic::experimental_constrained_fma,
| ^~~~~~~~~~~~~~~~~~~~~~~~~~~~
| experimental_vp_strided_load
/home/gha/actions-runner/_work/llvm-project/llvm-project/build/include/llvm/IR/IntrinsicEnums.inc:140:5: note: 'experimental_vp_strided_load' declared here
140 | experimental_vp_strided_load, // llvm.experimental.vp.strided.load (Intrinsics.td:1907)
| ^
/home/gha/actions-runner/_work/llvm-project/llvm-project/clang/lib/CodeGen/TargetBuiltins/ARM.cpp:6136:43: error: no member named 'experimental_constrained_fma' in namespace 'llvm::Intrinsic'; did you mean 'experimental_vp_strided_load'?
6136 | *this, Intrinsic::fma, Intrinsic::experimental_constrained_fma, Ty,
| ^~~~~~~~~~~~~~~~~~~~~~~~~~~~
| experimental_vp_strided_load
/home/gha/actions-runner/_work/llvm-project/llvm-project/build/include/llvm/IR/IntrinsicEnums.inc:140:5: note: 'experimental_vp_strided_load' declared here
140 | experimental_vp_strided_load, // llvm.experimental.vp.strided.load (Intrinsics.td:1907)
| ^
/home/gha/actions-runner/_work/llvm-project/llvm-project/clang/lib/CodeGen/TargetBuiltins/ARM.cpp:6146:43: error: no member named 'experimental_constrained_fma' in namespace 'llvm::Intrinsic'; did you mean 'experimental_vp_strided_load'?
6146 | *this, Intrinsic::fma, Intrinsic::experimental_constrained_fma, Ty,
| ^~~~~~~~~~~~~~~~~~~~~~~~~~~~
| experimental_vp_strided_load
/home/gha/actions-runner/_work/llvm-project/llvm-project/build/include/llvm/IR/IntrinsicEnums.inc:140:5: note: 'experimental_vp_strided_load' declared here
140 | experimental_vp_strided_load, // llvm.experimental.vp.strided.load (Intrinsics.td:1907)
| ^
/home/gha/actions-runner/_work/llvm-project/llvm-project/clang/lib/CodeGen/TargetBuiltins/ARM.cpp:6158:43: error: no member named 'experimental_constrained_fma' in namespace 'llvm::Intrinsic'; did you mean 'experimental_vp_strided_load'?
6158 | *this, Intrinsic::fma, Intrinsic::experimental_constrained_fma, Ty,
| ^~~~~~~~~~~~~~~~~~~~~~~~~~~~
| experimental_vp_strided_load
/home/gha/actions-runner/_work/llvm-project/llvm-project/build/include/llvm/IR/IntrinsicEnums.inc:140:5: note: 'experimental_vp_strided_load' declared here
140 | experimental_vp_strided_load, // llvm.experimental.vp.strided.load (Intrinsics.td:1907)
| ^
/home/gha/actions-runner/_work/llvm-project/llvm-project/clang/lib/CodeGen/TargetBuiltins/ARM.cpp:6261:28: error: no member named 'experimental_constrained_round' in namespace 'llvm::Intrinsic'; did you mean 'experimental_vp_strided_load'?
6261 | ? Intrinsic::experimental_constrained_round
| ^~~~~~~~~~~~~~~~~~~~~~~~~~~~~~
| experimental_vp_strided_load
/home/gha/actions-runner/_work/llvm-project/llvm-project/build/include/llvm/IR/IntrinsicEnums.inc:140:5: note: 'experimental_vp_strided_load' declared here
140 | experimental_vp_strided_load, // llvm.experimental.vp.strided.load (Intrinsics.td:1907)
| ^
/home/gha/actions-runner/_work/llvm-project/llvm-project/clang/lib/CodeGen/TargetBuiltins/ARM.cpp:6268:28: error: no member named 'experimental_constrained_round' in namespace 'llvm::Intrinsic'; did you mean 'experimental_vp_strided_load'?
6268 | ? Intrinsic::experimental_constrained_round
| ^~~~~~~~~~~~~~~~~~~~~~~~~~~~~~
| experimental_vp_strided_load
/home/gha/actions-runner/_work/llvm-project/llvm-project/build/include/llvm/IR/IntrinsicEnums.inc:140:5: note: 'experimental_vp_strided_load' declared here
140 | experimental_vp_strided_load, // llvm.experimental.vp.strided.load (Intrinsics.td:1907)
| ^
/home/gha/actions-runner/_work/llvm-project/llvm-project/clang/lib/CodeGen/TargetBuiltins/ARM.cpp:6274:28: error: no member named 'experimental_constrained_nearbyint' in namespace 'llvm::Intrinsic'
6274 | ? Intrinsic::experimental_constrained_nearbyint
| ^~~~~~~~~~~~~~~~~~~~~~~~~~~~~~~~~~
/home/gha/actions-runner/_work/llvm-project/llvm-project/clang/lib/CodeGen/TargetBuiltins/ARM.cpp:6280:28: error: no member named 'experimental_constrained_floor' in namespace 'llvm::Intrinsic'
6280 | ? Intrinsic::experimental_constrained_floor
| ^~~~~~~~~~~~~~~~~~~~~~~~~~~~~~
/home/gha/actions-runner/_work/llvm-project/llvm-project/clang/lib/CodeGen/TargetBuiltins/ARM.cpp:6287:28: error: no member named 'experimental_constrained_floor' in namespace 'llvm::Intrinsic'
6287 | ? Intrinsic::experimental_constrained_floor
| ^~~~~~~~~~~~~~~~~~~~~~~~~~~~~~
/home/gha/actions-runner/_work/llvm-project/llvm-project/clang/lib/CodeGen/TargetBuiltins/ARM.cpp:6293:28: error: no member named 'experimental_constrained_roundeven' in namespace 'llvm::Intrinsic'
6293 | ? Intrinsic::experimental_constrained_roundeven
| ^~~~~~~~~~~~~~~~~~~~~~~~~~~~~~~~~~
/home/gha/actions-runner/_work/llvm-project/llvm-project/clang/lib/CodeGen/TargetBuiltins/ARM.cpp:6300:28: error: no member named 'experimental_constrained_roundeven' in namespace 'llvm::Intrinsic'
6300 | ? Intrinsic::experimental_constrained_roundeven
| ^~~~~~~~~~~~~~~~~~~~~~~~~~~~~~~~~~
/home/gha/actions-runner/_work/llvm-project/llvm-project/clang/lib/CodeGen/TargetBuiltins/ARM.cpp:6306:28: error: no member named 'experimental_constrained_roundeven' in namespace 'llvm::Intrinsic'
6306 | ? Intrinsic::experimental_constrained_roundeven
| ^~~~~~~~~~~~~~~~~~~~~~~~~~~~~~~~~~
fatal error: too many errors emitted, stopping now [-ferror-limit=]
20 errors generated.
```
</details>
<details>
<summary>tools/clang/lib/CodeGen/CMakeFiles/obj.clangCodeGen.dir/TargetBuiltins/X86.cpp.o</summary>
```
FAILED: tools/clang/lib/CodeGen/CMakeFiles/obj.clangCodeGen.dir/TargetBuiltins/X86.cpp.o
sccache /opt/llvm/bin/clang++ -DCLANG_EXPORTS -D_DEBUG -D_GLIBCXX_ASSERTIONS -D_GLIBCXX_USE_CXX11_ABI=1 -D_GNU_SOURCE -D_LIBCPP_HARDENING_MODE=_LIBCPP_HARDENING_MODE_EXTENSIVE -D__STDC_CONSTANT_MACROS -D__STDC_FORMAT_MACROS -D__STDC_LIMIT_MACROS -I/home/gha/actions-runner/_work/llvm-project/llvm-project/build/tools/clang/lib/CodeGen -I/home/gha/actions-runner/_work/llvm-project/llvm-project/clang/lib/CodeGen -I/home/gha/actions-runner/_work/llvm-project/llvm-project/clang/include -I/home/gha/actions-runner/_work/llvm-project/llvm-project/build/tools/clang/include -I/home/gha/actions-runner/_work/llvm-project/llvm-project/build/include -I/home/gha/actions-runner/_work/llvm-project/llvm-project/llvm/include -gmlt -fPIC -fno-semantic-interposition -fvisibility-inlines-hidden -Werror -Werror=date-time -Werror=unguarded-availability-new -Wall -Wextra -Wno-unused-parameter -Wwrite-strings -Wcast-qual -Wmissing-field-initializers -pedantic -Wno-long-long -Wc++98-compat-extra-semi -Wimplicit-fallthrough -Wcovered-switch-default -Wno-noexcept-type -Wnon-virtual-dtor -Wdelete-non-virtual-dtor -Wsuggest-override -Wstring-conversion -Wno-pass-failed -Wmisleading-indentation -Wctad-maybe-unsupported -fdiagnostics-color -ffunction-sections -fdata-sections -fno-common -Woverloaded-virtual -Wno-nested-anon-types -O3 -DNDEBUG -std=c++17 -UNDEBUG -fno-exceptions -funwind-tables -fno-rtti -MD -MT tools/clang/lib/CodeGen/CMakeFiles/obj.clangCodeGen.dir/TargetBuiltins/X86.cpp.o -MF tools/clang/lib/CodeGen/CMakeFiles/obj.clangCodeGen.dir/TargetBuiltins/X86.cpp.o.d -o tools/clang/lib/CodeGen/CMakeFiles/obj.clangCodeGen.dir/TargetBuiltins/X86.cpp.o -c /home/gha/actions-runner/_work/llvm-project/llvm-project/clang/lib/CodeGen/TargetBuiltins/X86.cpp
/home/gha/actions-runner/_work/llvm-project/llvm-project/clang/lib/CodeGen/TargetBuiltins/X86.cpp:94:23: error: no member named 'experimental_constrained_roundeven' in namespace 'llvm::Intrinsic'
94 | ID = Intrinsic::experimental_constrained_roundeven;
| ^~~~~~~~~~~~~~~~~~~~~~~~~~~~~~~~~~
/home/gha/actions-runner/_work/llvm-project/llvm-project/clang/lib/CodeGen/TargetBuiltins/X86.cpp:97:23: error: no member named 'experimental_constrained_floor' in namespace 'llvm::Intrinsic'
97 | ID = Intrinsic::experimental_constrained_floor;
| ^~~~~~~~~~~~~~~~~~~~~~~~~~~~~~
/home/gha/actions-runner/_work/llvm-project/llvm-project/clang/lib/CodeGen/TargetBuiltins/X86.cpp:100:23: error: no member named 'experimental_constrained_ceil' in namespace 'llvm::Intrinsic'; did you mean 'experimental_vp_strided_load'?
100 | ID = Intrinsic::experimental_constrained_ceil;
| ^~~~~~~~~~~~~~~~~~~~~~~~~~~~~
| experimental_vp_strided_load
/home/gha/actions-runner/_work/llvm-project/llvm-project/build/include/llvm/IR/IntrinsicEnums.inc:140:5: note: 'experimental_vp_strided_load' declared here
140 | experimental_vp_strided_load, // llvm.experimental.vp.strided.load (Intrinsics.td:1907)
| ^
/home/gha/actions-runner/_work/llvm-project/llvm-project/clang/lib/CodeGen/TargetBuiltins/X86.cpp:103:23: error: no member named 'experimental_constrained_trunc' in namespace 'llvm::Intrinsic'
103 | ID = Intrinsic::experimental_constrained_trunc;
| ^~~~~~~~~~~~~~~~~~~~~~~~~~~~~~
/home/gha/actions-runner/_work/llvm-project/llvm-project/clang/lib/CodeGen/TargetBuiltins/X86.cpp:454:45: error: no member named 'experimental_constrained_fma' in namespace 'llvm::Intrinsic'; did you mean 'experimental_vp_strided_load'?
454 | FMA = CGF.CGM.getIntrinsic(Intrinsic::experimental_constrained_fma, Ty);
| ^~~~~~~~~~~~~~~~~~~~~~~~~~~~
| experimental_vp_strided_load
/home/gha/actions-runner/_work/llvm-project/llvm-project/build/include/llvm/IR/IntrinsicEnums.inc:140:5: note: 'experimental_vp_strided_load' declared here
140 | experimental_vp_strided_load, // llvm.experimental.vp.strided.load (Intrinsics.td:1907)
| ^
/home/gha/actions-runner/_work/llvm-project/llvm-project/clang/lib/CodeGen/TargetBuiltins/X86.cpp:455:25: error: no member named 'CreateConstrainedFPCall' in 'clang::CodeGen::CGBuilderTy'
455 | Res = CGF.Builder.CreateConstrainedFPCall(FMA, {A, B, C});
| ~~~~~~~~~~~ ^
/home/gha/actions-runner/_work/llvm-project/llvm-project/clang/lib/CodeGen/TargetBuiltins/X86.cpp:539:20: error: no member named 'experimental_constrained_fma' in namespace 'llvm::Intrinsic'; did you mean 'experimental_vp_strided_load'?
539 | Intrinsic::experimental_constrained_fma, Ops[0]->getType());
| ^~~~~~~~~~~~~~~~~~~~~~~~~~~~
| experimental_vp_strided_load
/home/gha/actions-runner/_work/llvm-project/llvm-project/build/include/llvm/IR/IntrinsicEnums.inc:140:5: note: 'experimental_vp_strided_load' declared here
140 | experimental_vp_strided_load, // llvm.experimental.vp.strided.load (Intrinsics.td:1907)
| ^
/home/gha/actions-runner/_work/llvm-project/llvm-project/clang/lib/CodeGen/TargetBuiltins/X86.cpp:540:23: error: no member named 'CreateConstrainedFPCall' in 'clang::CodeGen::CGBuilderTy'
540 | Res = CGF.Builder.CreateConstrainedFPCall(FMA, Ops.slice(0, 3));
| ~~~~~~~~~~~ ^
/home/gha/actions-runner/_work/llvm-project/llvm-project/clang/lib/CodeGen/TargetBuiltins/X86.cpp:2328:39: error: no member named 'experimental_constrained_sqrt' in namespace 'llvm::Intrinsic'; did you mean 'experimental_vp_strided_store'?
2328 | F = CGM.getIntrinsic(Intrinsic::experimental_constrained_sqrt,
| ^~~~~~~~~~~~~~~~~~~~~~~~~~~~~
| experimental_vp_strided_store
/home/gha/actions-runner/_work/llvm-project/llvm-project/build/include/llvm/IR/IntrinsicEnums.inc:141:5: note: 'experimental_vp_strided_store' declared here
141 | experimental_vp_strided_store, // llvm.experimental.vp.strided.store (Intrinsics.td:1899)
| ^
/home/gha/actions-runner/_work/llvm-project/llvm-project/clang/lib/CodeGen/TargetBuiltins/X86.cpp:2330:19: error: no member named 'CreateConstrainedFPCall' in 'clang::CodeGen::CGBuilderTy'
2330 | A = Builder.CreateConstrainedFPCall(F, A);
| ~~~~~~~ ^
/home/gha/actions-runner/_work/llvm-project/llvm-project/clang/lib/CodeGen/TargetBuiltins/X86.cpp:2365:49: error: no member named 'experimental_constrained_sqrt' in namespace 'llvm::Intrinsic'; did you mean 'experimental_vp_strided_store'?
2365 | Function *F = CGM.getIntrinsic(Intrinsic::experimental_constrained_sqrt,
| ^~~~~~~~~~~~~~~~~~~~~~~~~~~~~
| experimental_vp_strided_store
/home/gha/actions-runner/_work/llvm-project/llvm-project/build/include/llvm/IR/IntrinsicEnums.inc:141:5: note: 'experimental_vp_strided_store' declared here
141 | experimental_vp_strided_store, // llvm.experimental.vp.strided.store (Intrinsics.td:1899)
| ^
/home/gha/actions-runner/_work/llvm-project/llvm-project/clang/lib/CodeGen/TargetBuiltins/X86.cpp:2367:22: error: no member named 'CreateConstrainedFPCall' in 'clang::CodeGen::CGBuilderTy'
2367 | return Builder.CreateConstrainedFPCall(F, Ops[0]);
| ~~~~~~~ ^
12 errors generated.
```
</details>
<details>
<summary>tools/clang/lib/CodeGen/CMakeFiles/obj.clangCodeGen.dir/TargetBuiltins/PPC.cpp.o</summary>
```
FAILED: tools/clang/lib/CodeGen/CMakeFiles/obj.clangCodeGen.dir/TargetBuiltins/PPC.cpp.o
sccache /opt/llvm/bin/clang++ -DCLANG_EXPORTS -D_DEBUG -D_GLIBCXX_ASSERTIONS -D_GLIBCXX_USE_CXX11_ABI=1 -D_GNU_SOURCE -D_LIBCPP_HARDENING_MODE=_LIBCPP_HARDENING_MODE_EXTENSIVE -D__STDC_CONSTANT_MACROS -D__STDC_FORMAT_MACROS -D__STDC_LIMIT_MACROS -I/home/gha/actions-runner/_work/llvm-project/llvm-project/build/tools/clang/lib/CodeGen -I/home/gha/actions-runner/_work/llvm-project/llvm-project/clang/lib/CodeGen -I/home/gha/actions-runner/_work/llvm-project/llvm-project/clang/include -I/home/gha/actions-runner/_work/llvm-project/llvm-project/build/tools/clang/include -I/home/gha/actions-runner/_work/llvm-project/llvm-project/build/include -I/home/gha/actions-runner/_work/llvm-project/llvm-project/llvm/include -gmlt -fPIC -fno-semantic-interposition -fvisibility-inlines-hidden -Werror -Werror=date-time -Werror=unguarded-availability-new -Wall -Wextra -Wno-unused-parameter -Wwrite-strings -Wcast-qual -Wmissing-field-initializers -pedantic -Wno-long-long -Wc++98-compat-extra-semi -Wimplicit-fallthrough -Wcovered-switch-default -Wno-noexcept-type -Wnon-virtual-dtor -Wdelete-non-virtual-dtor -Wsuggest-override -Wstring-conversion -Wno-pass-failed -Wmisleading-indentation -Wctad-maybe-unsupported -fdiagnostics-color -ffunction-sections -fdata-sections -fno-common -Woverloaded-virtual -Wno-nested-anon-types -O3 -DNDEBUG -std=c++17 -UNDEBUG -fno-exceptions -funwind-tables -fno-rtti -MD -MT tools/clang/lib/CodeGen/CMakeFiles/obj.clangCodeGen.dir/TargetBuiltins/PPC.cpp.o -MF tools/clang/lib/CodeGen/CMakeFiles/obj.clangCodeGen.dir/TargetBuiltins/PPC.cpp.o.d -o tools/clang/lib/CodeGen/CMakeFiles/obj.clangCodeGen.dir/TargetBuiltins/PPC.cpp.o -c /home/gha/actions-runner/_work/llvm-project/llvm-project/clang/lib/CodeGen/TargetBuiltins/PPC.cpp
/home/gha/actions-runner/_work/llvm-project/llvm-project/clang/lib/CodeGen/TargetBuiltins/PPC.cpp:512:22: error: no member named 'experimental_constrained_sqrt' in namespace 'llvm::Intrinsic'; did you mean 'experimental_vp_strided_store'?
512 | Intrinsic::experimental_constrained_sqrt, ResultType);
| ^~~~~~~~~~~~~~~~~~~~~~~~~~~~~
| experimental_vp_strided_store
/home/gha/actions-runner/_work/llvm-project/llvm-project/build/include/llvm/IR/IntrinsicEnums.inc:141:5: note: 'experimental_vp_strided_store' declared here
141 | experimental_vp_strided_store, // llvm.experimental.vp.strided.store (Intrinsics.td:1899)
| ^
/home/gha/actions-runner/_work/llvm-project/llvm-project/clang/lib/CodeGen/TargetBuiltins/PPC.cpp:513:22: error: no member named 'CreateConstrainedFPCall' in 'clang::CodeGen::CGBuilderTy'
513 | return Builder.CreateConstrainedFPCall(F, X);
| ~~~~~~~ ^
/home/gha/actions-runner/_work/llvm-project/llvm-project/clang/lib/CodeGen/TargetBuiltins/PPC.cpp:764:29: error: no member named 'experimental_constrained_floor' in namespace 'llvm::Intrinsic'
764 | ? Intrinsic::experimental_constrained_floor
| ^~~~~~~~~~~~~~~~~~~~~~~~~~~~~~
/home/gha/actions-runner/_work/llvm-project/llvm-project/clang/lib/CodeGen/TargetBuiltins/PPC.cpp:769:29: error: no member named 'experimental_constrained_round' in namespace 'llvm::Intrinsic'; did you mean 'experimental_vp_strided_load'?
769 | ? Intrinsic::experimental_constrained_round
| ^~~~~~~~~~~~~~~~~~~~~~~~~~~~~~
| experimental_vp_strided_load
/home/gha/actions-runner/_work/llvm-project/llvm-project/build/include/llvm/IR/IntrinsicEnums.inc:140:5: note: 'experimental_vp_strided_load' declared here
140 | experimental_vp_strided_load, // llvm.experimental.vp.strided.load (Intrinsics.td:1907)
| ^
/home/gha/actions-runner/_work/llvm-project/llvm-project/clang/lib/CodeGen/TargetBuiltins/PPC.cpp:774:29: error: no member named 'experimental_constrained_rint' in namespace 'llvm::Intrinsic'
774 | ? Intrinsic::experimental_constrained_rint
| ^~~~~~~~~~~~~~~~~~~~~~~~~~~~~
/home/gha/actions-runner/_work/llvm-project/llvm-project/clang/lib/CodeGen/TargetBuiltins/PPC.cpp:779:29: error: no member named 'experimental_constrained_ceil' in namespace 'llvm::Intrinsic'; did you mean 'experimental_vp_strided_load'?
779 | ? Intrinsic::experimental_constrained_ceil
| ^~~~~~~~~~~~~~~~~~~~~~~~~~~~~
| experimental_vp_strided_load
/home/gha/actions-runner/_work/llvm-project/llvm-project/build/include/llvm/IR/IntrinsicEnums.inc:140:5: note: 'experimental_vp_strided_load' declared here
140 | experimental_vp_strided_load, // llvm.experimental.vp.strided.load (Intrinsics.td:1907)
| ^
/home/gha/actions-runner/_work/llvm-project/llvm-project/clang/lib/CodeGen/TargetBuiltins/PPC.cpp:784:29: error: no member named 'experimental_constrained_trunc' in namespace 'llvm::Intrinsic'
784 | ? Intrinsic::experimental_constrained_trunc
| ^~~~~~~~~~~~~~~~~~~~~~~~~~~~~~
/home/gha/actions-runner/_work/llvm-project/llvm-project/clang/lib/CodeGen/TargetBuiltins/PPC.cpp:787:51: error: no member named 'CreateConstrainedFPCall' in 'clang::CodeGen::CGBuilderTy'
787 | return Builder.getIsFPConstrained() ? Builder.CreateConstrainedFPCall(F, X)
| ~~~~~~~ ^
/home/gha/actions-runner/_work/llvm-project/llvm-project/clang/lib/CodeGen/TargetBuiltins/PPC.cpp:869:39: error: no member named 'experimental_constrained_fma' in namespace 'llvm::Intrinsic'; did you mean 'experimental_vp_strided_load'?
869 | F = CGM.getIntrinsic(Intrinsic::experimental_constrained_fma, ResultType);
| ^~~~~~~~~~~~~~~~~~~~~~~~~~~~
| experimental_vp_strided_load
/home/gha/actions-runner/_work/llvm-project/llvm-project/build/include/llvm/IR/IntrinsicEnums.inc:140:5: note: 'experimental_vp_strided_load' declared here
140 | experimental_vp_strided_load, // llvm.experimental.vp.strided.load (Intrinsics.td:1907)
| ^
/home/gha/actions-runner/_work/llvm-project/llvm-project/clang/lib/CodeGen/TargetBuiltins/PPC.cpp:876:26: error: no member named 'CreateConstrainedFPCall' in 'clang::CodeGen::CGBuilderTy'
876 | return Builder.CreateConstrainedFPCall(F, {X, Y, Z});
| ~~~~~~~ ^
/home/gha/actions-runner/_work/llvm-project/llvm-project/clang/lib/CodeGen/TargetBuiltins/PPC.cpp:883:23: error: no member named 'CreateConstrainedFPCall' in 'clang::CodeGen::CGBuilderTy'
883 | Builder.CreateConstrainedFPCall(F, {X, Y, Z}), "neg");
| ~~~~~~~ ^
/home/gha/actions-runner/_work/llvm-project/llvm-project/clang/lib/CodeGen/TargetBuiltins/PPC.cpp:889:26: error: no member named 'CreateConstrainedFPCall' in 'clang::CodeGen::CGBuilderTy'
889 | return Builder.CreateConstrainedFPCall(
| ~~~~~~~ ^
/home/gha/actions-runner/_work/llvm-project/llvm-project/clang/lib/CodeGen/TargetBuiltins/PPC.cpp:899:23: error: no member named 'CreateConstrainedFPCall' in 'clang::CodeGen::CGBuilderTy'
899 | Builder.CreateConstrainedFPCall(
| ~~~~~~~ ^
/home/gha/actions-runner/_work/llvm-project/llvm-project/clang/lib/CodeGen/TargetBuiltins/PPC.cpp:1273:39: error: no member named 'experimental_constrained_rint' in namespace 'llvm::Intrinsic'
1273 | Intrinsic::experimental_constrained_rint))
| ^~~~~~~~~~~~~~~~~~~~~~~~~~~~~
/home/gha/actions-runner/_work/llvm-project/llvm-project/clang/lib/CodeGen/TargetBuiltins/PPC.cpp:1279:39: error: no member named 'experimental_constrained_floor' in namespace 'llvm::Intrinsic'
1279 | Intrinsic::experimental_constrained_floor))
| ^~~~~~~~~~~~~~~~~~~~~~~~~~~~~~
/home/gha/actions-runner/_work/llvm-project/llvm-project/clang/lib/CodeGen/TargetBuiltins/PPC.cpp:1285:39: error: no member named 'experimental_constrained_round' in namespace 'llvm::Intrinsic'; did you mean 'experimental_vp_strided_load'?
1285 | Intrinsic::experimental_constrained_round))
| ^~~~~~~~~~~~~~~~~~~~~~~~~~~~~~
| experimental_vp_strided_load
/home/gha/actions-runner/_work/llvm-project/llvm-project/build/include/llvm/IR/IntrinsicEnums.inc:140:5: note: 'experimental_vp_strided_load' declared here
140 | experimental_vp_strided_load, // llvm.experimental.vp.strided.load (Intrinsics.td:1907)
| ^
/home/gha/actions-runner/_work/llvm-project/llvm-project/clang/lib/CodeGen/TargetBuiltins/PPC.cpp:1291:39: error: no member named 'experimental_constrained_ceil' in namespace 'llvm::Intrinsic'; did you mean 'experimental_vp_strided_load'?
1291 | Intrinsic::experimental_constrained_ceil))
| ^~~~~~~~~~~~~~~~~~~~~~~~~~~~~
| experimental_vp_strided_load
/home/gha/actions-runner/_work/llvm-project/llvm-project/build/include/llvm/IR/IntrinsicEnums.inc:140:5: note: 'experimental_vp_strided_load' declared here
140 | experimental_vp_strided_load, // llvm.experimental.vp.strided.load (Intrinsics.td:1907)
| ^
/home/gha/actions-runner/_work/llvm-project/llvm-project/clang/lib/CodeGen/TargetBuiltins/PPC.cpp:1297:39: error: no member named 'experimental_constrained_trunc' in namespace 'llvm::Intrinsic'
1297 | Intrinsic::experimental_constrained_trunc))
| ^~~~~~~~~~~~~~~~~~~~~~~~~~~~~~
/home/gha/actions-runner/_work/llvm-project/llvm-project/clang/lib/CodeGen/TargetBuiltins/PPC.cpp:1303:39: error: no member named 'experimental_constrained_sqrt' in namespace 'llvm::Intrinsic'; did you mean 'experimental_vp_strided_store'?
1303 | Intrinsic::experimental_constrained_sqrt))
| ^~~~~~~~~~~~~~~~~~~~~~~~~~~~~
| experimental_vp_strided_store
/home/gha/actions-runner/_work/llvm-project/llvm-project/build/include/llvm/IR/IntrinsicEnums.inc:141:5: note: 'experimental_vp_strided_store' declared here
141 | experimental_vp_strided_store, // llvm.experimental.vp.strided.store (Intrinsics.td:1899)
| ^
19 errors generated.
```
</details>
If these failures are unrelated to your changes (for example tests are broken or flaky at HEAD), please open an issue at https://github.com/llvm/llvm-project/issues and add the `infrastructure` label.
https://github.com/llvm/llvm-project/pull/191614
More information about the llvm-commits
mailing list