[llvm] calling conv (PR #187135)
via llvm-commits
llvm-commits at lists.llvm.org
Mon Apr 6 07:49:03 PDT 2026
github-actions[bot] wrote:
<!--PREMERGE ADVISOR COMMENT: Windows-->
# :window: Windows x64 Test Results
The build failed before running any tests. Click on a failure below to see the details.
<details>
<summary>[code=1] lib/Target/AMDGPU/AMDGPUGenDisassemblerTables.inc C:/_work/llvm-project/llvm-project/build/lib/Target/AMDGPU/AMDGPUGenDisassemblerTables.inc</summary>
```
FAILED: [code=1] lib/Target/AMDGPU/AMDGPUGenDisassemblerTables.inc C:/_work/llvm-project/llvm-project/build/lib/Target/AMDGPU/AMDGPUGenDisassemblerTables.inc
C:\Windows\system32\cmd.exe /C "cd /D C:\_work\llvm-project\llvm-project\build\lib\Target\AMDGPU && C:\_work\llvm-project\llvm-project\build\bin\llvm-tblgen.exe -gen-disassembler --specialize-decoders-per-bitwidth -ignore-non-decodable-operands -ignore-fully-defined-operands -IC:/_work/llvm-project/llvm-project/llvm/lib/Target/AMDGPU -IC:/_work/llvm-project/llvm-project/build/include -IC:/_work/llvm-project/llvm-project/llvm/include -I C:/_work/llvm-project/llvm-project/llvm/lib/Target --long-string-literals=0 C:/_work/llvm-project/llvm-project/llvm/lib/Target/AMDGPU/AMDGPU.td --write-if-changed -o AMDGPUGenDisassemblerTables.inc -d AMDGPUGenDisassemblerTables.inc.d && C:\BuildTools\Common7\IDE\CommonExtensions\Microsoft\CMake\CMake\bin\cmake.exe -E cmake_transform_depfile Ninja gccdepfile C:/_work/llvm-project/llvm-project/llvm C:/_work/llvm-project/llvm-project/llvm/lib/Target/AMDGPU C:/_work/llvm-project/llvm-project/build C:/_work/llvm-project/llvm-project/build/lib/Target/AMDGPU C:/_work/llvm-project/llvm-project/build/lib/Target/AMDGPU/AMDGPUGenDisassemblerTables.inc.d C:/_work/llvm-project/llvm-project/build/CMakeFiles/d/7f45bd9e7a999c6d665a40e6c22778ba4895974121d486a222081f2738cf076e.d"
Included from C:/_work/llvm-project/llvm-project/llvm/lib/Target/AMDGPU/AMDGPU.td:2773:
C:/_work/llvm-project/llvm-project/llvm/lib/Target/AMDGPU\AMDGPUCallingConv.td:66:3: error: expected ']' at end of list value
CCIfTrue16<CCIfType<[i16, f16, bf16], CCAssignToReg<
^
```
</details>
<details>
<summary>[code=1] lib/Target/AMDGPU/AMDGPUGenRegisterInfo.inc lib/Target/AMDGPU/AMDGPUGenRegisterInfoEnums.inc lib/Target/AMDGPU/AMDGPUGenRegisterInfoHeader.inc lib/Target/AMDGPU/AMDGPUGenRegisterInfoMCDesc.inc lib/Target/AMDGPU/AMDGPUGenRegisterInfoTargetDesc.inc C:/_work/llvm-project/llvm-project/build/lib/Target/AMDGPU/AMDGPUGenRegisterInfo.inc C:/_work/llvm-project/llvm-project/build/lib/Target/AMDGPU/AMDGPUGenRegisterInfoEnums.inc C:/_work/llvm-project/llvm-project/build/lib/Target/AMDGPU/AMDGPUGenRegisterInfoHeader.inc C:/_work/llvm-project/llvm-project/build/lib/Target/AMDGPU/AMDGPUGenRegisterInfoMCDesc.inc C:/_work/llvm-project/llvm-project/build/lib/Target/AMDGPU/AMDGPUGenRegisterInfoTargetDesc.inc</summary>
```
FAILED: [code=1] lib/Target/AMDGPU/AMDGPUGenRegisterInfo.inc lib/Target/AMDGPU/AMDGPUGenRegisterInfoEnums.inc lib/Target/AMDGPU/AMDGPUGenRegisterInfoHeader.inc lib/Target/AMDGPU/AMDGPUGenRegisterInfoMCDesc.inc lib/Target/AMDGPU/AMDGPUGenRegisterInfoTargetDesc.inc C:/_work/llvm-project/llvm-project/build/lib/Target/AMDGPU/AMDGPUGenRegisterInfo.inc C:/_work/llvm-project/llvm-project/build/lib/Target/AMDGPU/AMDGPUGenRegisterInfoEnums.inc C:/_work/llvm-project/llvm-project/build/lib/Target/AMDGPU/AMDGPUGenRegisterInfoHeader.inc C:/_work/llvm-project/llvm-project/build/lib/Target/AMDGPU/AMDGPUGenRegisterInfoMCDesc.inc C:/_work/llvm-project/llvm-project/build/lib/Target/AMDGPU/AMDGPUGenRegisterInfoTargetDesc.inc
C:\Windows\system32\cmd.exe /C "cd /D C:\_work\llvm-project\llvm-project\build\lib\Target\AMDGPU && C:\_work\llvm-project\llvm-project\build\bin\llvm-tblgen.exe -gen-register-info -IC:/_work/llvm-project/llvm-project/llvm/lib/Target/AMDGPU -IC:/_work/llvm-project/llvm-project/build/include -IC:/_work/llvm-project/llvm-project/llvm/include -I C:/_work/llvm-project/llvm-project/llvm/lib/Target --long-string-literals=0 C:/_work/llvm-project/llvm-project/llvm/lib/Target/AMDGPU/AMDGPU.td --write-if-changed -o AMDGPUGenRegisterInfo.inc -d AMDGPUGenRegisterInfo.inc.d && C:\BuildTools\Common7\IDE\CommonExtensions\Microsoft\CMake\CMake\bin\cmake.exe -E cmake_transform_depfile Ninja gccdepfile C:/_work/llvm-project/llvm-project/llvm C:/_work/llvm-project/llvm-project/llvm/lib/Target/AMDGPU C:/_work/llvm-project/llvm-project/build C:/_work/llvm-project/llvm-project/build/lib/Target/AMDGPU C:/_work/llvm-project/llvm-project/build/lib/Target/AMDGPU/AMDGPUGenRegisterInfo.inc.d C:/_work/llvm-project/llvm-project/build/CMakeFiles/d/9d42339ff624dfb4e9f9c1b8a0b548ad0547af70d4e2f37d3ee85c4c30172f12.d"
Included from C:/_work/llvm-project/llvm-project/llvm/lib/Target/AMDGPU/AMDGPU.td:2773:
C:/_work/llvm-project/llvm-project/llvm/lib/Target/AMDGPU\AMDGPUCallingConv.td:66:3: error: expected ']' at end of list value
CCIfTrue16<CCIfType<[i16, f16, bf16], CCAssignToReg<
^
```
</details>
<details>
<summary>[code=1] lib/Target/AMDGPU/AMDGPUGenPreLegalizeGICombiner.inc C:/_work/llvm-project/llvm-project/build/lib/Target/AMDGPU/AMDGPUGenPreLegalizeGICombiner.inc</summary>
```
FAILED: [code=1] lib/Target/AMDGPU/AMDGPUGenPreLegalizeGICombiner.inc C:/_work/llvm-project/llvm-project/build/lib/Target/AMDGPU/AMDGPUGenPreLegalizeGICombiner.inc
C:\Windows\system32\cmd.exe /C "cd /D C:\_work\llvm-project\llvm-project\build\lib\Target\AMDGPU && C:\_work\llvm-project\llvm-project\build\bin\llvm-tblgen.exe -gen-global-isel-combiner -combiners="AMDGPUPreLegalizerCombiner" -IC:/_work/llvm-project/llvm-project/llvm/lib/Target/AMDGPU -IC:/_work/llvm-project/llvm-project/build/include -IC:/_work/llvm-project/llvm-project/llvm/include -I C:/_work/llvm-project/llvm-project/llvm/lib/Target --long-string-literals=0 C:/_work/llvm-project/llvm-project/llvm/lib/Target/AMDGPU/AMDGPUGISel.td --write-if-changed -o AMDGPUGenPreLegalizeGICombiner.inc -d AMDGPUGenPreLegalizeGICombiner.inc.d && C:\BuildTools\Common7\IDE\CommonExtensions\Microsoft\CMake\CMake\bin\cmake.exe -E cmake_transform_depfile Ninja gccdepfile C:/_work/llvm-project/llvm-project/llvm C:/_work/llvm-project/llvm-project/llvm/lib/Target/AMDGPU C:/_work/llvm-project/llvm-project/build C:/_work/llvm-project/llvm-project/build/lib/Target/AMDGPU C:/_work/llvm-project/llvm-project/build/lib/Target/AMDGPU/AMDGPUGenPreLegalizeGICombiner.inc.d C:/_work/llvm-project/llvm-project/build/CMakeFiles/d/465d5ba12d5c0f2b5d181cc4843fbede1faebf770ac1656c30a47a138ea4cf42.d"
Included from C:/_work/llvm-project/llvm-project/llvm/lib/Target/AMDGPU/AMDGPUGISel.td:13:
Included from C:/_work/llvm-project/llvm-project/llvm/lib/Target/AMDGPU\AMDGPU.td:2773:
C:/_work/llvm-project/llvm-project/llvm/lib/Target/AMDGPU\AMDGPUCallingConv.td:66:3: error: expected ']' at end of list value
CCIfTrue16<CCIfType<[i16, f16, bf16], CCAssignToReg<
^
```
</details>
<details>
<summary>[code=1] lib/Target/AMDGPU/AMDGPUGenCallingConv.inc C:/_work/llvm-project/llvm-project/build/lib/Target/AMDGPU/AMDGPUGenCallingConv.inc</summary>
```
FAILED: [code=1] lib/Target/AMDGPU/AMDGPUGenCallingConv.inc C:/_work/llvm-project/llvm-project/build/lib/Target/AMDGPU/AMDGPUGenCallingConv.inc
C:\Windows\system32\cmd.exe /C "cd /D C:\_work\llvm-project\llvm-project\build\lib\Target\AMDGPU && C:\_work\llvm-project\llvm-project\build\bin\llvm-tblgen.exe -gen-callingconv -IC:/_work/llvm-project/llvm-project/llvm/lib/Target/AMDGPU -IC:/_work/llvm-project/llvm-project/build/include -IC:/_work/llvm-project/llvm-project/llvm/include -I C:/_work/llvm-project/llvm-project/llvm/lib/Target --long-string-literals=0 C:/_work/llvm-project/llvm-project/llvm/lib/Target/AMDGPU/AMDGPU.td --write-if-changed -o AMDGPUGenCallingConv.inc -d AMDGPUGenCallingConv.inc.d && C:\BuildTools\Common7\IDE\CommonExtensions\Microsoft\CMake\CMake\bin\cmake.exe -E cmake_transform_depfile Ninja gccdepfile C:/_work/llvm-project/llvm-project/llvm C:/_work/llvm-project/llvm-project/llvm/lib/Target/AMDGPU C:/_work/llvm-project/llvm-project/build C:/_work/llvm-project/llvm-project/build/lib/Target/AMDGPU C:/_work/llvm-project/llvm-project/build/lib/Target/AMDGPU/AMDGPUGenCallingConv.inc.d C:/_work/llvm-project/llvm-project/build/CMakeFiles/d/658a2ac917b3e83c82fe5c48a77447daa9797cbadc72a97340daa8ad6fa76817.d"
Included from C:/_work/llvm-project/llvm-project/llvm/lib/Target/AMDGPU/AMDGPU.td:2773:
C:/_work/llvm-project/llvm-project/llvm/lib/Target/AMDGPU\AMDGPUCallingConv.td:66:3: error: expected ']' at end of list value
CCIfTrue16<CCIfType<[i16, f16, bf16], CCAssignToReg<
^
```
</details>
<details>
<summary>[code=1] lib/Target/AMDGPU/AMDGPUGenRegBankGICombiner.inc C:/_work/llvm-project/llvm-project/build/lib/Target/AMDGPU/AMDGPUGenRegBankGICombiner.inc</summary>
```
FAILED: [code=1] lib/Target/AMDGPU/AMDGPUGenRegBankGICombiner.inc C:/_work/llvm-project/llvm-project/build/lib/Target/AMDGPU/AMDGPUGenRegBankGICombiner.inc
C:\Windows\system32\cmd.exe /C "cd /D C:\_work\llvm-project\llvm-project\build\lib\Target\AMDGPU && C:\_work\llvm-project\llvm-project\build\bin\llvm-tblgen.exe -gen-global-isel-combiner -combiners="AMDGPURegBankCombiner" -IC:/_work/llvm-project/llvm-project/llvm/lib/Target/AMDGPU -IC:/_work/llvm-project/llvm-project/build/include -IC:/_work/llvm-project/llvm-project/llvm/include -I C:/_work/llvm-project/llvm-project/llvm/lib/Target --long-string-literals=0 C:/_work/llvm-project/llvm-project/llvm/lib/Target/AMDGPU/AMDGPUGISel.td --write-if-changed -o AMDGPUGenRegBankGICombiner.inc -d AMDGPUGenRegBankGICombiner.inc.d && C:\BuildTools\Common7\IDE\CommonExtensions\Microsoft\CMake\CMake\bin\cmake.exe -E cmake_transform_depfile Ninja gccdepfile C:/_work/llvm-project/llvm-project/llvm C:/_work/llvm-project/llvm-project/llvm/lib/Target/AMDGPU C:/_work/llvm-project/llvm-project/build C:/_work/llvm-project/llvm-project/build/lib/Target/AMDGPU C:/_work/llvm-project/llvm-project/build/lib/Target/AMDGPU/AMDGPUGenRegBankGICombiner.inc.d C:/_work/llvm-project/llvm-project/build/CMakeFiles/d/793a77d6d1e4f0a9c4cdb51559af58ae7af8eb7e5376af38c5aab69e18246960.d"
Included from C:/_work/llvm-project/llvm-project/llvm/lib/Target/AMDGPU/AMDGPUGISel.td:13:
Included from C:/_work/llvm-project/llvm-project/llvm/lib/Target/AMDGPU\AMDGPU.td:2773:
C:/_work/llvm-project/llvm-project/llvm/lib/Target/AMDGPU\AMDGPUCallingConv.td:66:3: error: expected ']' at end of list value
CCIfTrue16<CCIfType<[i16, f16, bf16], CCAssignToReg<
^
```
</details>
<details>
<summary>[code=1] lib/Target/AMDGPU/AMDGPUGenMCCodeEmitter.inc C:/_work/llvm-project/llvm-project/build/lib/Target/AMDGPU/AMDGPUGenMCCodeEmitter.inc</summary>
```
FAILED: [code=1] lib/Target/AMDGPU/AMDGPUGenMCCodeEmitter.inc C:/_work/llvm-project/llvm-project/build/lib/Target/AMDGPU/AMDGPUGenMCCodeEmitter.inc
C:\Windows\system32\cmd.exe /C "cd /D C:\_work\llvm-project\llvm-project\build\lib\Target\AMDGPU && C:\_work\llvm-project\llvm-project\build\bin\llvm-tblgen.exe -gen-emitter -IC:/_work/llvm-project/llvm-project/llvm/lib/Target/AMDGPU -IC:/_work/llvm-project/llvm-project/build/include -IC:/_work/llvm-project/llvm-project/llvm/include -I C:/_work/llvm-project/llvm-project/llvm/lib/Target --long-string-literals=0 C:/_work/llvm-project/llvm-project/llvm/lib/Target/AMDGPU/AMDGPU.td --write-if-changed -o AMDGPUGenMCCodeEmitter.inc -d AMDGPUGenMCCodeEmitter.inc.d && C:\BuildTools\Common7\IDE\CommonExtensions\Microsoft\CMake\CMake\bin\cmake.exe -E cmake_transform_depfile Ninja gccdepfile C:/_work/llvm-project/llvm-project/llvm C:/_work/llvm-project/llvm-project/llvm/lib/Target/AMDGPU C:/_work/llvm-project/llvm-project/build C:/_work/llvm-project/llvm-project/build/lib/Target/AMDGPU C:/_work/llvm-project/llvm-project/build/lib/Target/AMDGPU/AMDGPUGenMCCodeEmitter.inc.d C:/_work/llvm-project/llvm-project/build/CMakeFiles/d/e2a6d99688503538e7fd75e18f3a796dd09104e2e61c06d8a63596ad072b3010.d"
Included from C:/_work/llvm-project/llvm-project/llvm/lib/Target/AMDGPU/AMDGPU.td:2773:
C:/_work/llvm-project/llvm-project/llvm/lib/Target/AMDGPU\AMDGPUCallingConv.td:66:3: error: expected ']' at end of list value
CCIfTrue16<CCIfType<[i16, f16, bf16], CCAssignToReg<
^
```
</details>
<details>
<summary>[code=1] lib/Target/AMDGPU/AMDGPUGenAsmWriter.inc C:/_work/llvm-project/llvm-project/build/lib/Target/AMDGPU/AMDGPUGenAsmWriter.inc</summary>
```
FAILED: [code=1] lib/Target/AMDGPU/AMDGPUGenAsmWriter.inc C:/_work/llvm-project/llvm-project/build/lib/Target/AMDGPU/AMDGPUGenAsmWriter.inc
C:\Windows\system32\cmd.exe /C "cd /D C:\_work\llvm-project\llvm-project\build\lib\Target\AMDGPU && C:\_work\llvm-project\llvm-project\build\bin\llvm-tblgen.exe -gen-asm-writer -IC:/_work/llvm-project/llvm-project/llvm/lib/Target/AMDGPU -IC:/_work/llvm-project/llvm-project/build/include -IC:/_work/llvm-project/llvm-project/llvm/include -I C:/_work/llvm-project/llvm-project/llvm/lib/Target --long-string-literals=0 C:/_work/llvm-project/llvm-project/llvm/lib/Target/AMDGPU/AMDGPU.td --write-if-changed -o AMDGPUGenAsmWriter.inc -d AMDGPUGenAsmWriter.inc.d && C:\BuildTools\Common7\IDE\CommonExtensions\Microsoft\CMake\CMake\bin\cmake.exe -E cmake_transform_depfile Ninja gccdepfile C:/_work/llvm-project/llvm-project/llvm C:/_work/llvm-project/llvm-project/llvm/lib/Target/AMDGPU C:/_work/llvm-project/llvm-project/build C:/_work/llvm-project/llvm-project/build/lib/Target/AMDGPU C:/_work/llvm-project/llvm-project/build/lib/Target/AMDGPU/AMDGPUGenAsmWriter.inc.d C:/_work/llvm-project/llvm-project/build/CMakeFiles/d/e7c7b8fcd864040b207969f8ac9d401e27ac03ccc58df331e0fa427ff678fc81.d"
Included from C:/_work/llvm-project/llvm-project/llvm/lib/Target/AMDGPU/AMDGPU.td:2773:
C:/_work/llvm-project/llvm-project/llvm/lib/Target/AMDGPU\AMDGPUCallingConv.td:66:3: error: expected ']' at end of list value
CCIfTrue16<CCIfType<[i16, f16, bf16], CCAssignToReg<
^
```
</details>
<details>
<summary>[code=1] lib/Target/AMDGPU/AMDGPUGenGlobalISel.inc C:/_work/llvm-project/llvm-project/build/lib/Target/AMDGPU/AMDGPUGenGlobalISel.inc</summary>
```
FAILED: [code=1] lib/Target/AMDGPU/AMDGPUGenGlobalISel.inc C:/_work/llvm-project/llvm-project/build/lib/Target/AMDGPU/AMDGPUGenGlobalISel.inc
C:\Windows\system32\cmd.exe /C "cd /D C:\_work\llvm-project\llvm-project\build\lib\Target\AMDGPU && C:\_work\llvm-project\llvm-project\build\bin\llvm-tblgen.exe -gen-global-isel -IC:/_work/llvm-project/llvm-project/llvm/lib/Target/AMDGPU -IC:/_work/llvm-project/llvm-project/build/include -IC:/_work/llvm-project/llvm-project/llvm/include -I C:/_work/llvm-project/llvm-project/llvm/lib/Target --long-string-literals=0 C:/_work/llvm-project/llvm-project/llvm/lib/Target/AMDGPU/AMDGPUGISel.td --write-if-changed -o AMDGPUGenGlobalISel.inc -d AMDGPUGenGlobalISel.inc.d && C:\BuildTools\Common7\IDE\CommonExtensions\Microsoft\CMake\CMake\bin\cmake.exe -E cmake_transform_depfile Ninja gccdepfile C:/_work/llvm-project/llvm-project/llvm C:/_work/llvm-project/llvm-project/llvm/lib/Target/AMDGPU C:/_work/llvm-project/llvm-project/build C:/_work/llvm-project/llvm-project/build/lib/Target/AMDGPU C:/_work/llvm-project/llvm-project/build/lib/Target/AMDGPU/AMDGPUGenGlobalISel.inc.d C:/_work/llvm-project/llvm-project/build/CMakeFiles/d/89d338c5b4936fa7cd0832078d3d753afacbd317a3a72b7fae52aeb272e93142.d"
Included from C:/_work/llvm-project/llvm-project/llvm/lib/Target/AMDGPU/AMDGPUGISel.td:13:
Included from C:/_work/llvm-project/llvm-project/llvm/lib/Target/AMDGPU\AMDGPU.td:2773:
C:/_work/llvm-project/llvm-project/llvm/lib/Target/AMDGPU\AMDGPUCallingConv.td:66:3: error: expected ']' at end of list value
CCIfTrue16<CCIfType<[i16, f16, bf16], CCAssignToReg<
^
```
</details>
<details>
<summary>[code=1] lib/Target/AMDGPU/AMDGPUGenPostLegalizeGICombiner.inc C:/_work/llvm-project/llvm-project/build/lib/Target/AMDGPU/AMDGPUGenPostLegalizeGICombiner.inc</summary>
```
FAILED: [code=1] lib/Target/AMDGPU/AMDGPUGenPostLegalizeGICombiner.inc C:/_work/llvm-project/llvm-project/build/lib/Target/AMDGPU/AMDGPUGenPostLegalizeGICombiner.inc
C:\Windows\system32\cmd.exe /C "cd /D C:\_work\llvm-project\llvm-project\build\lib\Target\AMDGPU && C:\_work\llvm-project\llvm-project\build\bin\llvm-tblgen.exe -gen-global-isel-combiner -combiners="AMDGPUPostLegalizerCombiner" -IC:/_work/llvm-project/llvm-project/llvm/lib/Target/AMDGPU -IC:/_work/llvm-project/llvm-project/build/include -IC:/_work/llvm-project/llvm-project/llvm/include -I C:/_work/llvm-project/llvm-project/llvm/lib/Target --long-string-literals=0 C:/_work/llvm-project/llvm-project/llvm/lib/Target/AMDGPU/AMDGPUGISel.td --write-if-changed -o AMDGPUGenPostLegalizeGICombiner.inc -d AMDGPUGenPostLegalizeGICombiner.inc.d && C:\BuildTools\Common7\IDE\CommonExtensions\Microsoft\CMake\CMake\bin\cmake.exe -E cmake_transform_depfile Ninja gccdepfile C:/_work/llvm-project/llvm-project/llvm C:/_work/llvm-project/llvm-project/llvm/lib/Target/AMDGPU C:/_work/llvm-project/llvm-project/build C:/_work/llvm-project/llvm-project/build/lib/Target/AMDGPU C:/_work/llvm-project/llvm-project/build/lib/Target/AMDGPU/AMDGPUGenPostLegalizeGICombiner.inc.d C:/_work/llvm-project/llvm-project/build/CMakeFiles/d/2bc715bb74a23031c9866c641490f29890b1f9fb16264f66325158f155b99ac0.d"
Included from C:/_work/llvm-project/llvm-project/llvm/lib/Target/AMDGPU/AMDGPUGISel.td:13:
Included from C:/_work/llvm-project/llvm-project/llvm/lib/Target/AMDGPU\AMDGPU.td:2773:
C:/_work/llvm-project/llvm-project/llvm/lib/Target/AMDGPU\AMDGPUCallingConv.td:66:3: error: expected ']' at end of list value
CCIfTrue16<CCIfType<[i16, f16, bf16], CCAssignToReg<
^
```
</details>
<details>
<summary>[code=1] lib/Target/AMDGPU/AMDGPUGenMCPseudoLowering.inc C:/_work/llvm-project/llvm-project/build/lib/Target/AMDGPU/AMDGPUGenMCPseudoLowering.inc</summary>
```
FAILED: [code=1] lib/Target/AMDGPU/AMDGPUGenMCPseudoLowering.inc C:/_work/llvm-project/llvm-project/build/lib/Target/AMDGPU/AMDGPUGenMCPseudoLowering.inc
C:\Windows\system32\cmd.exe /C "cd /D C:\_work\llvm-project\llvm-project\build\lib\Target\AMDGPU && C:\_work\llvm-project\llvm-project\build\bin\llvm-tblgen.exe -gen-pseudo-lowering -IC:/_work/llvm-project/llvm-project/llvm/lib/Target/AMDGPU -IC:/_work/llvm-project/llvm-project/build/include -IC:/_work/llvm-project/llvm-project/llvm/include -I C:/_work/llvm-project/llvm-project/llvm/lib/Target --long-string-literals=0 C:/_work/llvm-project/llvm-project/llvm/lib/Target/AMDGPU/AMDGPU.td --write-if-changed -o AMDGPUGenMCPseudoLowering.inc -d AMDGPUGenMCPseudoLowering.inc.d && C:\BuildTools\Common7\IDE\CommonExtensions\Microsoft\CMake\CMake\bin\cmake.exe -E cmake_transform_depfile Ninja gccdepfile C:/_work/llvm-project/llvm-project/llvm C:/_work/llvm-project/llvm-project/llvm/lib/Target/AMDGPU C:/_work/llvm-project/llvm-project/build C:/_work/llvm-project/llvm-project/build/lib/Target/AMDGPU C:/_work/llvm-project/llvm-project/build/lib/Target/AMDGPU/AMDGPUGenMCPseudoLowering.inc.d C:/_work/llvm-project/llvm-project/build/CMakeFiles/d/93e09e8d4bf7ab5129b031fa2f36700d6612a8f09f6e446df00c582f28a1cb76.d"
Included from C:/_work/llvm-project/llvm-project/llvm/lib/Target/AMDGPU/AMDGPU.td:2773:
C:/_work/llvm-project/llvm-project/llvm/lib/Target/AMDGPU\AMDGPUCallingConv.td:66:3: error: expected ']' at end of list value
CCIfTrue16<CCIfType<[i16, f16, bf16], CCAssignToReg<
^
```
</details>
<details>
<summary>[code=1] lib/Target/AMDGPU/AMDGPUGenDAGISel.inc C:/_work/llvm-project/llvm-project/build/lib/Target/AMDGPU/AMDGPUGenDAGISel.inc</summary>
```
FAILED: [code=1] lib/Target/AMDGPU/AMDGPUGenDAGISel.inc C:/_work/llvm-project/llvm-project/build/lib/Target/AMDGPU/AMDGPUGenDAGISel.inc
C:\Windows\system32\cmd.exe /C "cd /D C:\_work\llvm-project\llvm-project\build\lib\Target\AMDGPU && C:\_work\llvm-project\llvm-project\build\bin\llvm-tblgen.exe -gen-dag-isel -IC:/_work/llvm-project/llvm-project/llvm/lib/Target/AMDGPU -IC:/_work/llvm-project/llvm-project/build/include -IC:/_work/llvm-project/llvm-project/llvm/include -I C:/_work/llvm-project/llvm-project/llvm/lib/Target -omit-comments --long-string-literals=0 C:/_work/llvm-project/llvm-project/llvm/lib/Target/AMDGPU/AMDGPU.td --write-if-changed -o AMDGPUGenDAGISel.inc -d AMDGPUGenDAGISel.inc.d && C:\BuildTools\Common7\IDE\CommonExtensions\Microsoft\CMake\CMake\bin\cmake.exe -E cmake_transform_depfile Ninja gccdepfile C:/_work/llvm-project/llvm-project/llvm C:/_work/llvm-project/llvm-project/llvm/lib/Target/AMDGPU C:/_work/llvm-project/llvm-project/build C:/_work/llvm-project/llvm-project/build/lib/Target/AMDGPU C:/_work/llvm-project/llvm-project/build/lib/Target/AMDGPU/AMDGPUGenDAGISel.inc.d C:/_work/llvm-project/llvm-project/build/CMakeFiles/d/68513218841f39fe8974e84a308a2c0315cc7321bae32e37a84390b70503327d.d"
Included from C:/_work/llvm-project/llvm-project/llvm/lib/Target/AMDGPU/AMDGPU.td:2773:
C:/_work/llvm-project/llvm-project/llvm/lib/Target/AMDGPU\AMDGPUCallingConv.td:66:3: error: expected ']' at end of list value
CCIfTrue16<CCIfType<[i16, f16, bf16], CCAssignToReg<
^
```
</details>
<details>
<summary>[code=1] lib/Target/AMDGPU/AMDGPUGenInstrInfo.inc C:/_work/llvm-project/llvm-project/build/lib/Target/AMDGPU/AMDGPUGenInstrInfo.inc</summary>
```
FAILED: [code=1] lib/Target/AMDGPU/AMDGPUGenInstrInfo.inc C:/_work/llvm-project/llvm-project/build/lib/Target/AMDGPU/AMDGPUGenInstrInfo.inc
C:\Windows\system32\cmd.exe /C "cd /D C:\_work\llvm-project\llvm-project\build\lib\Target\AMDGPU && C:\_work\llvm-project\llvm-project\build\bin\llvm-tblgen.exe -gen-instr-info -IC:/_work/llvm-project/llvm-project/llvm/lib/Target/AMDGPU -IC:/_work/llvm-project/llvm-project/build/include -IC:/_work/llvm-project/llvm-project/llvm/include -I C:/_work/llvm-project/llvm-project/llvm/lib/Target --long-string-literals=0 C:/_work/llvm-project/llvm-project/llvm/lib/Target/AMDGPU/AMDGPU.td --write-if-changed -o AMDGPUGenInstrInfo.inc -d AMDGPUGenInstrInfo.inc.d && C:\BuildTools\Common7\IDE\CommonExtensions\Microsoft\CMake\CMake\bin\cmake.exe -E cmake_transform_depfile Ninja gccdepfile C:/_work/llvm-project/llvm-project/llvm C:/_work/llvm-project/llvm-project/llvm/lib/Target/AMDGPU C:/_work/llvm-project/llvm-project/build C:/_work/llvm-project/llvm-project/build/lib/Target/AMDGPU C:/_work/llvm-project/llvm-project/build/lib/Target/AMDGPU/AMDGPUGenInstrInfo.inc.d C:/_work/llvm-project/llvm-project/build/CMakeFiles/d/c77dbc2839f82c6c2d08daeb901f4b86c38dc95516ba68c3ccec7844d4a118e7.d"
Included from C:/_work/llvm-project/llvm-project/llvm/lib/Target/AMDGPU/AMDGPU.td:2773:
C:/_work/llvm-project/llvm-project/llvm/lib/Target/AMDGPU\AMDGPUCallingConv.td:66:3: error: expected ']' at end of list value
CCIfTrue16<CCIfType<[i16, f16, bf16], CCAssignToReg<
^
```
</details>
<details>
<summary>[code=1] lib/Target/AMDGPU/AMDGPUGenAsmMatcher.inc C:/_work/llvm-project/llvm-project/build/lib/Target/AMDGPU/AMDGPUGenAsmMatcher.inc</summary>
```
FAILED: [code=1] lib/Target/AMDGPU/AMDGPUGenAsmMatcher.inc C:/_work/llvm-project/llvm-project/build/lib/Target/AMDGPU/AMDGPUGenAsmMatcher.inc
C:\Windows\system32\cmd.exe /C "cd /D C:\_work\llvm-project\llvm-project\build\lib\Target\AMDGPU && C:\_work\llvm-project\llvm-project\build\bin\llvm-tblgen.exe -gen-asm-matcher -IC:/_work/llvm-project/llvm-project/llvm/lib/Target/AMDGPU -IC:/_work/llvm-project/llvm-project/build/include -IC:/_work/llvm-project/llvm-project/llvm/include -I C:/_work/llvm-project/llvm-project/llvm/lib/Target --long-string-literals=0 C:/_work/llvm-project/llvm-project/llvm/lib/Target/AMDGPU/AMDGPU.td --write-if-changed -o AMDGPUGenAsmMatcher.inc -d AMDGPUGenAsmMatcher.inc.d && C:\BuildTools\Common7\IDE\CommonExtensions\Microsoft\CMake\CMake\bin\cmake.exe -E cmake_transform_depfile Ninja gccdepfile C:/_work/llvm-project/llvm-project/llvm C:/_work/llvm-project/llvm-project/llvm/lib/Target/AMDGPU C:/_work/llvm-project/llvm-project/build C:/_work/llvm-project/llvm-project/build/lib/Target/AMDGPU C:/_work/llvm-project/llvm-project/build/lib/Target/AMDGPU/AMDGPUGenAsmMatcher.inc.d C:/_work/llvm-project/llvm-project/build/CMakeFiles/d/45025a19055953aa9ed35542e35a03aa1c7cb1ba05f603618cd75f9a1fe8bcc0.d"
Included from C:/_work/llvm-project/llvm-project/llvm/lib/Target/AMDGPU/AMDGPU.td:2773:
C:/_work/llvm-project/llvm-project/llvm/lib/Target/AMDGPU\AMDGPUCallingConv.td:66:3: error: expected ']' at end of list value
CCIfTrue16<CCIfType<[i16, f16, bf16], CCAssignToReg<
^
```
</details>
<details>
<summary>[code=1] lib/Target/AMDGPU/AMDGPUGenRegisterBank.inc C:/_work/llvm-project/llvm-project/build/lib/Target/AMDGPU/AMDGPUGenRegisterBank.inc</summary>
```
FAILED: [code=1] lib/Target/AMDGPU/AMDGPUGenRegisterBank.inc C:/_work/llvm-project/llvm-project/build/lib/Target/AMDGPU/AMDGPUGenRegisterBank.inc
C:\Windows\system32\cmd.exe /C "cd /D C:\_work\llvm-project\llvm-project\build\lib\Target\AMDGPU && C:\_work\llvm-project\llvm-project\build\bin\llvm-tblgen.exe -gen-register-bank -IC:/_work/llvm-project/llvm-project/llvm/lib/Target/AMDGPU -IC:/_work/llvm-project/llvm-project/build/include -IC:/_work/llvm-project/llvm-project/llvm/include -I C:/_work/llvm-project/llvm-project/llvm/lib/Target --long-string-literals=0 C:/_work/llvm-project/llvm-project/llvm/lib/Target/AMDGPU/AMDGPU.td --write-if-changed -o AMDGPUGenRegisterBank.inc -d AMDGPUGenRegisterBank.inc.d && C:\BuildTools\Common7\IDE\CommonExtensions\Microsoft\CMake\CMake\bin\cmake.exe -E cmake_transform_depfile Ninja gccdepfile C:/_work/llvm-project/llvm-project/llvm C:/_work/llvm-project/llvm-project/llvm/lib/Target/AMDGPU C:/_work/llvm-project/llvm-project/build C:/_work/llvm-project/llvm-project/build/lib/Target/AMDGPU C:/_work/llvm-project/llvm-project/build/lib/Target/AMDGPU/AMDGPUGenRegisterBank.inc.d C:/_work/llvm-project/llvm-project/build/CMakeFiles/d/9d11e8cfc617cf859360161fffc6c9eb96dd6aa3b20f79aee778e1f0a98dcab8.d"
Included from C:/_work/llvm-project/llvm-project/llvm/lib/Target/AMDGPU/AMDGPU.td:2773:
C:/_work/llvm-project/llvm-project/llvm/lib/Target/AMDGPU\AMDGPUCallingConv.td:66:3: error: expected ']' at end of list value
CCIfTrue16<CCIfType<[i16, f16, bf16], CCAssignToReg<
^
```
</details>
<details>
<summary>[code=1] lib/Target/AMDGPU/AMDGPUGenSearchableTables.inc C:/_work/llvm-project/llvm-project/build/lib/Target/AMDGPU/AMDGPUGenSearchableTables.inc</summary>
```
FAILED: [code=1] lib/Target/AMDGPU/AMDGPUGenSearchableTables.inc C:/_work/llvm-project/llvm-project/build/lib/Target/AMDGPU/AMDGPUGenSearchableTables.inc
C:\Windows\system32\cmd.exe /C "cd /D C:\_work\llvm-project\llvm-project\build\lib\Target\AMDGPU && C:\_work\llvm-project\llvm-project\build\bin\llvm-tblgen.exe -gen-searchable-tables -IC:/_work/llvm-project/llvm-project/llvm/lib/Target/AMDGPU -IC:/_work/llvm-project/llvm-project/build/include -IC:/_work/llvm-project/llvm-project/llvm/include -I C:/_work/llvm-project/llvm-project/llvm/lib/Target --long-string-literals=0 C:/_work/llvm-project/llvm-project/llvm/lib/Target/AMDGPU/AMDGPU.td --write-if-changed -o AMDGPUGenSearchableTables.inc -d AMDGPUGenSearchableTables.inc.d && C:\BuildTools\Common7\IDE\CommonExtensions\Microsoft\CMake\CMake\bin\cmake.exe -E cmake_transform_depfile Ninja gccdepfile C:/_work/llvm-project/llvm-project/llvm C:/_work/llvm-project/llvm-project/llvm/lib/Target/AMDGPU C:/_work/llvm-project/llvm-project/build C:/_work/llvm-project/llvm-project/build/lib/Target/AMDGPU C:/_work/llvm-project/llvm-project/build/lib/Target/AMDGPU/AMDGPUGenSearchableTables.inc.d C:/_work/llvm-project/llvm-project/build/CMakeFiles/d/28fbd19cd3a696cc1f6bfefd23c0e6dc7d150e6b6bec89777864ead89cdc3a39.d"
Included from C:/_work/llvm-project/llvm-project/llvm/lib/Target/AMDGPU/AMDGPU.td:2773:
C:/_work/llvm-project/llvm-project/llvm/lib/Target/AMDGPU\AMDGPUCallingConv.td:66:3: error: expected ']' at end of list value
CCIfTrue16<CCIfType<[i16, f16, bf16], CCAssignToReg<
^
```
</details>
<details>
<summary>[code=1] lib/Target/AMDGPU/AMDGPUGenSDNodeInfo.inc C:/_work/llvm-project/llvm-project/build/lib/Target/AMDGPU/AMDGPUGenSDNodeInfo.inc</summary>
```
FAILED: [code=1] lib/Target/AMDGPU/AMDGPUGenSDNodeInfo.inc C:/_work/llvm-project/llvm-project/build/lib/Target/AMDGPU/AMDGPUGenSDNodeInfo.inc
C:\Windows\system32\cmd.exe /C "cd /D C:\_work\llvm-project\llvm-project\build\lib\Target\AMDGPU && C:\_work\llvm-project\llvm-project\build\bin\llvm-tblgen.exe -gen-sd-node-info -IC:/_work/llvm-project/llvm-project/llvm/lib/Target/AMDGPU -IC:/_work/llvm-project/llvm-project/build/include -IC:/_work/llvm-project/llvm-project/llvm/include -I C:/_work/llvm-project/llvm-project/llvm/lib/Target --long-string-literals=0 C:/_work/llvm-project/llvm-project/llvm/lib/Target/AMDGPU/AMDGPU.td --write-if-changed -o AMDGPUGenSDNodeInfo.inc -d AMDGPUGenSDNodeInfo.inc.d && C:\BuildTools\Common7\IDE\CommonExtensions\Microsoft\CMake\CMake\bin\cmake.exe -E cmake_transform_depfile Ninja gccdepfile C:/_work/llvm-project/llvm-project/llvm C:/_work/llvm-project/llvm-project/llvm/lib/Target/AMDGPU C:/_work/llvm-project/llvm-project/build C:/_work/llvm-project/llvm-project/build/lib/Target/AMDGPU C:/_work/llvm-project/llvm-project/build/lib/Target/AMDGPU/AMDGPUGenSDNodeInfo.inc.d C:/_work/llvm-project/llvm-project/build/CMakeFiles/d/66be2a5d1066bee630de974a9620c0f8d521d191ec8cbf48428292223a330d63.d"
Included from C:/_work/llvm-project/llvm-project/llvm/lib/Target/AMDGPU/AMDGPU.td:2773:
C:/_work/llvm-project/llvm-project/llvm/lib/Target/AMDGPU\AMDGPUCallingConv.td:66:3: error: expected ']' at end of list value
CCIfTrue16<CCIfType<[i16, f16, bf16], CCAssignToReg<
^
```
</details>
<details>
<summary>[code=1] lib/Target/AMDGPU/AMDGPUGenSubtargetInfo.inc C:/_work/llvm-project/llvm-project/build/lib/Target/AMDGPU/AMDGPUGenSubtargetInfo.inc</summary>
```
FAILED: [code=1] lib/Target/AMDGPU/AMDGPUGenSubtargetInfo.inc C:/_work/llvm-project/llvm-project/build/lib/Target/AMDGPU/AMDGPUGenSubtargetInfo.inc
C:\Windows\system32\cmd.exe /C "cd /D C:\_work\llvm-project\llvm-project\build\lib\Target\AMDGPU && C:\_work\llvm-project\llvm-project\build\bin\llvm-tblgen.exe -gen-subtarget -IC:/_work/llvm-project/llvm-project/llvm/lib/Target/AMDGPU -IC:/_work/llvm-project/llvm-project/build/include -IC:/_work/llvm-project/llvm-project/llvm/include -I C:/_work/llvm-project/llvm-project/llvm/lib/Target --long-string-literals=0 C:/_work/llvm-project/llvm-project/llvm/lib/Target/AMDGPU/AMDGPU.td --write-if-changed -o AMDGPUGenSubtargetInfo.inc -d AMDGPUGenSubtargetInfo.inc.d && C:\BuildTools\Common7\IDE\CommonExtensions\Microsoft\CMake\CMake\bin\cmake.exe -E cmake_transform_depfile Ninja gccdepfile C:/_work/llvm-project/llvm-project/llvm C:/_work/llvm-project/llvm-project/llvm/lib/Target/AMDGPU C:/_work/llvm-project/llvm-project/build C:/_work/llvm-project/llvm-project/build/lib/Target/AMDGPU C:/_work/llvm-project/llvm-project/build/lib/Target/AMDGPU/AMDGPUGenSubtargetInfo.inc.d C:/_work/llvm-project/llvm-project/build/CMakeFiles/d/d2d1a465d557a8acb707e4d1ba0b4f1c0b791059320b2856d1feaf3dd0ec7fda.d"
Included from C:/_work/llvm-project/llvm-project/llvm/lib/Target/AMDGPU/AMDGPU.td:2773:
C:/_work/llvm-project/llvm-project/llvm/lib/Target/AMDGPU\AMDGPUCallingConv.td:66:3: error: expected ']' at end of list value
CCIfTrue16<CCIfType<[i16, f16, bf16], CCAssignToReg<
^
```
</details>
If these failures are unrelated to your changes (for example tests are broken or flaky at HEAD), please open an issue at https://github.com/llvm/llvm-project/issues and add the `infrastructure` label.
https://github.com/llvm/llvm-project/pull/187135
More information about the llvm-commits
mailing list