[llvm] [VPlan] Remove no-op SCALAR-STEPS after unrolling. (PR #123655)

LLVM Continuous Integration via llvm-commits llvm-commits at lists.llvm.org
Tue Mar 25 06:07:05 PDT 2025


llvm-ci wrote:

LLVM Buildbot has detected a new failure on builder `polly-x86_64-linux-noassert` running on `polly-x86_64-gce1` while building `llvm` at step 5 "build".

Full details are available at: https://lab.llvm.org/buildbot/#/builders/28/builds/7833

<details>
<summary>Here is the relevant piece of the build log for the reference</summary>

```
Step 5 (build) failure: 'ninja' (failure)
...
[46/121] Linking CXX executable bin/clang-fuzzer-dictionary
[47/121] Linking CXX executable bin/clang-offload-packager
[48/121] Linking CXX executable bin/clang-refactor
[49/121] Linking CXX executable bin/clang-installapi
[50/121] Linking CXX executable bin/clang-diff
[51/121] Linking CXX executable bin/clang-sycl-linker
[52/121] Linking CXX executable bin/nvptx-arch
[53/121] Linking CXX executable bin/amdgpu-arch
[54/121] Linking CXX executable bin/clang-scan-deps
[55/121] Linking CXX executable bin/llc
FAILED: bin/llc 
: && /usr/bin/c++ -fPIC -fno-semantic-interposition -fvisibility-inlines-hidden -Werror=date-time -Wall -Wextra -Wno-unused-parameter -Wwrite-strings -Wcast-qual -Wno-missing-field-initializers -pedantic -Wno-long-long -Wimplicit-fallthrough -Wno-uninitialized -Wno-nonnull -Wno-class-memaccess -Wno-redundant-move -Wno-pessimizing-move -Wno-noexcept-type -Wdelete-non-virtual-dtor -Wsuggest-override -Wno-comment -Wno-misleading-indentation -Wctad-maybe-unsupported -fdiagnostics-color -ffunction-sections -fdata-sections -O3 -DNDEBUG -fuse-ld=lld -Wl,--color-diagnostics   -Wl,--export-dynamic tools/llc/CMakeFiles/llc.dir/llc.cpp.o tools/llc/CMakeFiles/llc.dir/NewPMDriver.cpp.o -o bin/llc  -Wl,-rpath,"\$ORIGIN/../lib:"  lib/libLLVMX86AsmParser.a  lib/libLLVMX86CodeGen.a  lib/libLLVMNVPTXCodeGen.a  lib/libLLVMX86Desc.a  lib/libLLVMNVPTXDesc.a  lib/libLLVMX86Info.a  lib/libLLVMNVPTXInfo.a  lib/libLLVMAnalysis.a  lib/libLLVMAsmPrinter.a  lib/libLLVMCodeGen.a  lib/libLLVMCodeGenTypes.a  lib/libLLVMCore.a  lib/libLLVMIRPrinter.a  lib/libLLVMIRReader.a  lib/libLLVMMC.a  lib/libLLVMMIRParser.a  lib/libLLVMPasses.a  lib/libLLVMRemarks.a  lib/libLLVMScalarOpts.a  lib/libLLVMSelectionDAG.a  lib/libLLVMSupport.a  lib/libLLVMTarget.a  lib/libLLVMTargetParser.a  lib/libLLVMTransformUtils.a  lib/libLLVMVectorize.a  lib/libLLVMMCDisassembler.a  lib/libLLVMGlobalISel.a  lib/libLLVMSelectionDAG.a  lib/libLLVMCodeGen.a  lib/libLLVMCodeGenTypes.a  lib/libLLVMCGData.a  lib/libLLVMIRPrinter.a  lib/libLLVMTarget.a  lib/libLLVMCFGuard.a  lib/libLLVMObjCARCOpts.a  lib/libLLVMCoroutines.a  lib/libLLVMipo.a  lib/libLLVMVectorize.a  lib/libLLVMSandboxIR.a  lib/libLLVMInstrumentation.a  lib/libLLVMBitWriter.a  lib/libLLVMFrontendOpenMP.a  lib/libLLVMScalarOpts.a  lib/libLLVMAggressiveInstCombine.a  lib/libLLVMFrontendOffloading.a  lib/libLLVMObjectYAML.a  lib/libLLVMFrontendAtomic.a  lib/libLLVMLinker.a  lib/libLLVMHipStdPar.a  lib/libLLVMInstCombine.a  lib/libLLVMTransformUtils.a  lib/libLLVMAnalysis.a  lib/libLLVMProfileData.a  lib/libLLVMSymbolize.a  lib/libLLVMDebugInfoDWARF.a  lib/libLLVMDebugInfoPDB.a  lib/libLLVMDebugInfoCodeView.a  lib/libLLVMDebugInfoMSF.a  lib/libLLVMDebugInfoBTF.a  lib/libLLVMObject.a  lib/libLLVMIRReader.a  lib/libLLVMAsmParser.a  lib/libLLVMMCParser.a  lib/libLLVMMC.a  lib/libLLVMBitReader.a  lib/libLLVMTextAPI.a  lib/libLLVMCore.a  lib/libLLVMRemarks.a  lib/libLLVMBitstreamReader.a  lib/libLLVMBinaryFormat.a  lib/libLLVMTargetParser.a  lib/libLLVMSupport.a  lib/libLLVMDemangle.a  -lrt  -ldl  -lm  /usr/lib/x86_64-linux-gnu/libz.so && :
ld.lld: error: undefined symbol: llvm::VPUnrollPartAccessor<2u>::getUnrollPart(llvm::VPUser&) const
>>> referenced by VPlanTransforms.cpp
>>>               VPlanTransforms.cpp.o:(llvm::VPlanTransforms::simplifyRecipes(llvm::VPlan&, llvm::Type&) (.localalias)) in archive lib/libLLVMVectorize.a
collect2: error: ld returned 1 exit status
[56/121] Linking CXX executable bin/dsymutil
[57/121] Linking CXX executable bin/llvm-exegesis
[58/121] Linking CXX shared library lib/libclang.so.21.0.0git
[59/121] Linking CXX executable bin/bugpoint
FAILED: bin/bugpoint 
: && /usr/bin/c++ -fPIC -fno-semantic-interposition -fvisibility-inlines-hidden -Werror=date-time -Wall -Wextra -Wno-unused-parameter -Wwrite-strings -Wcast-qual -Wno-missing-field-initializers -pedantic -Wno-long-long -Wimplicit-fallthrough -Wno-uninitialized -Wno-nonnull -Wno-class-memaccess -Wno-redundant-move -Wno-pessimizing-move -Wno-noexcept-type -Wdelete-non-virtual-dtor -Wsuggest-override -Wno-comment -Wno-misleading-indentation -Wctad-maybe-unsupported -fdiagnostics-color -ffunction-sections -fdata-sections -O3 -DNDEBUG -fuse-ld=lld -Wl,--color-diagnostics   -Wl,--export-dynamic tools/bugpoint/CMakeFiles/bugpoint.dir/BugDriver.cpp.o tools/bugpoint/CMakeFiles/bugpoint.dir/CrashDebugger.cpp.o tools/bugpoint/CMakeFiles/bugpoint.dir/ExecutionDriver.cpp.o tools/bugpoint/CMakeFiles/bugpoint.dir/ExtractFunction.cpp.o tools/bugpoint/CMakeFiles/bugpoint.dir/FindBugs.cpp.o tools/bugpoint/CMakeFiles/bugpoint.dir/Miscompilation.cpp.o tools/bugpoint/CMakeFiles/bugpoint.dir/OptimizerDriver.cpp.o tools/bugpoint/CMakeFiles/bugpoint.dir/ToolRunner.cpp.o tools/bugpoint/CMakeFiles/bugpoint.dir/bugpoint.cpp.o -o bin/bugpoint  -Wl,-rpath,"\$ORIGIN/../lib:"  lib/libLLVMX86AsmParser.a  lib/libLLVMX86CodeGen.a  lib/libLLVMNVPTXCodeGen.a  lib/libLLVMX86Desc.a  lib/libLLVMNVPTXDesc.a  lib/libLLVMX86Info.a  lib/libLLVMNVPTXInfo.a  lib/libLLVMAnalysis.a  lib/libLLVMBitWriter.a  lib/libLLVMCodeGen.a  lib/libLLVMExtensions.a  lib/libLLVMCore.a  lib/libLLVMipo.a  lib/libLLVMIRReader.a  lib/libLLVMAggressiveInstCombine.a  lib/libLLVMInstCombine.a  lib/libLLVMInstrumentation.a  lib/libLLVMLinker.a  lib/libLLVMObjCARCOpts.a  lib/libLLVMScalarOpts.a  lib/libLLVMSupport.a  lib/libLLVMTarget.a  lib/libLLVMTargetParser.a  lib/libLLVMTransformUtils.a  lib/libLLVMVectorize.a  lib/libLLVMMCDisassembler.a  lib/libLLVMGlobalISel.a  lib/libLLVMAsmPrinter.a  lib/libLLVMSelectionDAG.a  lib/libPolly.a  lib/libLLVMPasses.a  lib/libLLVMCodeGen.a  lib/libLLVMCodeGenTypes.a  lib/libLLVMCGData.a  lib/libLLVMObjCARCOpts.a  lib/libLLVMTarget.a  lib/libLLVMCFGuard.a  lib/libLLVMIRPrinter.a  lib/libLLVMCoroutines.a  lib/libLLVMipo.a  lib/libLLVMBitWriter.a  lib/libLLVMInstrumentation.a  lib/libLLVMLinker.a  lib/libLLVMVectorize.a  lib/libLLVMSandboxIR.a  lib/libLLVMFrontendOpenMP.a  lib/libLLVMFrontendOffloading.a  lib/libLLVMObjectYAML.a  lib/libLLVMFrontendAtomic.a  lib/libLLVMScalarOpts.a  lib/libLLVMAggressiveInstCombine.a  lib/libLLVMInstCombine.a  lib/libLLVMHipStdPar.a  lib/libLLVMTransformUtils.a  lib/libLLVMAnalysis.a  lib/libLLVMProfileData.a  lib/libLLVMSymbolize.a  lib/libLLVMDebugInfoDWARF.a  lib/libLLVMDebugInfoPDB.a  lib/libLLVMDebugInfoCodeView.a  lib/libLLVMDebugInfoMSF.a  lib/libLLVMDebugInfoBTF.a  lib/libLLVMObject.a  lib/libLLVMIRReader.a  lib/libLLVMAsmParser.a  lib/libLLVMMCParser.a  lib/libLLVMMC.a  lib/libLLVMBitReader.a  lib/libLLVMTextAPI.a  lib/libLLVMCore.a  lib/libLLVMBinaryFormat.a  lib/libLLVMRemarks.a  lib/libLLVMBitstreamReader.a  lib/libLLVMTargetParser.a  lib/libLLVMSupport.a  lib/libLLVMDemangle.a  -lrt  -ldl  -lm  /usr/lib/x86_64-linux-gnu/libz.so  lib/libPollyISL.a && :
ld.lld: error: undefined symbol: llvm::VPUnrollPartAccessor<2u>::getUnrollPart(llvm::VPUser&) const
>>> referenced by VPlanTransforms.cpp
>>>               VPlanTransforms.cpp.o:(llvm::VPlanTransforms::simplifyRecipes(llvm::VPlan&, llvm::Type&) (.localalias)) in archive lib/libLLVMVectorize.a
collect2: error: ld returned 1 exit status
[60/121] Building CXX object lib/LTO/CMakeFiles/LLVMLTO.dir/LTO.cpp.o
ninja: build stopped: subcommand failed.

```

</details>

https://github.com/llvm/llvm-project/pull/123655


More information about the llvm-commits mailing list