[llvm] [CMake] Fix DynamicLibraryTests exports symbol when plugins are enabled (PR #102941)

LLVM Continuous Integration via llvm-commits llvm-commits at lists.llvm.org
Tue Aug 13 11:15:51 PDT 2024


llvm-ci wrote:

LLVM Buildbot has detected a new failure on builder `sanitizer-x86_64-linux-bootstrap-msan` running on `sanitizer-buildbot6` while building `llvm` at step 2 "annotate".

Full details are available at: https://lab.llvm.org/buildbot/#/builders/164/builds/2011

Here is the relevant piece of the build log for the reference:
```
Step 2 (annotate) failure: 'python ../sanitizer_buildbot/sanitizers/zorg/buildbot/builders/sanitizers/buildbot_selector.py' (failure)
...
[1109/1300] Linking CXX executable unittests/Target/TargetMachineCTests
[1110/1300] Building CXX object unittests/TargetParser/CMakeFiles/TargetParserTests.dir/RISCVTargetParserTest.cpp.o
[1111/1300] Building CXX object unittests/DebugInfo/DWARF/CMakeFiles/DebugInfoDWARFTests.dir/DWARFDebugLineTest.cpp.o
[1112/1300] Building CXX object unittests/TableGen/CMakeFiles/TableGenTests.dir/ParserEntryPointTest.cpp.o
[1113/1300] Building CXX object unittests/Support/CMakeFiles/SupportTests.dir/MemoryTest.cpp.o
[1114/1300] Building CXX object unittests/Support/CMakeFiles/SupportTests.dir/BinaryStreamTest.cpp.o
[1115/1300] Building CXX object unittests/Support/CMakeFiles/SupportTests.dir/YAMLParserTest.cpp.o
[1116/1300] Building CXX object unittests/Support/DynamicLibrary/CMakeFiles/DynamicLibraryTests.dir/DynamicLibraryTest.cpp.o
[1117/1300] Building CXX object unittests/TableGen/CMakeFiles/TableGenTests.dir/CodeExpanderTest.cpp.o
[1118/1300] Linking CXX executable unittests/Support/DynamicLibrary/DynamicLibraryTests
FAILED: unittests/Support/DynamicLibrary/DynamicLibraryTests 
: && /home/b/sanitizer-x86_64-linux-bootstrap-msan/build/llvm_build0/bin/clang++ -nostdinc++ -isystem /home/b/sanitizer-x86_64-linux-bootstrap-msan/build/libcxx_build_msan/include -isystem /home/b/sanitizer-x86_64-linux-bootstrap-msan/build/libcxx_build_msan/include/c++/v1 -fsanitize=memory -Wl,--rpath=/home/b/sanitizer-x86_64-linux-bootstrap-msan/build/libcxx_build_msan/lib -L/home/b/sanitizer-x86_64-linux-bootstrap-msan/build/libcxx_build_msan/lib -w -stdlib=libc++ -fPIC -fno-semantic-interposition -fvisibility-inlines-hidden -Werror=date-time -Werror=unguarded-availability-new -Wall -Wextra -Wno-unused-parameter -Wwrite-strings -Wcast-qual -Wmissing-field-initializers -pedantic -Wno-long-long -Wc++98-compat-extra-semi -Wimplicit-fallthrough -Wcovered-switch-default -Wno-noexcept-type -Wnon-virtual-dtor -Wdelete-non-virtual-dtor -Wsuggest-override -Wstring-conversion -Wmisleading-indentation -Wctad-maybe-unsupported -fno-omit-frame-pointer -gline-tables-only -fsanitize=memory -fdiagnostics-color -ffunction-sections -fdata-sections -O3 -DNDEBUG -Wl,--rpath=/home/b/sanitizer-x86_64-linux-bootstrap-msan/build/libcxx_build_msan/lib -L/home/b/sanitizer-x86_64-linux-bootstrap-msan/build/libcxx_build_msan/lib -stdlib=libc++ -fuse-ld=lld -Wl,--color-diagnostics   -Wl,--export-dynamic  -Wl,--gc-sections  -Wl,--version-script,"/home/b/sanitizer-x86_64-linux-bootstrap-msan/build/llvm_build_msan/unittests/Support/DynamicLibrary/DynamicLibraryTests.exports" unittests/Support/DynamicLibrary/CMakeFiles/DynamicLibraryTests.dir/DynamicLibraryTest.cpp.o -o unittests/Support/DynamicLibrary/DynamicLibraryTests  lib/libLLVMSupport.a  lib/libLLVMSupport.a  lib/libllvm_gtest_main.a  lib/libllvm_gtest.a  lib/libDynamicLibraryLib.a  lib/libLLVMSupport.a  -lrt  -ldl  -lm  lib/libLLVMDemangle.a  -lpthread && :
ld.lld: error: non-exported symbol '__msan_param_tls' in '/home/b/sanitizer-x86_64-linux-bootstrap-msan/build/llvm_build0/lib/clang/20/lib/x86_64-unknown-linux-gnu/libclang_rt.msan.a(msan.cpp.o)' is referenced by DSO '/home/b/sanitizer-x86_64-linux-bootstrap-msan/build/libcxx_build_msan/lib/libc++abi.so'
ld.lld: error: non-exported symbol '__msan_retval_tls' in '/home/b/sanitizer-x86_64-linux-bootstrap-msan/build/llvm_build0/lib/clang/20/lib/x86_64-unknown-linux-gnu/libclang_rt.msan.a(msan.cpp.o)' is referenced by DSO '/home/b/sanitizer-x86_64-linux-bootstrap-msan/build/libcxx_build_msan/lib/libc++abi.so'
ld.lld: error: non-exported symbol '__msan_warning_noreturn' in '/home/b/sanitizer-x86_64-linux-bootstrap-msan/build/llvm_build0/lib/clang/20/lib/x86_64-unknown-linux-gnu/libclang_rt.msan.a(msan.cpp.o)' is referenced by DSO '/home/b/sanitizer-x86_64-linux-bootstrap-msan/build/libcxx_build_msan/lib/libc++abi.so'
ld.lld: error: non-exported symbol '__msan_init' in '/home/b/sanitizer-x86_64-linux-bootstrap-msan/build/llvm_build0/lib/clang/20/lib/x86_64-unknown-linux-gnu/libclang_rt.msan.a(msan.cpp.o)' is referenced by DSO '/home/b/sanitizer-x86_64-linux-bootstrap-msan/build/libcxx_build_msan/lib/libc++abi.so'
ld.lld: error: non-exported symbol '__msan_va_arg_overflow_size_tls' in '/home/b/sanitizer-x86_64-linux-bootstrap-msan/build/llvm_build0/lib/clang/20/lib/x86_64-unknown-linux-gnu/libclang_rt.msan.a(msan.cpp.o)' is referenced by DSO '/home/b/sanitizer-x86_64-linux-bootstrap-msan/build/libcxx_build_msan/lib/libc++abi.so'
ld.lld: error: non-exported symbol '__msan_va_arg_tls' in '/home/b/sanitizer-x86_64-linux-bootstrap-msan/build/llvm_build0/lib/clang/20/lib/x86_64-unknown-linux-gnu/libclang_rt.msan.a(msan.cpp.o)' is referenced by DSO '/home/b/sanitizer-x86_64-linux-bootstrap-msan/build/libcxx_build_msan/lib/libc++abi.so'
ld.lld: error: non-exported symbol '__sanitizer_dtor_callback_fields' in '/home/b/sanitizer-x86_64-linux-bootstrap-msan/build/llvm_build0/lib/clang/20/lib/x86_64-unknown-linux-gnu/libclang_rt.msan.a(msan_interceptors.cpp.o)' is referenced by DSO '/home/b/sanitizer-x86_64-linux-bootstrap-msan/build/libcxx_build_msan/lib/libc++abi.so'
ld.lld: error: non-exported symbol '__msan_memset' in '/home/b/sanitizer-x86_64-linux-bootstrap-msan/build/llvm_build0/lib/clang/20/lib/x86_64-unknown-linux-gnu/libclang_rt.msan.a(msan_interceptors.cpp.o)' is referenced by DSO '/home/b/sanitizer-x86_64-linux-bootstrap-msan/build/libcxx_build_msan/lib/libc++abi.so'
ld.lld: error: non-exported symbol '__msan_memmove' in '/home/b/sanitizer-x86_64-linux-bootstrap-msan/build/llvm_build0/lib/clang/20/lib/x86_64-unknown-linux-gnu/libclang_rt.msan.a(msan_interceptors.cpp.o)' is referenced by DSO '/home/b/sanitizer-x86_64-linux-bootstrap-msan/build/libcxx_build_msan/lib/libc++abi.so'
ld.lld: error: non-exported symbol '__msan_memcpy' in '/home/b/sanitizer-x86_64-linux-bootstrap-msan/build/llvm_build0/lib/clang/20/lib/x86_64-unknown-linux-gnu/libclang_rt.msan.a(msan_interceptors.cpp.o)' is referenced by DSO '/home/b/sanitizer-x86_64-linux-bootstrap-msan/build/libcxx_build_msan/lib/libc++abi.so'
ld.lld: error: non-exported symbol '__sanitizer_dtor_callback_vptr' in '/home/b/sanitizer-x86_64-linux-bootstrap-msan/build/llvm_build0/lib/clang/20/lib/x86_64-unknown-linux-gnu/libclang_rt.msan.a(msan_interceptors.cpp.o)' is referenced by DSO '/home/b/sanitizer-x86_64-linux-bootstrap-msan/build/libcxx_build_msan/lib/libc++abi.so'
clang++: error: linker command failed with exit code 1 (use -v to see invocation)
[1119/1300] Building CXX object unittests/Target/AArch64/CMakeFiles/AArch64Tests.dir/AArch64InstPrinterTest.cpp.o
[1120/1300] Building CXX object unittests/ExecutionEngine/Orc/CMakeFiles/OrcJITTests.dir/CoreAPIsTest.cpp.o
[1121/1300] Building CXX object unittests/Support/CMakeFiles/SupportTests.dir/raw_socket_stream_test.cpp.o
[1122/1300] Building CXX object unittests/Target/PowerPC/CMakeFiles/PowerPCTests.dir/AIXRelocModelTest.cpp.o
[1123/1300] Building CXX object unittests/Support/CMakeFiles/SupportTests.dir/KnownBitsTest.cpp.o
[1124/1300] Building CXX object unittests/ProfileData/CMakeFiles/ProfileDataTests.dir/MemProfTest.cpp.o
[1125/1300] Building CXX object unittests/Target/AArch64/CMakeFiles/AArch64Tests.dir/SMEAttributesTest.cpp.o
[1126/1300] Building CXX object unittests/DebugInfo/DWARF/CMakeFiles/DebugInfoDWARFTests.dir/DWARFDebugInfoTest.cpp.o
[1127/1300] Building CXX object unittests/Testing/Support/CMakeFiles/TestingSupportTests.dir/TempPathTest.cpp.o
[1128/1300] Building CXX object unittests/Support/CMakeFiles/SupportTests.dir/FormatVariadicTest.cpp.o
[1129/1300] Building CXX object unittests/Testing/ADT/CMakeFiles/TestingADTTests.dir/StringMapTest.cpp.o
[1130/1300] Building CXX object unittests/Transforms/IPO/CMakeFiles/IPOTests.dir/LowerTypeTests.cpp.o
[1131/1300] Building CXX object unittests/TargetParser/CMakeFiles/TargetParserTests.dir/Host.cpp.o
[1132/1300] Building CXX object unittests/Target/LoongArch/CMakeFiles/LoongArchTests.dir/MCInstrAnalysisTest.cpp.o
[1133/1300] Building CXX object unittests/Support/CMakeFiles/SupportTests.dir/ConvertUTFTest.cpp.o
[1134/1300] Building CXX object unittests/Support/CMakeFiles/SupportTests.dir/UnicodeTest.cpp.o
[1135/1300] Building CXX object unittests/Target/AArch64/CMakeFiles/AArch64Tests.dir/DecomposeStackOffsetTest.cpp.o
[1136/1300] Building CXX object unittests/Transforms/IPO/CMakeFiles/IPOTests.dir/WholeProgramDevirt.cpp.o
[1137/1300] Building CXX object unittests/Testing/ADT/CMakeFiles/TestingADTTests.dir/StringMapEntryTest.cpp.o
[1138/1300] Building CXX object unittests/ProfileData/CMakeFiles/ProfileDataTests.dir/CoverageMappingTest.cpp.o
[1139/1300] Building CXX object unittests/Target/AMDGPU/CMakeFiles/AMDGPUTests.dir/DwarfRegMappings.cpp.o
[1140/1300] Building CXX object unittests/Support/CMakeFiles/SupportTests.dir/LEB128Test.cpp.o
[1141/1300] Building CXX object unittests/Support/CMakeFiles/SupportTests.dir/ThreadPool.cpp.o
[1142/1300] Building CXX object unittests/Target/LoongArch/CMakeFiles/LoongArchTests.dir/InstSizes.cpp.o
[1143/1300] Building CXX object unittests/TextAPI/CMakeFiles/TextAPITests.dir/RecordTests.cpp.o
Step 10 (stage2/msan check) failure: stage2/msan check (failure)
...
[1109/1300] Linking CXX executable unittests/Target/TargetMachineCTests
[1110/1300] Building CXX object unittests/TargetParser/CMakeFiles/TargetParserTests.dir/RISCVTargetParserTest.cpp.o
[1111/1300] Building CXX object unittests/DebugInfo/DWARF/CMakeFiles/DebugInfoDWARFTests.dir/DWARFDebugLineTest.cpp.o
[1112/1300] Building CXX object unittests/TableGen/CMakeFiles/TableGenTests.dir/ParserEntryPointTest.cpp.o
[1113/1300] Building CXX object unittests/Support/CMakeFiles/SupportTests.dir/MemoryTest.cpp.o
[1114/1300] Building CXX object unittests/Support/CMakeFiles/SupportTests.dir/BinaryStreamTest.cpp.o
[1115/1300] Building CXX object unittests/Support/CMakeFiles/SupportTests.dir/YAMLParserTest.cpp.o
[1116/1300] Building CXX object unittests/Support/DynamicLibrary/CMakeFiles/DynamicLibraryTests.dir/DynamicLibraryTest.cpp.o
[1117/1300] Building CXX object unittests/TableGen/CMakeFiles/TableGenTests.dir/CodeExpanderTest.cpp.o
[1118/1300] Linking CXX executable unittests/Support/DynamicLibrary/DynamicLibraryTests
FAILED: unittests/Support/DynamicLibrary/DynamicLibraryTests 
: && /home/b/sanitizer-x86_64-linux-bootstrap-msan/build/llvm_build0/bin/clang++ -nostdinc++ -isystem /home/b/sanitizer-x86_64-linux-bootstrap-msan/build/libcxx_build_msan/include -isystem /home/b/sanitizer-x86_64-linux-bootstrap-msan/build/libcxx_build_msan/include/c++/v1 -fsanitize=memory -Wl,--rpath=/home/b/sanitizer-x86_64-linux-bootstrap-msan/build/libcxx_build_msan/lib -L/home/b/sanitizer-x86_64-linux-bootstrap-msan/build/libcxx_build_msan/lib -w -stdlib=libc++ -fPIC -fno-semantic-interposition -fvisibility-inlines-hidden -Werror=date-time -Werror=unguarded-availability-new -Wall -Wextra -Wno-unused-parameter -Wwrite-strings -Wcast-qual -Wmissing-field-initializers -pedantic -Wno-long-long -Wc++98-compat-extra-semi -Wimplicit-fallthrough -Wcovered-switch-default -Wno-noexcept-type -Wnon-virtual-dtor -Wdelete-non-virtual-dtor -Wsuggest-override -Wstring-conversion -Wmisleading-indentation -Wctad-maybe-unsupported -fno-omit-frame-pointer -gline-tables-only -fsanitize=memory -fdiagnostics-color -ffunction-sections -fdata-sections -O3 -DNDEBUG -Wl,--rpath=/home/b/sanitizer-x86_64-linux-bootstrap-msan/build/libcxx_build_msan/lib -L/home/b/sanitizer-x86_64-linux-bootstrap-msan/build/libcxx_build_msan/lib -stdlib=libc++ -fuse-ld=lld -Wl,--color-diagnostics   -Wl,--export-dynamic  -Wl,--gc-sections  -Wl,--version-script,"/home/b/sanitizer-x86_64-linux-bootstrap-msan/build/llvm_build_msan/unittests/Support/DynamicLibrary/DynamicLibraryTests.exports" unittests/Support/DynamicLibrary/CMakeFiles/DynamicLibraryTests.dir/DynamicLibraryTest.cpp.o -o unittests/Support/DynamicLibrary/DynamicLibraryTests  lib/libLLVMSupport.a  lib/libLLVMSupport.a  lib/libllvm_gtest_main.a  lib/libllvm_gtest.a  lib/libDynamicLibraryLib.a  lib/libLLVMSupport.a  -lrt  -ldl  -lm  lib/libLLVMDemangle.a  -lpthread && :
ld.lld: error: non-exported symbol '__msan_param_tls' in '/home/b/sanitizer-x86_64-linux-bootstrap-msan/build/llvm_build0/lib/clang/20/lib/x86_64-unknown-linux-gnu/libclang_rt.msan.a(msan.cpp.o)' is referenced by DSO '/home/b/sanitizer-x86_64-linux-bootstrap-msan/build/libcxx_build_msan/lib/libc++abi.so'
ld.lld: error: non-exported symbol '__msan_retval_tls' in '/home/b/sanitizer-x86_64-linux-bootstrap-msan/build/llvm_build0/lib/clang/20/lib/x86_64-unknown-linux-gnu/libclang_rt.msan.a(msan.cpp.o)' is referenced by DSO '/home/b/sanitizer-x86_64-linux-bootstrap-msan/build/libcxx_build_msan/lib/libc++abi.so'
ld.lld: error: non-exported symbol '__msan_warning_noreturn' in '/home/b/sanitizer-x86_64-linux-bootstrap-msan/build/llvm_build0/lib/clang/20/lib/x86_64-unknown-linux-gnu/libclang_rt.msan.a(msan.cpp.o)' is referenced by DSO '/home/b/sanitizer-x86_64-linux-bootstrap-msan/build/libcxx_build_msan/lib/libc++abi.so'
ld.lld: error: non-exported symbol '__msan_init' in '/home/b/sanitizer-x86_64-linux-bootstrap-msan/build/llvm_build0/lib/clang/20/lib/x86_64-unknown-linux-gnu/libclang_rt.msan.a(msan.cpp.o)' is referenced by DSO '/home/b/sanitizer-x86_64-linux-bootstrap-msan/build/libcxx_build_msan/lib/libc++abi.so'
ld.lld: error: non-exported symbol '__msan_va_arg_overflow_size_tls' in '/home/b/sanitizer-x86_64-linux-bootstrap-msan/build/llvm_build0/lib/clang/20/lib/x86_64-unknown-linux-gnu/libclang_rt.msan.a(msan.cpp.o)' is referenced by DSO '/home/b/sanitizer-x86_64-linux-bootstrap-msan/build/libcxx_build_msan/lib/libc++abi.so'
ld.lld: error: non-exported symbol '__msan_va_arg_tls' in '/home/b/sanitizer-x86_64-linux-bootstrap-msan/build/llvm_build0/lib/clang/20/lib/x86_64-unknown-linux-gnu/libclang_rt.msan.a(msan.cpp.o)' is referenced by DSO '/home/b/sanitizer-x86_64-linux-bootstrap-msan/build/libcxx_build_msan/lib/libc++abi.so'
ld.lld: error: non-exported symbol '__sanitizer_dtor_callback_fields' in '/home/b/sanitizer-x86_64-linux-bootstrap-msan/build/llvm_build0/lib/clang/20/lib/x86_64-unknown-linux-gnu/libclang_rt.msan.a(msan_interceptors.cpp.o)' is referenced by DSO '/home/b/sanitizer-x86_64-linux-bootstrap-msan/build/libcxx_build_msan/lib/libc++abi.so'
ld.lld: error: non-exported symbol '__msan_memset' in '/home/b/sanitizer-x86_64-linux-bootstrap-msan/build/llvm_build0/lib/clang/20/lib/x86_64-unknown-linux-gnu/libclang_rt.msan.a(msan_interceptors.cpp.o)' is referenced by DSO '/home/b/sanitizer-x86_64-linux-bootstrap-msan/build/libcxx_build_msan/lib/libc++abi.so'
ld.lld: error: non-exported symbol '__msan_memmove' in '/home/b/sanitizer-x86_64-linux-bootstrap-msan/build/llvm_build0/lib/clang/20/lib/x86_64-unknown-linux-gnu/libclang_rt.msan.a(msan_interceptors.cpp.o)' is referenced by DSO '/home/b/sanitizer-x86_64-linux-bootstrap-msan/build/libcxx_build_msan/lib/libc++abi.so'
ld.lld: error: non-exported symbol '__msan_memcpy' in '/home/b/sanitizer-x86_64-linux-bootstrap-msan/build/llvm_build0/lib/clang/20/lib/x86_64-unknown-linux-gnu/libclang_rt.msan.a(msan_interceptors.cpp.o)' is referenced by DSO '/home/b/sanitizer-x86_64-linux-bootstrap-msan/build/libcxx_build_msan/lib/libc++abi.so'
ld.lld: error: non-exported symbol '__sanitizer_dtor_callback_vptr' in '/home/b/sanitizer-x86_64-linux-bootstrap-msan/build/llvm_build0/lib/clang/20/lib/x86_64-unknown-linux-gnu/libclang_rt.msan.a(msan_interceptors.cpp.o)' is referenced by DSO '/home/b/sanitizer-x86_64-linux-bootstrap-msan/build/libcxx_build_msan/lib/libc++abi.so'
clang++: error: linker command failed with exit code 1 (use -v to see invocation)
[1119/1300] Building CXX object unittests/Target/AArch64/CMakeFiles/AArch64Tests.dir/AArch64InstPrinterTest.cpp.o
[1120/1300] Building CXX object unittests/ExecutionEngine/Orc/CMakeFiles/OrcJITTests.dir/CoreAPIsTest.cpp.o
[1121/1300] Building CXX object unittests/Support/CMakeFiles/SupportTests.dir/raw_socket_stream_test.cpp.o
[1122/1300] Building CXX object unittests/Target/PowerPC/CMakeFiles/PowerPCTests.dir/AIXRelocModelTest.cpp.o
[1123/1300] Building CXX object unittests/Support/CMakeFiles/SupportTests.dir/KnownBitsTest.cpp.o
[1124/1300] Building CXX object unittests/ProfileData/CMakeFiles/ProfileDataTests.dir/MemProfTest.cpp.o
[1125/1300] Building CXX object unittests/Target/AArch64/CMakeFiles/AArch64Tests.dir/SMEAttributesTest.cpp.o
[1126/1300] Building CXX object unittests/DebugInfo/DWARF/CMakeFiles/DebugInfoDWARFTests.dir/DWARFDebugInfoTest.cpp.o
[1127/1300] Building CXX object unittests/Testing/Support/CMakeFiles/TestingSupportTests.dir/TempPathTest.cpp.o
[1128/1300] Building CXX object unittests/Support/CMakeFiles/SupportTests.dir/FormatVariadicTest.cpp.o
[1129/1300] Building CXX object unittests/Testing/ADT/CMakeFiles/TestingADTTests.dir/StringMapTest.cpp.o
[1130/1300] Building CXX object unittests/Transforms/IPO/CMakeFiles/IPOTests.dir/LowerTypeTests.cpp.o
[1131/1300] Building CXX object unittests/TargetParser/CMakeFiles/TargetParserTests.dir/Host.cpp.o
[1132/1300] Building CXX object unittests/Target/LoongArch/CMakeFiles/LoongArchTests.dir/MCInstrAnalysisTest.cpp.o
[1133/1300] Building CXX object unittests/Support/CMakeFiles/SupportTests.dir/ConvertUTFTest.cpp.o
[1134/1300] Building CXX object unittests/Support/CMakeFiles/SupportTests.dir/UnicodeTest.cpp.o
[1135/1300] Building CXX object unittests/Target/AArch64/CMakeFiles/AArch64Tests.dir/DecomposeStackOffsetTest.cpp.o
[1136/1300] Building CXX object unittests/Transforms/IPO/CMakeFiles/IPOTests.dir/WholeProgramDevirt.cpp.o
[1137/1300] Building CXX object unittests/Testing/ADT/CMakeFiles/TestingADTTests.dir/StringMapEntryTest.cpp.o
[1138/1300] Building CXX object unittests/ProfileData/CMakeFiles/ProfileDataTests.dir/CoverageMappingTest.cpp.o
[1139/1300] Building CXX object unittests/Target/AMDGPU/CMakeFiles/AMDGPUTests.dir/DwarfRegMappings.cpp.o
[1140/1300] Building CXX object unittests/Support/CMakeFiles/SupportTests.dir/LEB128Test.cpp.o
[1141/1300] Building CXX object unittests/Support/CMakeFiles/SupportTests.dir/ThreadPool.cpp.o
[1142/1300] Building CXX object unittests/Target/LoongArch/CMakeFiles/LoongArchTests.dir/InstSizes.cpp.o
[1143/1300] Building CXX object unittests/TextAPI/CMakeFiles/TextAPITests.dir/RecordTests.cpp.o

```

https://github.com/llvm/llvm-project/pull/102941


More information about the llvm-commits mailing list