[LLVMbugs] Problems in Build

Bill Wendling isanbard at gmail.com
Wed Dec 6 11:58:01 PST 2006

There was a failure in last night's build. Here's the error message:

In function 'void print_llvm(FILE*\
, void*)':
error: cannot convert 'bool' t\
o 'const llvm::Module*' for argument '4' to 'std::ostream&
llvm::WriteAsOperand(std::ostream&, const llvm::Value*, bool\
, const llvm::Module*)'
make[3]: *** [llvm-backend.o] Error 1
make[3]: *** Waiting for unfinished jobs....
rm cpp.pod gpl.pod fsf-funding.pod gcc.pod gfdl.pod gcov.pod
make[2]: *** [stage1_build] Error 2
make[1]: *** [bootstrap] Error 2

Any comments?


More information about the llvm-bugs mailing list