[Lldb-commits] [lldb] [lldb][test] Disable TestConcurrentManySignals.py on AArch64 Linux (PR #222948)

via lldb-commits lldb-commits at lists.llvm.org
Fri Sep 11 07:15:47 PDT 2026


github-actions[bot] wrote:

<!--PREMERGE ADVISOR COMMENT: Windows-->
# :window: Windows x64 Test Results

* 3669 tests passed
* 903 tests skipped
* 1 test failed

## Failed Tests
(click on a test name to see its output)

### lldb-api
<details>
<summary>lldb-api.tools/lldb-server/TestLldbGdbServer.py</summary>

```
Script:
--
C:/Python312/python.exe C:/_work/llvm-project/llvm-project/lldb\test\API\dotest.py -u CXXFLAGS -u CFLAGS --env LLVM_LIBS_DIR=C:/_work/llvm-project/llvm-project/build/./lib --env LLVM_INCLUDE_DIR=C:/_work/llvm-project/llvm-project/build/include --env LLVM_TOOLS_DIR=C:/_work/llvm-project/llvm-project/build/./bin --triple x86_64-pc-windows-msvc --build-dir C:/_work/llvm-project/llvm-project/build/lldb-test-build --lldb-module-cache-dir C:/_work/llvm-project/llvm-project/build/lldb-test-build/module-cache-lldb\lldb-api --clang-module-cache-dir C:/_work/llvm-project/llvm-project/build/lldb-test-build/module-cache-clang\lldb-api --executable C:/_work/llvm-project/llvm-project/build/./bin/lldb.exe --lldb-python-dir C:\_work\llvm-project\llvm-project\build\Lib\site-packages --compiler C:/_work/llvm-project/llvm-project/build/./bin/clang.exe --dsymutil C:/_work/llvm-project/llvm-project/build/./bin/dsymutil.exe --make C:/ProgramData/chocolatey/bin/make.exe --llvm-tools-dir C:/_work/llvm-project/llvm-project/build/./bin --lldb-obj-root C:/_work/llvm-project/llvm-project/build/tools/lldb --lldb-libs-dir C:/_work/llvm-project/llvm-project/build/./lib --cmake-build-type Release --env LLDB_LAUNCH_FLAG_USE_PIPES=1 C:\_work\llvm-project\llvm-project\lldb\test\API\tools\lldb-server -p TestLldbGdbServer.py --timeout 1200
--
Exit Code: 1

Command Output (stdout):
--
Skipping the following test categories: libc++, libstdcxx, dwo, dsym, gmodules, debugserver, objc, fork, pexpect


--
Command Output (stderr):
--
UNSUPPORTED: LLDB (C:\_work\llvm-project\llvm-project\build\bin\clang.exe-x86_64) :: test_Hc_then_Csignal_signals_correct_thread_launch_debugserver (TestLldbGdbServer.LldbGdbServerTestCase.test_Hc_then_Csignal_signals_correct_thread_launch_debugserver) (test case does not fall in any category of interest for this run) 

UNSUPPORTED: LLDB (C:\_work\llvm-project\llvm-project\build\bin\clang.exe-x86_64) :: test_Hc_then_Csignal_signals_correct_thread_launch_llgs (TestLldbGdbServer.LldbGdbServerTestCase.test_Hc_then_Csignal_signals_correct_thread_launch_llgs) (unsupported on windows, wasip1, wasi) 

PASS: LLDB (C:\_work\llvm-project\llvm-project\build\bin\clang.exe-x86_64) :: test_Hg_fails_on_another_pid_llgs (TestLldbGdbServer.LldbGdbServerTestCase.test_Hg_fails_on_another_pid_llgs)

SKIPPED: LLDB (C:\_work\llvm-project\llvm-project\build\bin\clang.exe-x86_64) :: test_Hg_fails_on_minus_one_pid_llgs (TestLldbGdbServer.LldbGdbServerTestCase.test_Hg_fails_on_minus_one_pid_llgs) (skip on windows) 

PASS: LLDB (C:\_work\llvm-project\llvm-project\build\bin\clang.exe-x86_64) :: test_Hg_fails_on_zero_pid_llgs (TestLldbGdbServer.LldbGdbServerTestCase.test_Hg_fails_on_zero_pid_llgs)

UNSUPPORTED: LLDB (C:\_work\llvm-project\llvm-project\build\bin\clang.exe-x86_64) :: test_Hg_switches_to_3_threads_launch_debugserver (TestLldbGdbServer.LldbGdbServerTestCase.test_Hg_switches_to_3_threads_launch_debugserver) (test case does not fall in any category of interest for this run) 

SKIPPED: LLDB (C:\_work\llvm-project\llvm-project\build\bin\clang.exe-x86_64) :: test_Hg_switches_to_3_threads_launch_llgs (TestLldbGdbServer.LldbGdbServerTestCase.test_Hg_switches_to_3_threads_launch_llgs) (skipping due to the following parameter(s): target o/s [github.com/llvm/llvm-project/issues/138085]) 

Log Files:

 - C:\_work\llvm-project\llvm-project\build\lldb-test-build\tools\lldb-server\TestLldbGdbServer.test_Hg_switches_to_3_threads_launch_llgs\SkippedTest_test_Hg_switches_to_3_threads_launch_llgs.log

UNSUPPORTED: LLDB (C:\_work\llvm-project\llvm-project\build\bin\clang.exe-x86_64) :: test_P_and_p_thread_suffix_work_debugserver (TestLldbGdbServer.LldbGdbServerTestCase.test_P_and_p_thread_suffix_work_debugserver) (test case does not fall in any category of interest for this run) 

SKIPPED: LLDB (C:\_work\llvm-project\llvm-project\build\bin\clang.exe-x86_64) :: test_P_and_p_thread_suffix_work_llgs (TestLldbGdbServer.LldbGdbServerTestCase.test_P_and_p_thread_suffix_work_llgs) (skip on windows) 

UNSUPPORTED: LLDB (C:\_work\llvm-project\llvm-project\build\bin\clang.exe-x86_64) :: test_P_writes_all_gpr_registers_debugserver (TestLldbGdbServer.LldbGdbServerTestCase.test_P_writes_all_gpr_registers_debugserver) (test case does not fall in any category of interest for this run) 

PASS: LLDB (C:\_work\llvm-project\llvm-project\build\bin\clang.exe-x86_64) :: test_P_writes_all_gpr_registers_llgs (TestLldbGdbServer.LldbGdbServerTestCase.test_P_writes_all_gpr_registers_llgs)

UNSUPPORTED: LLDB (C:\_work\llvm-project\llvm-project\build\bin\clang.exe-x86_64) :: test_attach_commandline_continue_app_exits_debugserver (TestLldbGdbServer.LldbGdbServerTestCase.test_attach_commandline_continue_app_exits_debugserver) (test case does not fall in any category of interest for this run) 

SKIPPED: LLDB (C:\_work\llvm-project\llvm-project\build\bin\clang.exe-x86_64) :: test_attach_commandline_continue_app_exits_llgs (TestLldbGdbServer.LldbGdbServerTestCase.test_attach_commandline_continue_app_exits_llgs) (skipping due to the following parameter(s): target o/s [github.com/llvm/llvm-project/issues/138085]) 

Log Files:

 - C:\_work\llvm-project\llvm-project\build\lldb-test-build\tools\lldb-server\TestLldbGdbServer.test_attach_commandline_continue_app_exits_llgs\SkippedTest_test_attach_commandline_continue_app_exits_llgs.log

UNSUPPORTED: LLDB (C:\_work\llvm-project\llvm-project\build\bin\clang.exe-x86_64) :: test_c_packet_works_debugserver (TestLldbGdbServer.LldbGdbServerTestCase.test_c_packet_works_debugserver) (test case does not fall in any category of interest for this run) 

FAIL: LLDB (C:\_work\llvm-project\llvm-project\build\bin\clang.exe-x86_64) :: test_c_packet_works_llgs (TestLldbGdbServer.LldbGdbServerTestCase.test_c_packet_works_llgs)

Log Files:

 - C:\_work\llvm-project\llvm-project\build\lldb-test-build\tools\lldb-server\TestLldbGdbServer.test_c_packet_works_llgs\Failure_test_c_packet_works_llgs.log

UNSUPPORTED: LLDB (C:\_work\llvm-project\llvm-project\build\bin\clang.exe-x86_64) :: test_first_launch_stop_reply_thread_matches_first_qC_debugserver (TestLldbGdbServer.LldbGdbServerTestCase.test_first_launch_stop_reply_thread_matches_first_qC_debugserver) (test case does not fall in any category of interest for this run) 

SKIPPED: LLDB (C:\_work\llvm-project\llvm-project\build\bin\clang.exe-x86_64) :: test_first_launch_stop_reply_thread_matches_first_qC_llgs (TestLldbGdbServer.LldbGdbServerTestCase.test_first_launch_stop_reply_thread_matches_first_qC_llgs) (skip on windows) 

UNSUPPORTED: LLDB (C:\_work\llvm-project\llvm-project\build\bin\clang.exe-x86_64) :: test_hardware_breakpoint_set_and_remove_work_debugserver (TestLldbGdbServer.LldbGdbServerTestCase.test_hardware_breakpoint_set_and_remove_work_debugserver) (test case does not fall in any category of interest for this run) 

SKIPPED: LLDB (C:\_work\llvm-project\llvm-project\build\bin\clang.exe-x86_64) :: test_hardware_breakpoint_set_and_remove_work_llgs (TestLldbGdbServer.LldbGdbServerTestCase.test_hardware_breakpoint_set_and_remove_work_llgs) (requires one of linux) 

UNSUPPORTED: LLDB (C:\_work\llvm-project\llvm-project\build\bin\clang.exe-x86_64) :: test_inferior_print_exit_debugserver (TestLldbGdbServer.LldbGdbServerTestCase.test_inferior_print_exit_debugserver) (test case does not fall in any category of interest for this run) 

SKIPPED: LLDB (C:\_work\llvm-project\llvm-project\build\bin\clang.exe-x86_64) :: test_inferior_print_exit_llgs (TestLldbGdbServer.LldbGdbServerTestCase.test_inferior_print_exit_llgs) (skip on windows) 

UNSUPPORTED: LLDB (C:\_work\llvm-project\llvm-project\build\bin\clang.exe-x86_64) :: test_list_threads_in_stop_reply_supported_debugserver (TestLldbGdbServer.LldbGdbServerTestCase.test_list_threads_in_stop_reply_supported_debugserver) (test case does not fall in any category of interest for this run) 

PASS: LLDB (C:\_work\llvm-project\llvm-project\build\bin\clang.exe-x86_64) :: test_list_threads_in_stop_reply_supported_llgs (TestLldbGdbServer.LldbGdbServerTestCase.test_list_threads_in_stop_reply_supported_llgs)

UNSUPPORTED: LLDB (C:\_work\llvm-project\llvm-project\build\bin\clang.exe-x86_64) :: test_m_packet_reads_memory_debugserver (TestLldbGdbServer.LldbGdbServerTestCase.test_m_packet_reads_memory_debugserver) (test case does not fall in any category of interest for this run) 

SKIPPED: LLDB (C:\_work\llvm-project\llvm-project\build\bin\clang.exe-x86_64) :: test_m_packet_reads_memory_llgs (TestLldbGdbServer.LldbGdbServerTestCase.test_m_packet_reads_memory_llgs) (skip on windows) 

UNSUPPORTED: LLDB (C:\_work\llvm-project\llvm-project\build\bin\clang.exe-x86_64) :: test_p_returns_correct_data_size_for_each_qRegisterInfo_launch_debugserver (TestLldbGdbServer.LldbGdbServerTestCase.test_p_returns_correct_data_size_for_each_qRegisterInfo_launch_debugserver) (test case does not fall in any category of interest for this run) 

PASS: LLDB (C:\_work\llvm-project\llvm-project\build\bin\clang.exe-x86_64) :: test_p_returns_correct_data_size_for_each_qRegisterInfo_launch_llgs (TestLldbGdbServer.LldbGdbServerTestCase.test_p_returns_correct_data_size_for_each_qRegisterInfo_launch_llgs)

UNSUPPORTED: LLDB (C:\_work\llvm-project\llvm-project\build\bin\clang.exe-x86_64) :: test_qThreadInfo_contains_thread_attach_debugserver (TestLldbGdbServer.LldbGdbServerTestCase.test_qThreadInfo_contains_thread_attach_debugserver) (test case does not fall in any category of interest for this run) 

XFAIL: LLDB (C:\_work\llvm-project\llvm-project\build\bin\clang.exe-x86_64) :: test_qThreadInfo_contains_thread_attach_llgs (TestLldbGdbServer.LldbGdbServerTestCase.test_qThreadInfo_contains_thread_attach_llgs)

Log Files:

 - C:\_work\llvm-project\llvm-project\build\lldb-test-build\tools\lldb-server\TestLldbGdbServer.test_qThreadInfo_contains_thread_attach_llgs\ExpectedFailure_test_qThreadInfo_contains_thread_attach_llgs.log

UNSUPPORTED: LLDB (C:\_work\llvm-project\llvm-project\build\bin\clang.exe-x86_64) :: test_qThreadInfo_contains_thread_launch_debugserver (TestLldbGdbServer.LldbGdbServerTestCase.test_qThreadInfo_contains_thread_launch_debugserver) (test case does not fall in any category of interest for this run) 

PASS: LLDB (C:\_work\llvm-project\llvm-project\build\bin\clang.exe-x86_64) :: test_qThreadInfo_contains_thread_launch_llgs (TestLldbGdbServer.LldbGdbServerTestCase.test_qThreadInfo_contains_thread_launch_llgs)

UNSUPPORTED: LLDB (C:\_work\llvm-project\llvm-project\build\bin\clang.exe-x86_64) :: test_qThreadInfo_matches_qC_attach_debugserver (TestLldbGdbServer.LldbGdbServerTestCase.test_qThreadInfo_matches_qC_attach_debugserver) (test case does not fall in any category of interest for this run) 

XFAIL: LLDB (C:\_work\llvm-project\llvm-project\build\bin\clang.exe-x86_64) :: test_qThreadInfo_matches_qC_attach_llgs (TestLldbGdbServer.LldbGdbServerTestCase.test_qThreadInfo_matches_qC_attach_llgs)

Log Files:

 - C:\_work\llvm-project\llvm-project\build\lldb-test-build\tools\lldb-server\TestLldbGdbServer.test_qThreadInfo_matches_qC_attach_llgs\ExpectedFailure_test_qThreadInfo_matches_qC_attach_llgs.log

UNSUPPORTED: LLDB (C:\_work\llvm-project\llvm-project\build\bin\clang.exe-x86_64) :: test_qThreadInfo_matches_qC_launch_debugserver (TestLldbGdbServer.LldbGdbServerTestCase.test_qThreadInfo_matches_qC_launch_debugserver) (test case does not fall in any category of interest for this run) 

PASS: LLDB (C:\_work\llvm-project\llvm-project\build\bin\clang.exe-x86_64) :: test_qThreadInfo_matches_qC_launch_llgs (TestLldbGdbServer.LldbGdbServerTestCase.test_qThreadInfo_matches_qC_launch_llgs)

SKIPPED: LLDB (C:\_work\llvm-project\llvm-project\build\bin\clang.exe-x86_64) :: test_qXfer_siginfo_read_llgs (TestLldbGdbServer.LldbGdbServerTestCase.test_qXfer_siginfo_read_llgs) (requires one of freebsd, linux) 

UNSUPPORTED: LLDB (C:\_work\llvm-project\llvm-project\build\bin\clang.exe-x86_64) :: test_software_breakpoint_set_and_remove_work_debugserver (TestLldbGdbServer.LldbGdbServerTestCase.test_software_breakpoint_set_and_remove_work_debugserver) (test case does not fall in any category of interest for this run) 

SKIPPED: LLDB (C:\_work\llvm-project\llvm-project\build\bin\clang.exe-x86_64) :: test_software_breakpoint_set_and_remove_work_llgs (TestLldbGdbServer.LldbGdbServerTestCase.test_software_breakpoint_set_and_remove_work_llgs) (skip on windows) 

UNSUPPORTED: LLDB (C:\_work\llvm-project\llvm-project\build\bin\clang.exe-x86_64) :: test_thread_suffix_supported_debugserver (TestLldbGdbServer.LldbGdbServerTestCase.test_thread_suffix_supported_debugserver) (test case does not fall in any category of interest for this run) 

PASS: LLDB (C:\_work\llvm-project\llvm-project\build\bin\clang.exe-x86_64) :: test_thread_suffix_supported_llgs (TestLldbGdbServer.LldbGdbServerTestCase.test_thread_suffix_supported_llgs)

UNSUPPORTED: LLDB (C:\_work\llvm-project\llvm-project\build\bin\clang.exe-x86_64) :: test_written_M_content_reads_back_correctly_debugserver (TestLldbGdbServer.LldbGdbServerTestCase.test_written_M_content_reads_back_correctly_debugserver) (test case does not fall in any category of interest for this run) 

SKIPPED: LLDB (C:\_work\llvm-project\llvm-project\build\bin\clang.exe-x86_64) :: test_written_M_content_reads_back_correctly_llgs (TestLldbGdbServer.LldbGdbServerTestCase.test_written_M_content_reads_back_correctly_llgs) (skip on windows) 

======================================================================

FAIL: test_c_packet_works_llgs (TestLldbGdbServer.LldbGdbServerTestCase.test_c_packet_works_llgs)

----------------------------------------------------------------------

Traceback (most recent call last):

  File "C:\_work\llvm-project\llvm-project\lldb\packages\Python\lldbsuite\test\tools\lldb-server\lldbgdbserverutils.py", line 168, in expect_lldb_gdbserver_replay

    content = server.get_raw_normal_packet()

              ^^^^^^^^^^^^^^^^^^^^^^^^^^^^^^

  File "C:\_work\llvm-project\llvm-project\lldb\packages\Python\lldbsuite\test\tools\lldb-server\lldbgdbserverutils.py", line 936, in get_raw_normal_packet

    return self._read(self._normal_queue)

           ^^^^^^^^^^^^^^^^^^^^^^^^^^^^^^

  File "C:\_work\llvm-project\llvm-project\lldb\packages\Python\lldbsuite\test\tools\lldb-server\lldbgdbserverutils.py", line 889, in _read

    new_bytes = self._sock.recv(4096)

                ^^^^^^^^^^^^^^^^^^^^^

TimeoutError: timed out



During handling of the above exception, another exception occurred:



Traceback (most recent call last):

  File "C:\_work\llvm-project\llvm-project\lldb\packages\Python\lldbsuite\test\tools\lldb-server\gdbremote_testcase.py", line 49, in test_method

    return attrvalue(self)

           ^^^^^^^^^^^^^^^

  File "C:\_work\llvm-project\llvm-project\lldb\test\API\tools\lldb-server\TestLldbGdbServer.py", line 70, in test_c_packet_works

    self.expect_gdbremote_sequence()

  File "C:\_work\llvm-project\llvm-project\lldb\packages\Python\lldbsuite\test\tools\lldb-server\gdbremote_testcase.py", line 677, in expect_gdbremote_sequence

    return expect_lldb_gdbserver_replay(

           ^^^^^^^^^^^^^^^^^^^^^^^^^^^^^

  File "C:\_work\llvm-project\llvm-project\lldb\packages\Python\lldbsuite\test\tools\lldb-server\lldbgdbserverutils.py", line 171, in expect_lldb_gdbserver_replay

    asserter.fail(

AssertionError: timed out while waiting for '<lldbgdbserverutils.GdbRemoteEntry object at 0x0000021CDFF9CD10>':

server '<lldbsuite.test.lldbtest._LocalProcess object at 0x0000021CDFF9CBC0>' on '<socket.socket fd=1044, family=23, type=0, proto=0, laddr=('::1', 55495, 0, 0), raddr=('::1', 55496, 0, 0)>'

_receive_buffer: b''

_normal_queue: []

_output_queue: []

_accumulated_output: b''



Config=x86_64-C:\_work\llvm-project\llvm-project\build\bin\clang.exe

----------------------------------------------------------------------

Ran 42 tests in 68.331s



FAILED (failures=1, skipped=31, expected failures=2)

Skip breakdown (unsupported=20, skipped=11)


--

```
</details>

If these failures are unrelated to your changes (for example tests are broken or flaky at HEAD), please open an issue at https://github.com/llvm/llvm-project/issues and add the `infrastructure` label.

https://github.com/llvm/llvm-project/pull/222948


More information about the lldb-commits mailing list