[Lldb-commits] [lldb] [lldb] Add accelerator dynamic loader over gdb-remote (PR #217393)
via lldb-commits
lldb-commits at lists.llvm.org
Wed Aug 19 10:46:47 PDT 2026
github-actions[bot] wrote:
<!--PREMERGE ADVISOR COMMENT: Linux-->
# :penguin: Linux x64 Test Results
* 34209 tests passed
* 511 tests skipped
* 1 test failed
## Failed Tests
(click on a test name to see its output)
### lldb-api
<details>
<summary>lldb-api.accelerator/dynamic_loader/TestAcceleratorDynamicLoader.py</summary>
```
Script:
--
/usr/bin/python3 /home/gha/actions-runner/_work/llvm-project/llvm-project/lldb/test/API/dotest.py -u CXXFLAGS -u CFLAGS --env LLVM_LIBS_DIR=/home/gha/actions-runner/_work/llvm-project/llvm-project/build/./lib --env LLVM_INCLUDE_DIR=/home/gha/actions-runner/_work/llvm-project/llvm-project/build/include --env LLVM_TOOLS_DIR=/home/gha/actions-runner/_work/llvm-project/llvm-project/build/./bin --libcxx-include-dir /home/gha/actions-runner/_work/llvm-project/llvm-project/build/include/c++/v1 --libcxx-include-target-dir /home/gha/actions-runner/_work/llvm-project/llvm-project/build/include/x86_64-unknown-linux-gnu/c++/v1 --libcxx-library-dir /home/gha/actions-runner/_work/llvm-project/llvm-project/build/./lib/x86_64-unknown-linux-gnu --triple x86_64-unknown-linux-gnu --build-dir /home/gha/actions-runner/_work/llvm-project/llvm-project/build/lldb-test-build --lldb-module-cache-dir /home/gha/actions-runner/_work/llvm-project/llvm-project/build/lldb-test-build/module-cache-lldb/lldb-api --clang-module-cache-dir /home/gha/actions-runner/_work/llvm-project/llvm-project/build/lldb-test-build/module-cache-clang/lldb-api --executable /home/gha/actions-runner/_work/llvm-project/llvm-project/build/./bin/lldb --lldb-python-dir /home/gha/actions-runner/_work/llvm-project/llvm-project/build/local/lib/python3.12/dist-packages --compiler /home/gha/actions-runner/_work/llvm-project/llvm-project/build/./bin/clang --dsymutil /home/gha/actions-runner/_work/llvm-project/llvm-project/build/./bin/dsymutil --make /usr/bin/gmake --llvm-tools-dir /home/gha/actions-runner/_work/llvm-project/llvm-project/build/./bin --lldb-obj-root /home/gha/actions-runner/_work/llvm-project/llvm-project/build/tools/lldb --lldb-libs-dir /home/gha/actions-runner/_work/llvm-project/llvm-project/build/./lib --cmake-build-type Release /home/gha/actions-runner/_work/llvm-project/llvm-project/lldb/test/API/accelerator/dynamic_loader -p TestAcceleratorDynamicLoader.py --timeout 1200
--
Exit Code: 1
Command Output (stdout):
--
Skipping the following test categories: msvcstl, dsym, pdb, gmodules, debugserver, objc
--
Command Output (stderr):
--
FAIL: LLDB (/home/gha/actions-runner/_work/llvm-project/llvm-project/build/bin/clang-x86_64) :: test_library_in_container (TestAcceleratorDynamicLoader.TestAcceleratorDynamicLoader.test_library_in_container)
Log Files:
- /home/gha/actions-runner/_work/llvm-project/llvm-project/build/lldb-test-build/accelerator/dynamic_loader/TestAcceleratorDynamicLoader/Failure_test_library_in_container.log
PASS: LLDB (/home/gha/actions-runner/_work/llvm-project/llvm-project/build/bin/clang-x86_64) :: test_not_selected_for_host_target (TestAcceleratorDynamicLoader.TestAcceleratorDynamicLoader.test_not_selected_for_host_target)
PASS: LLDB (/home/gha/actions-runner/_work/llvm-project/llvm-project/build/bin/clang-x86_64) :: test_whole_file_library (TestAcceleratorDynamicLoader.TestAcceleratorDynamicLoader.test_whole_file_library)
======================================================================
FAIL: test_library_in_container (TestAcceleratorDynamicLoader.TestAcceleratorDynamicLoader.test_library_in_container)
A library embedded in a container file is located by offset/size.
----------------------------------------------------------------------
Traceback (most recent call last):
File "/home/gha/actions-runner/_work/llvm-project/llvm-project/lldb/test/API/accelerator/dynamic_loader/TestAcceleratorDynamicLoader.py", line 140, in test_library_in_container
self.assert_text_loaded_at(target, module, 0x20003000)
File "/home/gha/actions-runner/_work/llvm-project/llvm-project/lldb/test/API/accelerator/dynamic_loader/TestAcceleratorDynamicLoader.py", line 105, in assert_text_loaded_at
self.assertEqual(section.GetLoadAddress(target), expected)
AssertionError: 536875008 != 536883200
Config=x86_64-/home/gha/actions-runner/_work/llvm-project/llvm-project/build/bin/clang
----------------------------------------------------------------------
Ran 3 tests in 0.257s
FAILED (failures=1)
--
```
</details>
If these failures are unrelated to your changes (for example tests are broken or flaky at HEAD), please open an issue at https://github.com/llvm/llvm-project/issues and add the `infrastructure` label.
https://github.com/llvm/llvm-project/pull/217393
More information about the lldb-commits
mailing list