[Lldb-commits] [lldb] [lldb/script] Migrate frame recognizers onto ScriptedPythonInterface (PR #209805)
LLVM Continuous Integration via lldb-commits
lldb-commits at lists.llvm.org
Tue Aug 4 02:06:25 PDT 2026
llvm-ci wrote:
LLVM Buildbot has detected a new failure on builder `lldb-arm-ubuntu` running on `linaro-lldb-arm-ubuntu` while building `lldb` at step 6 "test".
Full details are available at: https://lab.llvm.org/buildbot/#/builders/18/builds/26390
<details>
<summary>Here is the relevant piece of the build log for the reference</summary>
```
Step 6 (test) failure: build (failure)
...
PASS: lldb-api :: functionalities/rerun_and_expr_dylib/TestRerunAndExprDylib.py (657 of 2938)
PASS: lldb-api :: functionalities/reverse-execution/TestReverseContinueWatchpoints.py (658 of 2938)
PASS: lldb-api :: functionalities/reverse-execution/TestReverseContinueBreakpoints.py (659 of 2938)
PASS: lldb-api :: functionalities/return-value/TestReturnValue.py (660 of 2938)
PASS: lldb-api :: functionalities/reverse-execution/TestReverseExecutionNotSupported.py (661 of 2938)
PASS: lldb-api :: functionalities/recursion/TestValueObjectRecursion.py (662 of 2938)
PASS: lldb-api :: functionalities/scripted_frame_provider/register_command_status/TestFrameProviderRegisterCommandStatus.py (663 of 2938)
PASS: lldb-api :: functionalities/scripted_frame_provider/runlock_reentrant_deadlock/TestRunLockReentrantDeadlock.py (664 of 2938)
UNSUPPORTED: lldb-api :: functionalities/scripted_frame_provider/thread_filter/TestFrameProviderThreadFilter.py (665 of 2938)
PASS: lldb-api :: functionalities/scripted_frame_provider/was_hit_deadlock/TestWasHitWithFrameProviderDeadlock.py (666 of 2938)
FAIL: lldb-api :: functionalities/scripted_frame_provider/circular_dependency/TestFrameProviderCircularDependency.py (667 of 2938)
******************** TEST 'lldb-api :: functionalities/scripted_frame_provider/circular_dependency/TestFrameProviderCircularDependency.py' FAILED ********************
Script:
--
/usr/bin/python3.10 /home/tcwg-buildbot/worker/lldb-arm-ubuntu/llvm-project/lldb/test/API/dotest.py -u CXXFLAGS -u CFLAGS --env LLVM_LIBS_DIR=/home/tcwg-buildbot/worker/lldb-arm-ubuntu/build/./lib --env LLVM_INCLUDE_DIR=/home/tcwg-buildbot/worker/lldb-arm-ubuntu/build/include --env LLVM_TOOLS_DIR=/home/tcwg-buildbot/worker/lldb-arm-ubuntu/build/./bin --triple armv8l-unknown-linux-gnueabihf --build-dir /home/tcwg-buildbot/worker/lldb-arm-ubuntu/build/lldb-test-build --lldb-module-cache-dir /home/tcwg-buildbot/worker/lldb-arm-ubuntu/build/lldb-test-build/module-cache-lldb/lldb-api --clang-module-cache-dir /home/tcwg-buildbot/worker/lldb-arm-ubuntu/build/lldb-test-build/module-cache-clang/lldb-api --executable /home/tcwg-buildbot/worker/lldb-arm-ubuntu/build/./bin/lldb --lldb-python-dir /home/tcwg-buildbot/worker/lldb-arm-ubuntu/build/local/lib/python3.10/dist-packages --compiler /home/tcwg-buildbot/worker/lldb-arm-ubuntu/build/./bin/clang --dsymutil /home/tcwg-buildbot/worker/lldb-arm-ubuntu/build/./bin/dsymutil --make /usr/bin/gmake --llvm-tools-dir /home/tcwg-buildbot/worker/lldb-arm-ubuntu/build/./bin --lldb-obj-root /home/tcwg-buildbot/worker/lldb-arm-ubuntu/build/tools/lldb --lldb-libs-dir /home/tcwg-buildbot/worker/lldb-arm-ubuntu/build/./lib --cmake-build-type Release /home/tcwg-buildbot/worker/lldb-arm-ubuntu/llvm-project/lldb/test/API/functionalities/scripted_frame_provider/circular_dependency -p TestFrameProviderCircularDependency.py
--
Exit Code: 1
Command Output (stdout):
--
Skipping the following test categories: libc++, msvcstl, dsym, pdb, gmodules, debugserver, objc
--
Command Output (stderr):
--
FAIL: LLDB (/home/tcwg-buildbot/worker/lldb-arm-ubuntu/build/bin/clang-arm) :: test_circular_dependency_evaluate_expression_in_get_frame (TestFrameProviderCircularDependency.FrameProviderCircularDependencyTestCase)
Log Files:
- /home/tcwg-buildbot/worker/lldb-arm-ubuntu/build/lldb-test-build/functionalities/scripted_frame_provider/circular_dependency/TestFrameProviderCircularDependency/Failure_test_circular_dependency_evaluate_expression_in_get_frame.log
PASS: LLDB (/home/tcwg-buildbot/worker/lldb-arm-ubuntu/build/bin/clang-arm) :: test_circular_dependency_handle_command_in_init (TestFrameProviderCircularDependency.FrameProviderCircularDependencyTestCase)
PASS: LLDB (/home/tcwg-buildbot/worker/lldb-arm-ubuntu/build/bin/clang-arm) :: test_circular_dependency_with_function_replacement (TestFrameProviderCircularDependency.FrameProviderCircularDependencyTestCase)
======================================================================
FAIL: test_circular_dependency_evaluate_expression_in_get_frame (TestFrameProviderCircularDependency.FrameProviderCircularDependencyTestCase)
Test that calling EvaluateExpression in get_frame_at_index doesn't
----------------------------------------------------------------------
Traceback (most recent call last):
File "/home/tcwg-buildbot/worker/lldb-arm-ubuntu/llvm-project/lldb/test/API/functionalities/scripted_frame_provider/circular_dependency/TestFrameProviderCircularDependency.py", line 204, in test_circular_dependency_evaluate_expression_in_get_frame
self.assertIsNotNone(
AssertionError: unexpectedly None : Frame 1 should have function name
Config=arm-/home/tcwg-buildbot/worker/lldb-arm-ubuntu/build/bin/clang
----------------------------------------------------------------------
Ran 3 tests in 47.178s
FAILED (failures=1)
--
********************
UNSUPPORTED: lldb-api :: functionalities/scripted_process/TestStackCoreScriptedProcess.py (668 of 2938)
UNSUPPORTED: lldb-api :: functionalities/scripted_process_empty_memory_region/TestScriptedProcessEmptyMemoryRegion.py (669 of 2938)
```
</details>
https://github.com/llvm/llvm-project/pull/209805
More information about the lldb-commits
mailing list