[Lldb-commits] [lldb] [lldb][test] Move DAP processes to own group to avoid random SIGHUPs (PR #195816)
via lldb-commits
lldb-commits at lists.llvm.org
Wed May 6 05:21:17 PDT 2026
github-actions[bot] wrote:
<!--PREMERGE ADVISOR COMMENT: Linux-->
# :penguin: Linux x64 Test Results
* 33454 tests passed
* 533 tests skipped
* 1 test failed
## Failed Tests
(click on a test name to see its output)
### lldb-api
<details>
<summary>lldb-api.tools/lldb-server/commandline/TestStubSetSID.py</summary>
```
Script:
--
/usr/bin/python3 /home/gha/actions-runner/_work/llvm-project/llvm-project/lldb/test/API/dotest.py -u CXXFLAGS -u CFLAGS --env LLVM_LIBS_DIR=/home/gha/actions-runner/_work/llvm-project/llvm-project/build/./lib --env LLVM_INCLUDE_DIR=/home/gha/actions-runner/_work/llvm-project/llvm-project/build/include --env LLVM_TOOLS_DIR=/home/gha/actions-runner/_work/llvm-project/llvm-project/build/./bin --libcxx-include-dir /home/gha/actions-runner/_work/llvm-project/llvm-project/build/include/c++/v1 --libcxx-include-target-dir /home/gha/actions-runner/_work/llvm-project/llvm-project/build/include/x86_64-unknown-linux-gnu/c++/v1 --libcxx-library-dir /home/gha/actions-runner/_work/llvm-project/llvm-project/build/./lib/x86_64-unknown-linux-gnu --triple x86_64-unknown-linux-gnu --build-dir /home/gha/actions-runner/_work/llvm-project/llvm-project/build/lldb-test-build.noindex --lldb-module-cache-dir /home/gha/actions-runner/_work/llvm-project/llvm-project/build/lldb-test-build.noindex/module-cache-lldb/lldb-api --clang-module-cache-dir /home/gha/actions-runner/_work/llvm-project/llvm-project/build/lldb-test-build.noindex/module-cache-clang/lldb-api --executable /home/gha/actions-runner/_work/llvm-project/llvm-project/build/./bin/lldb --compiler /home/gha/actions-runner/_work/llvm-project/llvm-project/build/./bin/clang --dsymutil /home/gha/actions-runner/_work/llvm-project/llvm-project/build/./bin/dsymutil --make /usr/bin/gmake --llvm-tools-dir /home/gha/actions-runner/_work/llvm-project/llvm-project/build/./bin --lldb-obj-root /home/gha/actions-runner/_work/llvm-project/llvm-project/build/tools/lldb --lldb-libs-dir /home/gha/actions-runner/_work/llvm-project/llvm-project/build/./lib --cmake-build-type Release /home/gha/actions-runner/_work/llvm-project/llvm-project/lldb/test/API/tools/lldb-server/commandline -p TestStubSetSID.py
--
Exit Code: 1
Command Output (stdout):
--
lldb version 23.0.0git (https://github.com/llvm/llvm-project revision 3847553ba2387715e32a1b8aee7097bebaf96864)
clang revision 3847553ba2387715e32a1b8aee7097bebaf96864
llvm revision 3847553ba2387715e32a1b8aee7097bebaf96864
Skipping the following test categories: msvcstl, dsym, pdb, gmodules, debugserver, objc
--
Command Output (stderr):
--
UNSUPPORTED: LLDB (/home/gha/actions-runner/_work/llvm-project/llvm-project/build/bin/clang-x86_64) :: test_sid_is_different_with_S_llgs_debugserver (TestStubSetSID.TestStubSetSIDTestCase.test_sid_is_different_with_S_llgs_debugserver) (test case does not fall in any category of interest for this run)
warning: failed to set new session id for lldb-server (Inappropriate ioctl for device)
PASS: LLDB (/home/gha/actions-runner/_work/llvm-project/llvm-project/build/bin/clang-x86_64) :: test_sid_is_different_with_S_llgs_llgs (TestStubSetSID.TestStubSetSIDTestCase.test_sid_is_different_with_S_llgs_llgs)
UNSUPPORTED: LLDB (/home/gha/actions-runner/_work/llvm-project/llvm-project/build/bin/clang-x86_64) :: test_sid_is_different_with_setsid_debugserver (TestStubSetSID.TestStubSetSIDTestCase.test_sid_is_different_with_setsid_debugserver) (test case does not fall in any category of interest for this run)
warning: failed to set new session id for lldb-server (Inappropriate ioctl for device)
PASS: LLDB (/home/gha/actions-runner/_work/llvm-project/llvm-project/build/bin/clang-x86_64) :: test_sid_is_different_with_setsid_llgs (TestStubSetSID.TestStubSetSIDTestCase.test_sid_is_different_with_setsid_llgs)
UNSUPPORTED: LLDB (/home/gha/actions-runner/_work/llvm-project/llvm-project/build/bin/clang-x86_64) :: test_sid_is_same_without_setsid_debugserver (TestStubSetSID.TestStubSetSIDTestCase.test_sid_is_same_without_setsid_debugserver) (test case does not fall in any category of interest for this run)
FAIL: LLDB (/home/gha/actions-runner/_work/llvm-project/llvm-project/build/bin/clang-x86_64) :: test_sid_is_same_without_setsid_llgs (TestStubSetSID.TestStubSetSIDTestCase.test_sid_is_same_without_setsid_llgs)
Log Files:
- /home/gha/actions-runner/_work/llvm-project/llvm-project/build/lldb-test-build.noindex/tools/lldb-server/commandline/TestStubSetSID/Failure_test_sid_is_same_without_setsid_llgs.log
======================================================================
FAIL: test_sid_is_same_without_setsid_llgs (TestStubSetSID.TestStubSetSIDTestCase.test_sid_is_same_without_setsid_llgs)
----------------------------------------------------------------------
Traceback (most recent call last):
File "/home/gha/actions-runner/_work/llvm-project/llvm-project/lldb/packages/Python/lldbsuite/test/tools/lldb-server/gdbremote_testcase.py", line 49, in test_method
return attrvalue(self)
^^^^^^^^^^^^^^^
File "/home/gha/actions-runner/_work/llvm-project/llvm-project/lldb/test/API/tools/lldb-server/commandline/TestStubSetSID.py", line 29, in test_sid_is_same_without_setsid
self.assertEqual(stub_sid, os.getsid(0))
AssertionError: 437618 != 1
Config=x86_64-/home/gha/actions-runner/_work/llvm-project/llvm-project/build/bin/clang
----------------------------------------------------------------------
Ran 6 tests in 1.135s
FAILED (failures=1, skipped=3)
--
```
</details>
If these failures are unrelated to your changes (for example tests are broken or flaky at HEAD), please open an issue at https://github.com/llvm/llvm-project/issues and add the `infrastructure` label.
https://github.com/llvm/llvm-project/pull/195816
More information about the lldb-commits
mailing list