[Lldb-commits] [lldb] [LLDB] Add module hook implementation (PR #185465)
via lldb-commits
lldb-commits at lists.llvm.org
Mon Mar 9 10:37:26 PDT 2026
github-actions[bot] wrote:
<!--PREMERGE ADVISOR COMMENT: Linux-->
# :penguin: Linux x64 Test Results
* 33350 tests passed
* 501 tests skipped
* 2 tests failed
## Failed Tests
(click on a test name to see its output)
### lldb-api
<details>
<summary>lldb-api.functionalities/rerun_and_expr/TestRerunAndExpr.py</summary>
```
Script:
--
/usr/bin/python3 /home/gha/actions-runner/_work/llvm-project/llvm-project/lldb/test/API/dotest.py -u CXXFLAGS -u CFLAGS --env LLVM_LIBS_DIR=/home/gha/actions-runner/_work/llvm-project/llvm-project/build/./lib --env LLVM_INCLUDE_DIR=/home/gha/actions-runner/_work/llvm-project/llvm-project/build/include --env LLVM_TOOLS_DIR=/home/gha/actions-runner/_work/llvm-project/llvm-project/build/./bin --libcxx-include-dir /home/gha/actions-runner/_work/llvm-project/llvm-project/build/include/c++/v1 --libcxx-include-target-dir /home/gha/actions-runner/_work/llvm-project/llvm-project/build/include/x86_64-unknown-linux-gnu/c++/v1 --libcxx-library-dir /home/gha/actions-runner/_work/llvm-project/llvm-project/build/./lib/x86_64-unknown-linux-gnu --arch x86_64 --build-dir /home/gha/actions-runner/_work/llvm-project/llvm-project/build/lldb-test-build.noindex --lldb-module-cache-dir /home/gha/actions-runner/_work/llvm-project/llvm-project/build/lldb-test-build.noindex/module-cache-lldb/lldb-api --clang-module-cache-dir /home/gha/actions-runner/_work/llvm-project/llvm-project/build/lldb-test-build.noindex/module-cache-clang/lldb-api --executable /home/gha/actions-runner/_work/llvm-project/llvm-project/build/./bin/lldb --compiler /home/gha/actions-runner/_work/llvm-project/llvm-project/build/./bin/clang --dsymutil /home/gha/actions-runner/_work/llvm-project/llvm-project/build/./bin/dsymutil --make /usr/bin/gmake --llvm-tools-dir /home/gha/actions-runner/_work/llvm-project/llvm-project/build/./bin --lldb-obj-root /home/gha/actions-runner/_work/llvm-project/llvm-project/build/tools/lldb --lldb-libs-dir /home/gha/actions-runner/_work/llvm-project/llvm-project/build/./lib --cmake-build-type Release /home/gha/actions-runner/_work/llvm-project/llvm-project/lldb/test/API/functionalities/rerun_and_expr -p TestRerunAndExpr.py
--
Exit Code: 1
Command Output (stdout):
--
lldb version 23.0.0git (https://github.com/llvm/llvm-project revision 48987ad3a75b4a7d1f7fe8c6803243e8e47a0b9d)
clang revision 48987ad3a75b4a7d1f7fe8c6803243e8e47a0b9d
llvm revision 48987ad3a75b4a7d1f7fe8c6803243e8e47a0b9d
Skipping the following test categories: msvcstl, dsym, pdb, gmodules, debugserver, objc
--
Command Output (stderr):
--
UNSUPPORTED: LLDB (/home/gha/actions-runner/_work/llvm-project/llvm-project/build/bin/clang-x86_64) :: test_dsym (TestRerunAndExpr.TestRerunExpr.test_dsym) (test case does not fall in any category of interest for this run)
FAIL: LLDB (/home/gha/actions-runner/_work/llvm-project/llvm-project/build/bin/clang-x86_64) :: test_dwarf (TestRerunAndExpr.TestRerunExpr.test_dwarf)
FAIL: LLDB (/home/gha/actions-runner/_work/llvm-project/llvm-project/build/bin/clang-x86_64) :: test_dwo (TestRerunAndExpr.TestRerunExpr.test_dwo)
======================================================================
FAIL: test_dwarf (TestRerunAndExpr.TestRerunExpr.test_dwarf)
Tests whether re-launching a process without destroying
----------------------------------------------------------------------
Traceback (most recent call last):
File "/home/gha/actions-runner/_work/llvm-project/llvm-project/lldb/packages/Python/lldbsuite/test/lldbtest.py", line 1858, in test_method
return attrvalue(self)
^^^^^^^^^^^^^^^
File "/home/gha/actions-runner/_work/llvm-project/llvm-project/lldb/test/API/functionalities/rerun_and_expr/TestRerunAndExpr.py", line 68, in test
self.filecheck("target module dump ast", __file__)
File "/home/gha/actions-runner/_work/llvm-project/llvm-project/lldb/packages/Python/lldbsuite/test/lldbtest.py", line 2358, in filecheck
self.runCmd(
File "/home/gha/actions-runner/_work/llvm-project/llvm-project/lldb/packages/Python/lldbsuite/test/lldbtest.py", line 1049, in runCmd
self.assertTrue(self.res.Succeeded(), msg + output)
AssertionError: False is not true : FileCheck'ing result of `target module dump ast`
Error output:
error: ambiguous command 'target module'. Possible completions:
module-hook
modules
Config=x86_64-/home/gha/actions-runner/_work/llvm-project/llvm-project/build/bin/clang
======================================================================
FAIL: test_dwo (TestRerunAndExpr.TestRerunExpr.test_dwo)
Tests whether re-launching a process without destroying
----------------------------------------------------------------------
Traceback (most recent call last):
File "/home/gha/actions-runner/_work/llvm-project/llvm-project/lldb/packages/Python/lldbsuite/test/lldbtest.py", line 1858, in test_method
return attrvalue(self)
^^^^^^^^^^^^^^^
File "/home/gha/actions-runner/_work/llvm-project/llvm-project/lldb/test/API/functionalities/rerun_and_expr/TestRerunAndExpr.py", line 68, in test
self.filecheck("target module dump ast", __file__)
File "/home/gha/actions-runner/_work/llvm-project/llvm-project/lldb/packages/Python/lldbsuite/test/lldbtest.py", line 2358, in filecheck
self.runCmd(
File "/home/gha/actions-runner/_work/llvm-project/llvm-project/lldb/packages/Python/lldbsuite/test/lldbtest.py", line 1049, in runCmd
self.assertTrue(self.res.Succeeded(), msg + output)
AssertionError: False is not true : FileCheck'ing result of `target module dump ast`
Error output:
error: ambiguous command 'target module'. Possible completions:
module-hook
modules
Config=x86_64-/home/gha/actions-runner/_work/llvm-project/llvm-project/build/bin/clang
----------------------------------------------------------------------
Ran 3 tests in 1.335s
FAILED (failures=2, skipped=1)
--
```
</details>
<details>
<summary>lldb-api.functionalities/rerun_and_expr_dylib/TestRerunAndExprDylib.py</summary>
```
Script:
--
/usr/bin/python3 /home/gha/actions-runner/_work/llvm-project/llvm-project/lldb/test/API/dotest.py -u CXXFLAGS -u CFLAGS --env LLVM_LIBS_DIR=/home/gha/actions-runner/_work/llvm-project/llvm-project/build/./lib --env LLVM_INCLUDE_DIR=/home/gha/actions-runner/_work/llvm-project/llvm-project/build/include --env LLVM_TOOLS_DIR=/home/gha/actions-runner/_work/llvm-project/llvm-project/build/./bin --libcxx-include-dir /home/gha/actions-runner/_work/llvm-project/llvm-project/build/include/c++/v1 --libcxx-include-target-dir /home/gha/actions-runner/_work/llvm-project/llvm-project/build/include/x86_64-unknown-linux-gnu/c++/v1 --libcxx-library-dir /home/gha/actions-runner/_work/llvm-project/llvm-project/build/./lib/x86_64-unknown-linux-gnu --arch x86_64 --build-dir /home/gha/actions-runner/_work/llvm-project/llvm-project/build/lldb-test-build.noindex --lldb-module-cache-dir /home/gha/actions-runner/_work/llvm-project/llvm-project/build/lldb-test-build.noindex/module-cache-lldb/lldb-api --clang-module-cache-dir /home/gha/actions-runner/_work/llvm-project/llvm-project/build/lldb-test-build.noindex/module-cache-clang/lldb-api --executable /home/gha/actions-runner/_work/llvm-project/llvm-project/build/./bin/lldb --compiler /home/gha/actions-runner/_work/llvm-project/llvm-project/build/./bin/clang --dsymutil /home/gha/actions-runner/_work/llvm-project/llvm-project/build/./bin/dsymutil --make /usr/bin/gmake --llvm-tools-dir /home/gha/actions-runner/_work/llvm-project/llvm-project/build/./bin --lldb-obj-root /home/gha/actions-runner/_work/llvm-project/llvm-project/build/tools/lldb --lldb-libs-dir /home/gha/actions-runner/_work/llvm-project/llvm-project/build/./lib --cmake-build-type Release /home/gha/actions-runner/_work/llvm-project/llvm-project/lldb/test/API/functionalities/rerun_and_expr_dylib -p TestRerunAndExprDylib.py
--
Exit Code: 1
Command Output (stdout):
--
lldb version 23.0.0git (https://github.com/llvm/llvm-project revision 48987ad3a75b4a7d1f7fe8c6803243e8e47a0b9d)
clang revision 48987ad3a75b4a7d1f7fe8c6803243e8e47a0b9d
llvm revision 48987ad3a75b4a7d1f7fe8c6803243e8e47a0b9d
Skipping the following test categories: msvcstl, dsym, pdb, gmodules, debugserver, objc
--
Command Output (stderr):
--
UNSUPPORTED: LLDB (/home/gha/actions-runner/_work/llvm-project/llvm-project/build/bin/clang-x86_64) :: test_dsym (TestRerunAndExprDylib.TestRerunExprDylib.test_dsym) (test case does not fall in any category of interest for this run)
FAIL: LLDB (/home/gha/actions-runner/_work/llvm-project/llvm-project/build/bin/clang-x86_64) :: test_dwarf (TestRerunAndExprDylib.TestRerunExprDylib.test_dwarf)
FAIL: LLDB (/home/gha/actions-runner/_work/llvm-project/llvm-project/build/bin/clang-x86_64) :: test_dwo (TestRerunAndExprDylib.TestRerunExprDylib.test_dwo)
======================================================================
FAIL: test_dwarf (TestRerunAndExprDylib.TestRerunExprDylib.test_dwarf)
Tests whether re-launching a process without destroying
----------------------------------------------------------------------
Traceback (most recent call last):
File "/home/gha/actions-runner/_work/llvm-project/llvm-project/lldb/packages/Python/lldbsuite/test/lldbtest.py", line 1858, in test_method
return attrvalue(self)
^^^^^^^^^^^^^^^
File "/home/gha/actions-runner/_work/llvm-project/llvm-project/lldb/packages/Python/lldbsuite/test/decorators.py", line 160, in wrapper
return func(*args, **kwargs)
^^^^^^^^^^^^^^^^^^^^^
File "/home/gha/actions-runner/_work/llvm-project/llvm-project/lldb/test/API/functionalities/rerun_and_expr_dylib/TestRerunAndExprDylib.py", line 116, in test
self.filecheck("target module dump ast", __file__)
File "/home/gha/actions-runner/_work/llvm-project/llvm-project/lldb/packages/Python/lldbsuite/test/lldbtest.py", line 2358, in filecheck
self.runCmd(
File "/home/gha/actions-runner/_work/llvm-project/llvm-project/lldb/packages/Python/lldbsuite/test/lldbtest.py", line 1049, in runCmd
self.assertTrue(self.res.Succeeded(), msg + output)
AssertionError: False is not true : FileCheck'ing result of `target module dump ast`
Error output:
error: ambiguous command 'target module'. Possible completions:
module-hook
modules
Config=x86_64-/home/gha/actions-runner/_work/llvm-project/llvm-project/build/bin/clang
======================================================================
FAIL: test_dwo (TestRerunAndExprDylib.TestRerunExprDylib.test_dwo)
Tests whether re-launching a process without destroying
----------------------------------------------------------------------
Traceback (most recent call last):
File "/home/gha/actions-runner/_work/llvm-project/llvm-project/lldb/packages/Python/lldbsuite/test/lldbtest.py", line 1858, in test_method
return attrvalue(self)
^^^^^^^^^^^^^^^
File "/home/gha/actions-runner/_work/llvm-project/llvm-project/lldb/packages/Python/lldbsuite/test/decorators.py", line 160, in wrapper
return func(*args, **kwargs)
^^^^^^^^^^^^^^^^^^^^^
File "/home/gha/actions-runner/_work/llvm-project/llvm-project/lldb/test/API/functionalities/rerun_and_expr_dylib/TestRerunAndExprDylib.py", line 116, in test
self.filecheck("target module dump ast", __file__)
File "/home/gha/actions-runner/_work/llvm-project/llvm-project/lldb/packages/Python/lldbsuite/test/lldbtest.py", line 2358, in filecheck
self.runCmd(
File "/home/gha/actions-runner/_work/llvm-project/llvm-project/lldb/packages/Python/lldbsuite/test/lldbtest.py", line 1049, in runCmd
self.assertTrue(self.res.Succeeded(), msg + output)
AssertionError: False is not true : FileCheck'ing result of `target module dump ast`
Error output:
error: ambiguous command 'target module'. Possible completions:
module-hook
modules
Config=x86_64-/home/gha/actions-runner/_work/llvm-project/llvm-project/build/bin/clang
----------------------------------------------------------------------
Ran 3 tests in 2.706s
FAILED (failures=2, skipped=1)
--
```
</details>
If these failures are unrelated to your changes (for example tests are broken or flaky at HEAD), please open an issue at https://github.com/llvm/llvm-project/issues and add the `infrastructure` label.
https://github.com/llvm/llvm-project/pull/185465
More information about the lldb-commits
mailing list