[Lldb-commits] [lldb] [lldb] add a marker before hidden frames (PR #181143)
via lldb-commits
lldb-commits at lists.llvm.org
Fri Feb 13 02:10:46 PST 2026
github-actions[bot] wrote:
<!--PREMERGE ADVISOR COMMENT: Linux-->
# :penguin: Linux x64 Test Results
* 33321 tests passed
* 503 tests skipped
* 1 test failed
## Failed Tests
(click on a test name to see its output)
### lldb-api
<details>
<summary>lldb-api.terminal/hidden_frame_markers/TestHiddenFrameMarkers.py</summary>
```
Script:
--
/usr/bin/python3 /home/gha/actions-runner/_work/llvm-project/llvm-project/lldb/test/API/dotest.py -u CXXFLAGS -u CFLAGS --env LLVM_LIBS_DIR=/home/gha/actions-runner/_work/llvm-project/llvm-project/build/./lib --env LLVM_INCLUDE_DIR=/home/gha/actions-runner/_work/llvm-project/llvm-project/build/include --env LLVM_TOOLS_DIR=/home/gha/actions-runner/_work/llvm-project/llvm-project/build/./bin --libcxx-include-dir /home/gha/actions-runner/_work/llvm-project/llvm-project/build/include/c++/v1 --libcxx-include-target-dir /home/gha/actions-runner/_work/llvm-project/llvm-project/build/include/x86_64-unknown-linux-gnu/c++/v1 --libcxx-library-dir /home/gha/actions-runner/_work/llvm-project/llvm-project/build/./lib/x86_64-unknown-linux-gnu --arch x86_64 --build-dir /home/gha/actions-runner/_work/llvm-project/llvm-project/build/lldb-test-build.noindex --lldb-module-cache-dir /home/gha/actions-runner/_work/llvm-project/llvm-project/build/lldb-test-build.noindex/module-cache-lldb/lldb-api --clang-module-cache-dir /home/gha/actions-runner/_work/llvm-project/llvm-project/build/lldb-test-build.noindex/module-cache-clang/lldb-api --executable /home/gha/actions-runner/_work/llvm-project/llvm-project/build/./bin/lldb --compiler /home/gha/actions-runner/_work/llvm-project/llvm-project/build/./bin/clang --dsymutil /home/gha/actions-runner/_work/llvm-project/llvm-project/build/./bin/dsymutil --make /usr/bin/gmake --llvm-tools-dir /home/gha/actions-runner/_work/llvm-project/llvm-project/build/./bin --lldb-obj-root /home/gha/actions-runner/_work/llvm-project/llvm-project/build/tools/lldb --lldb-libs-dir /home/gha/actions-runner/_work/llvm-project/llvm-project/build/./lib --cmake-build-type Release /home/gha/actions-runner/_work/llvm-project/llvm-project/lldb/test/API/terminal/hidden_frame_markers -p TestHiddenFrameMarkers.py
--
Exit Code: 1
Command Output (stdout):
--
lldb version 23.0.0git (https://github.com/llvm/llvm-project revision 07fa8dc4d853a1612ca564650b81346dd3bf44ba)
clang revision 07fa8dc4d853a1612ca564650b81346dd3bf44ba
llvm revision 07fa8dc4d853a1612ca564650b81346dd3bf44ba
Skipping the following test categories: msvcstl, dsym, pdb, gmodules, debugserver, objc
--
Command Output (stderr):
--
UNSUPPORTED: LLDB (/home/gha/actions-runner/_work/llvm-project/llvm-project/build/bin/clang-x86_64) :: test_hidden_frame_markers_dsym (TestHiddenFrameMarkers.HiddenFrameMarkerTest.test_hidden_frame_markers_dsym) (test case does not fall in any category of interest for this run)
FAIL: LLDB (/home/gha/actions-runner/_work/llvm-project/llvm-project/build/bin/clang-x86_64) :: test_hidden_frame_markers_dwarf (TestHiddenFrameMarkers.HiddenFrameMarkerTest.test_hidden_frame_markers_dwarf)
FAIL: LLDB (/home/gha/actions-runner/_work/llvm-project/llvm-project/build/bin/clang-x86_64) :: test_hidden_frame_markers_dwo (TestHiddenFrameMarkers.HiddenFrameMarkerTest.test_hidden_frame_markers_dwo)
======================================================================
FAIL: test_hidden_frame_markers_dwarf (TestHiddenFrameMarkers.HiddenFrameMarkerTest.test_hidden_frame_markers_dwarf)
Test that hidden frame markers are not rendered in backtraces when
----------------------------------------------------------------------
Traceback (most recent call last):
File "/home/gha/actions-runner/_work/llvm-project/llvm-project/lldb/packages/Python/lldbsuite/test/lldbtest.py", line 1844, in test_method
return attrvalue(self)
^^^^^^^^^^^^^^^
File "/home/gha/actions-runner/_work/llvm-project/llvm-project/lldb/test/API/terminal/hidden_frame_markers/TestHiddenFrameMarkers.py", line 72, in test_hidden_frame_markers
self.expect(
File "/home/gha/actions-runner/_work/llvm-project/llvm-project/lldb/packages/Python/lldbsuite/test/lldbtest.py", line 2569, in expect
self.fail(log_msg)
AssertionError: Ran command:
"bt"
Got output:
* thread #1, name = 'a.out', stop reason = breakpoint 1.1
frame #0: 0x000055ded8850144 a.out`foo() at main.cpp:2:7
* frame #1: 0x000055ded8850139 a.out`std::__1::__test_hidden_frame() at main.cpp:7:30
frame #2: 0x000055ded8850159 a.out`std::__1::outer_function() at main.cpp:9:25
frame #3: 0x000055ded8850174 a.out`main at main.cpp:14:3
frame #4: 0x00007e48c78151ca libc.so.6`___lldb_unnamed_symbol_2a150 + 122
frame #5: 0x00007e48c781528b libc.so.6`__libc_start_main + 139
frame #6: 0x000055ded8850065 a.out`_start + 37
Expecting sub string: " frame #0:" (was found)
Expecting sub string: " * frame #2:" (was not found)
Config=x86_64-/home/gha/actions-runner/_work/llvm-project/llvm-project/build/bin/clang
======================================================================
FAIL: test_hidden_frame_markers_dwo (TestHiddenFrameMarkers.HiddenFrameMarkerTest.test_hidden_frame_markers_dwo)
Test that hidden frame markers are not rendered in backtraces when
----------------------------------------------------------------------
Traceback (most recent call last):
File "/home/gha/actions-runner/_work/llvm-project/llvm-project/lldb/packages/Python/lldbsuite/test/lldbtest.py", line 1844, in test_method
return attrvalue(self)
^^^^^^^^^^^^^^^
File "/home/gha/actions-runner/_work/llvm-project/llvm-project/lldb/test/API/terminal/hidden_frame_markers/TestHiddenFrameMarkers.py", line 72, in test_hidden_frame_markers
self.expect(
File "/home/gha/actions-runner/_work/llvm-project/llvm-project/lldb/packages/Python/lldbsuite/test/lldbtest.py", line 2569, in expect
self.fail(log_msg)
AssertionError: Ran command:
"bt"
Got output:
* thread #1, name = 'a.out', stop reason = breakpoint 1.1
frame #0: 0x00005d1cf2438144 a.out`foo() at main.cpp:2:7
* frame #1: 0x00005d1cf2438139 a.out`std::__1::__test_hidden_frame() at main.cpp:7:30
frame #2: 0x00005d1cf2438159 a.out`std::__1::outer_function() at main.cpp:9:25
frame #3: 0x00005d1cf2438174 a.out`main at main.cpp:14:3
frame #4: 0x00007d74758281ca libc.so.6`___lldb_unnamed_symbol_2a150 + 122
frame #5: 0x00007d747582828b libc.so.6`__libc_start_main + 139
frame #6: 0x00005d1cf2438065 a.out`_start + 37
Expecting sub string: " frame #0:" (was found)
Expecting sub string: " * frame #2:" (was not found)
Config=x86_64-/home/gha/actions-runner/_work/llvm-project/llvm-project/build/bin/clang
----------------------------------------------------------------------
Ran 3 tests in 0.222s
FAILED (failures=2, skipped=1)
--
```
</details>
If these failures are unrelated to your changes (for example tests are broken or flaky at HEAD), please open an issue at https://github.com/llvm/llvm-project/issues and add the `infrastructure` label.
https://github.com/llvm/llvm-project/pull/181143
More information about the lldb-commits
mailing list