[libc-commits] [libc] [llvm] [ci][libc] Switch premerge libc runtime to full-build mode (PR #231937)

via libc-commits libc-commits at lists.llvm.org
Wed Oct 14 12:48:15 PDT 2026


github-actions[bot] wrote:

<!--PREMERGE ADVISOR COMMENT: Linux-->
# :penguin: Linux x64 Test Results

* 154007 tests passed
* 1734 tests skipped
* 2 tests failed

## Failed Tests
(click on a test name to see its output)

### Clang
<details>
<summary>Clang.CIR/CodeGenHIP/amdgcnspirv-atomic-scope.hip</summary>

```
Exit Code: 1

Command Output (stdout):
--
# RUN: at line 2
/home/gha/actions-runner/_work/llvm-project/llvm-project/build/bin/clang -cc1 -internal-isystem /home/gha/actions-runner/_work/llvm-project/llvm-project/build/lib/clang/24/include -nostdsysteminc -triple spirv64-amd-amdhsa -x hip -fclangir             -fcuda-is-device -emit-cir /home/gha/actions-runner/_work/llvm-project/llvm-project/clang/test/CIR/CodeGenHIP/amdgcnspirv-atomic-scope.hip -o /home/gha/actions-runner/_work/llvm-project/llvm-project/build/tools/clang/test/CIR/CodeGenHIP/Output/amdgcnspirv-atomic-scope.hip.tmp.cir
# executed command: /home/gha/actions-runner/_work/llvm-project/llvm-project/build/bin/clang -cc1 -internal-isystem /home/gha/actions-runner/_work/llvm-project/llvm-project/build/lib/clang/24/include -nostdsysteminc -triple spirv64-amd-amdhsa -x hip -fclangir -fcuda-is-device -emit-cir /home/gha/actions-runner/_work/llvm-project/llvm-project/clang/test/CIR/CodeGenHIP/amdgcnspirv-atomic-scope.hip -o /home/gha/actions-runner/_work/llvm-project/llvm-project/build/tools/clang/test/CIR/CodeGenHIP/Output/amdgcnspirv-atomic-scope.hip.tmp.cir
# note: command had no output on stdout or stderr
# RUN: at line 4
/home/gha/actions-runner/_work/llvm-project/llvm-project/build/bin/FileCheck --check-prefix=CIR /home/gha/actions-runner/_work/llvm-project/llvm-project/clang/test/CIR/CodeGenHIP/amdgcnspirv-atomic-scope.hip --input-file=/home/gha/actions-runner/_work/llvm-project/llvm-project/build/tools/clang/test/CIR/CodeGenHIP/Output/amdgcnspirv-atomic-scope.hip.tmp.cir
# executed command: /home/gha/actions-runner/_work/llvm-project/llvm-project/build/bin/FileCheck --check-prefix=CIR /home/gha/actions-runner/_work/llvm-project/llvm-project/clang/test/CIR/CodeGenHIP/amdgcnspirv-atomic-scope.hip --input-file=/home/gha/actions-runner/_work/llvm-project/llvm-project/build/tools/clang/test/CIR/CodeGenHIP/Output/amdgcnspirv-atomic-scope.hip.tmp.cir
# note: command had no output on stdout or stderr
# RUN: at line 6
/home/gha/actions-runner/_work/llvm-project/llvm-project/build/bin/clang -cc1 -internal-isystem /home/gha/actions-runner/_work/llvm-project/llvm-project/build/lib/clang/24/include -nostdsysteminc -triple spirv64-amd-amdhsa -x hip -fclangir             -fcuda-is-device -emit-llvm /home/gha/actions-runner/_work/llvm-project/llvm-project/clang/test/CIR/CodeGenHIP/amdgcnspirv-atomic-scope.hip -o /home/gha/actions-runner/_work/llvm-project/llvm-project/build/tools/clang/test/CIR/CodeGenHIP/Output/amdgcnspirv-atomic-scope.hip.tmp-cir.ll
# executed command: /home/gha/actions-runner/_work/llvm-project/llvm-project/build/bin/clang -cc1 -internal-isystem /home/gha/actions-runner/_work/llvm-project/llvm-project/build/lib/clang/24/include -nostdsysteminc -triple spirv64-amd-amdhsa -x hip -fclangir -fcuda-is-device -emit-llvm /home/gha/actions-runner/_work/llvm-project/llvm-project/clang/test/CIR/CodeGenHIP/amdgcnspirv-atomic-scope.hip -o /home/gha/actions-runner/_work/llvm-project/llvm-project/build/tools/clang/test/CIR/CodeGenHIP/Output/amdgcnspirv-atomic-scope.hip.tmp-cir.ll
# note: command had no output on stdout or stderr
# RUN: at line 8
/home/gha/actions-runner/_work/llvm-project/llvm-project/build/bin/FileCheck --check-prefixes=LLVM,CIR-LLVM /home/gha/actions-runner/_work/llvm-project/llvm-project/clang/test/CIR/CodeGenHIP/amdgcnspirv-atomic-scope.hip --input-file=/home/gha/actions-runner/_work/llvm-project/llvm-project/build/tools/clang/test/CIR/CodeGenHIP/Output/amdgcnspirv-atomic-scope.hip.tmp-cir.ll
# executed command: /home/gha/actions-runner/_work/llvm-project/llvm-project/build/bin/FileCheck --check-prefixes=LLVM,CIR-LLVM /home/gha/actions-runner/_work/llvm-project/llvm-project/clang/test/CIR/CodeGenHIP/amdgcnspirv-atomic-scope.hip --input-file=/home/gha/actions-runner/_work/llvm-project/llvm-project/build/tools/clang/test/CIR/CodeGenHIP/Output/amdgcnspirv-atomic-scope.hip.tmp-cir.ll
# .---command stderr------------
# | /home/gha/actions-runner/_work/llvm-project/llvm-project/clang/test/CIR/CodeGenHIP/amdgcnspirv-atomic-scope.hip:36:14: error: CIR-LLVM: expected string not found in input
# | // CIR-LLVM: atomicrmw add {{.*}} syncscope("wavefront") monotonic
# |              ^
# | /home/gha/actions-runner/_work/llvm-project/llvm-project/build/tools/clang/test/CIR/CodeGenHIP/Output/amdgcnspirv-atomic-scope.hip.tmp-cir.ll:35:46: note: scanning from here
# | define spir_func noundef i32 @_Z9wavefrontPii(ptr addrspace(4) noundef %0, i32 noundef %1) addrspace(4) #0 {
# |                                              ^
# | /home/gha/actions-runner/_work/llvm-project/llvm-project/build/tools/clang/test/CIR/CodeGenHIP/Output/amdgcnspirv-atomic-scope.hip.tmp-cir.ll:51:32: note: possible intended match here
# |  %15 = atomicrmw add ptr addrspace(4) %12, i32 %14 syncscope("subgroup") monotonic, align 4
# |                                ^
# | /home/gha/actions-runner/_work/llvm-project/llvm-project/clang/test/CIR/CodeGenHIP/amdgcnspirv-atomic-scope.hip:59:14: error: CIR-LLVM: expected string not found in input
# | // CIR-LLVM: atomicrmw add {{.*}} syncscope("agent") monotonic
# |              ^
# | /home/gha/actions-runner/_work/llvm-project/llvm-project/build/tools/clang/test/CIR/CodeGenHIP/Output/amdgcnspirv-atomic-scope.hip.tmp-cir.ll:85:42: note: scanning from here
# | define spir_func noundef i32 @_Z5agentPii(ptr addrspace(4) noundef %0, i32 noundef %1) addrspace(4) #0 {
# |                                          ^
# | /home/gha/actions-runner/_work/llvm-project/llvm-project/build/tools/clang/test/CIR/CodeGenHIP/Output/amdgcnspirv-atomic-scope.hip.tmp-cir.ll:101:34: note: possible intended match here
# |  %15 = atomicrmw add ptr addrspace(4) %12, i32 %14 syncscope("device") monotonic, align 4
# |                                  ^
# | 
# | Input file: /home/gha/actions-runner/_work/llvm-project/llvm-project/build/tools/clang/test/CIR/CodeGenHIP/Output/amdgcnspirv-atomic-scope.hip.tmp-cir.ll
# | Check file: /home/gha/actions-runner/_work/llvm-project/llvm-project/clang/test/CIR/CodeGenHIP/amdgcnspirv-atomic-scope.hip
# | 
# | -dump-input=help explains the following input dump.
# | 
# | Input was:
# | <<<<<<
# |             .
# |             .
# |             .
# |            30:  %17 = load float, ptr %5, align 4 
# |            31:  ret float %17 
# |            32: } 
# |            33:  
# |            34: ; Function Attrs: convergent mustprogress noinline nounwind 
# |            35: define spir_func noundef i32 @_Z9wavefrontPii(ptr addrspace(4) noundef %0, i32 noundef %1) addrspace(4) #0 { 
# | check:36'0                                                 {                                                                  search range start (exclusive)
# | check:36'1                                                                                                                    error: no match found in search range
# |            36:  %3 = alloca ptr addrspace(4), align 8 
# |            37:  %4 = alloca i32, align 4 
# |            38:  %5 = alloca i32, align 4 
# |            39:  %6 = alloca i32, align 4 
# |            40:  %7 = alloca i32, align 4 
# |             .
# |             .
# |             .
# |            46:  store i32 %1, ptr addrspace(4) %10, align 4 
# |            47:  %12 = load ptr addrspace(4), ptr addrspace(4) %11, align 8 
# |            48:  %13 = load i32, ptr addrspace(4) %10, align 4 
# |            49:  store i32 %13, ptr addrspace(4) %9, align 4 
# |            50:  %14 = load i32, ptr addrspace(4) %9, align 4 
# |            51:  %15 = atomicrmw add ptr addrspace(4) %12, i32 %14 syncscope("subgroup") monotonic, align 4 
# | check:36'2                                    ?                                                              possible intended match
# |            52:  store i32 %15, ptr addrspace(4) %8, align 4 
# |            53:  %16 = load i32, ptr addrspace(4) %8, align 4 
# |            54:  store i32 %16, ptr %5, align 4 
# |            55:  %17 = load i32, ptr %5, align 4 
# |            56:  ret i32 %17 
# |            57: } 
# |            58:  
# |            59: ; Function Attrs: convergent mustprogress noinline nounwind 
# |            60: define spir_func noundef float @_Z9workgroupPff(ptr addrspace(4) noundef %0, float noundef %1) addrspace(4) #0 { 
# | check:36'3                                                    }                                                                   search range end (exclusive)
# |            61:  %3 = alloca ptr addrspace(4), align 8 
# |            62:  %4 = alloca float, align 4 
# |            63:  %5 = alloca float, align 4 
# |            64:  %6 = alloca float, align 4 
# |            65:  %7 = alloca float, align 4 
# |             .
# |             .
# |             .
# |            80:  %17 = load float, ptr %5, align 4 
# |            81:  ret float %17 
# |            82: } 
# |            83:  
# |            84: ; Function Attrs: convergent mustprogress noinline nounwind 
# |            85: define spir_func noundef i32 @_Z5agentPii(ptr addrspace(4) noundef %0, i32 noundef %1) addrspace(4) #0 { 
# | check:59'0                                             {                                                                  search range start (exclusive)
# | check:59'1                                                                                                                error: no match found in search range
# |            86:  %3 = alloca ptr addrspace(4), align 8 
# |            87:  %4 = alloca i32, align 4 
# |            88:  %5 = alloca i32, align 4 
# |            89:  %6 = alloca i32, align 4 
# |            90:  %7 = alloca i32, align 4 
# |             .
# |             .
# |             .
# |            96:  store i32 %1, ptr addrspace(4) %10, align 4 
# |            97:  %12 = load ptr addrspace(4), ptr addrspace(4) %11, align 8 
# |            98:  %13 = load i32, ptr addrspace(4) %10, align 4 
# |            99:  store i32 %13, ptr addrspace(4) %9, align 4 
# |           100:  %14 = load i32, ptr addrspace(4) %9, align 4 
# |           101:  %15 = atomicrmw add ptr addrspace(4) %12, i32 %14 syncscope("device") monotonic, align 4 
# | check:59'2                                      ?                                                          possible intended match
# |           102:  store i32 %15, ptr addrspace(4) %8, align 4 
# |           103:  %16 = load i32, ptr addrspace(4) %8, align 4 
# |           104:  store i32 %16, ptr %5, align 4 
# |           105:  %17 = load i32, ptr %5, align 4 
# |           106:  ret i32 %17 
# |           107: } 
# |           108:  
# |           109: ; Function Attrs: convergent mustprogress noinline nounwind 
# |           110: define spir_func noundef float @_Z6systemPff(ptr addrspace(4) noundef %0, float noundef %1) addrspace(4) #0 { 
# | check:59'3                                                 }                                                                   search range end (exclusive)
# |           111:  %3 = alloca ptr addrspace(4), align 8 
# |           112:  %4 = alloca float, align 4 
# |           113:  %5 = alloca float, align 4 
# |           114:  %6 = alloca float, align 4 
# |           115:  %7 = alloca float, align 4 
# |             .
# |             .
# |             .
# | >>>>>>
# `-----------------------------
# error: command failed with exit status: 1

--

```
</details>
<details>
<summary>Clang.CIR/CodeGenHIP/amdgcnspirv-atomic-scope.hip</summary>

```
Exit Code: 1

Command Output (stdout):
--
# RUN: at line 2
/home/gha/actions-runner/_work/llvm-project/llvm-project/build/bin/clang -cc1 -internal-isystem /home/gha/actions-runner/_work/llvm-project/llvm-project/build/lib/clang/24/include -nostdsysteminc -triple spirv64-amd-amdhsa -x hip -fclangir             -fcuda-is-device -emit-cir /home/gha/actions-runner/_work/llvm-project/llvm-project/clang/test/CIR/CodeGenHIP/amdgcnspirv-atomic-scope.hip -o /home/gha/actions-runner/_work/llvm-project/llvm-project/build/tools/clang/test/CIR/CodeGenHIP/Output/amdgcnspirv-atomic-scope.hip.tmp.cir
# executed command: /home/gha/actions-runner/_work/llvm-project/llvm-project/build/bin/clang -cc1 -internal-isystem /home/gha/actions-runner/_work/llvm-project/llvm-project/build/lib/clang/24/include -nostdsysteminc -triple spirv64-amd-amdhsa -x hip -fclangir -fcuda-is-device -emit-cir /home/gha/actions-runner/_work/llvm-project/llvm-project/clang/test/CIR/CodeGenHIP/amdgcnspirv-atomic-scope.hip -o /home/gha/actions-runner/_work/llvm-project/llvm-project/build/tools/clang/test/CIR/CodeGenHIP/Output/amdgcnspirv-atomic-scope.hip.tmp.cir
# note: command had no output on stdout or stderr
# RUN: at line 4
/home/gha/actions-runner/_work/llvm-project/llvm-project/build/bin/FileCheck --check-prefix=CIR /home/gha/actions-runner/_work/llvm-project/llvm-project/clang/test/CIR/CodeGenHIP/amdgcnspirv-atomic-scope.hip --input-file=/home/gha/actions-runner/_work/llvm-project/llvm-project/build/tools/clang/test/CIR/CodeGenHIP/Output/amdgcnspirv-atomic-scope.hip.tmp.cir
# executed command: /home/gha/actions-runner/_work/llvm-project/llvm-project/build/bin/FileCheck --check-prefix=CIR /home/gha/actions-runner/_work/llvm-project/llvm-project/clang/test/CIR/CodeGenHIP/amdgcnspirv-atomic-scope.hip --input-file=/home/gha/actions-runner/_work/llvm-project/llvm-project/build/tools/clang/test/CIR/CodeGenHIP/Output/amdgcnspirv-atomic-scope.hip.tmp.cir
# note: command had no output on stdout or stderr
# RUN: at line 6
/home/gha/actions-runner/_work/llvm-project/llvm-project/build/bin/clang -cc1 -internal-isystem /home/gha/actions-runner/_work/llvm-project/llvm-project/build/lib/clang/24/include -nostdsysteminc -triple spirv64-amd-amdhsa -x hip -fclangir             -fcuda-is-device -emit-llvm /home/gha/actions-runner/_work/llvm-project/llvm-project/clang/test/CIR/CodeGenHIP/amdgcnspirv-atomic-scope.hip -o /home/gha/actions-runner/_work/llvm-project/llvm-project/build/tools/clang/test/CIR/CodeGenHIP/Output/amdgcnspirv-atomic-scope.hip.tmp-cir.ll
# executed command: /home/gha/actions-runner/_work/llvm-project/llvm-project/build/bin/clang -cc1 -internal-isystem /home/gha/actions-runner/_work/llvm-project/llvm-project/build/lib/clang/24/include -nostdsysteminc -triple spirv64-amd-amdhsa -x hip -fclangir -fcuda-is-device -emit-llvm /home/gha/actions-runner/_work/llvm-project/llvm-project/clang/test/CIR/CodeGenHIP/amdgcnspirv-atomic-scope.hip -o /home/gha/actions-runner/_work/llvm-project/llvm-project/build/tools/clang/test/CIR/CodeGenHIP/Output/amdgcnspirv-atomic-scope.hip.tmp-cir.ll
# note: command had no output on stdout or stderr
# RUN: at line 8
/home/gha/actions-runner/_work/llvm-project/llvm-project/build/bin/FileCheck --check-prefixes=LLVM,CIR-LLVM /home/gha/actions-runner/_work/llvm-project/llvm-project/clang/test/CIR/CodeGenHIP/amdgcnspirv-atomic-scope.hip --input-file=/home/gha/actions-runner/_work/llvm-project/llvm-project/build/tools/clang/test/CIR/CodeGenHIP/Output/amdgcnspirv-atomic-scope.hip.tmp-cir.ll
# executed command: /home/gha/actions-runner/_work/llvm-project/llvm-project/build/bin/FileCheck --check-prefixes=LLVM,CIR-LLVM /home/gha/actions-runner/_work/llvm-project/llvm-project/clang/test/CIR/CodeGenHIP/amdgcnspirv-atomic-scope.hip --input-file=/home/gha/actions-runner/_work/llvm-project/llvm-project/build/tools/clang/test/CIR/CodeGenHIP/Output/amdgcnspirv-atomic-scope.hip.tmp-cir.ll
# .---command stderr------------
# | /home/gha/actions-runner/_work/llvm-project/llvm-project/clang/test/CIR/CodeGenHIP/amdgcnspirv-atomic-scope.hip:36:14: error: CIR-LLVM: expected string not found in input
# | // CIR-LLVM: atomicrmw add {{.*}} syncscope("wavefront") monotonic
# |              ^
# | /home/gha/actions-runner/_work/llvm-project/llvm-project/build/tools/clang/test/CIR/CodeGenHIP/Output/amdgcnspirv-atomic-scope.hip.tmp-cir.ll:35:46: note: scanning from here
# | define spir_func noundef i32 @_Z9wavefrontPii(ptr addrspace(4) noundef %0, i32 noundef %1) addrspace(4) #0 {
# |                                              ^
# | /home/gha/actions-runner/_work/llvm-project/llvm-project/build/tools/clang/test/CIR/CodeGenHIP/Output/amdgcnspirv-atomic-scope.hip.tmp-cir.ll:51:32: note: possible intended match here
# |  %15 = atomicrmw add ptr addrspace(4) %12, i32 %14 syncscope("subgroup") monotonic, align 4
# |                                ^
# | /home/gha/actions-runner/_work/llvm-project/llvm-project/clang/test/CIR/CodeGenHIP/amdgcnspirv-atomic-scope.hip:59:14: error: CIR-LLVM: expected string not found in input
# | // CIR-LLVM: atomicrmw add {{.*}} syncscope("agent") monotonic
# |              ^
# | /home/gha/actions-runner/_work/llvm-project/llvm-project/build/tools/clang/test/CIR/CodeGenHIP/Output/amdgcnspirv-atomic-scope.hip.tmp-cir.ll:85:42: note: scanning from here
# | define spir_func noundef i32 @_Z5agentPii(ptr addrspace(4) noundef %0, i32 noundef %1) addrspace(4) #0 {
# |                                          ^
# | /home/gha/actions-runner/_work/llvm-project/llvm-project/build/tools/clang/test/CIR/CodeGenHIP/Output/amdgcnspirv-atomic-scope.hip.tmp-cir.ll:101:34: note: possible intended match here
# |  %15 = atomicrmw add ptr addrspace(4) %12, i32 %14 syncscope("device") monotonic, align 4
# |                                  ^
# | 
# | Input file: /home/gha/actions-runner/_work/llvm-project/llvm-project/build/tools/clang/test/CIR/CodeGenHIP/Output/amdgcnspirv-atomic-scope.hip.tmp-cir.ll
# | Check file: /home/gha/actions-runner/_work/llvm-project/llvm-project/clang/test/CIR/CodeGenHIP/amdgcnspirv-atomic-scope.hip
# | 
# | -dump-input=help explains the following input dump.
# | 
# | Input was:
# | <<<<<<
# |             .
# |             .
# |             .
# |            30:  %17 = load float, ptr %5, align 4 
# |            31:  ret float %17 
# |            32: } 
# |            33:  
# |            34: ; Function Attrs: convergent mustprogress noinline nounwind 
# |            35: define spir_func noundef i32 @_Z9wavefrontPii(ptr addrspace(4) noundef %0, i32 noundef %1) addrspace(4) #0 { 
# | check:36'0                                                 {                                                                  search range start (exclusive)
# | check:36'1                                                                                                                    error: no match found in search range
# |            36:  %3 = alloca ptr addrspace(4), align 8 
# |            37:  %4 = alloca i32, align 4 
# |            38:  %5 = alloca i32, align 4 
# |            39:  %6 = alloca i32, align 4 
# |            40:  %7 = alloca i32, align 4 
# |             .
# |             .
# |             .
# |            46:  store i32 %1, ptr addrspace(4) %10, align 4 
# |            47:  %12 = load ptr addrspace(4), ptr addrspace(4) %11, align 8 
# |            48:  %13 = load i32, ptr addrspace(4) %10, align 4 
# |            49:  store i32 %13, ptr addrspace(4) %9, align 4 
# |            50:  %14 = load i32, ptr addrspace(4) %9, align 4 
# |            51:  %15 = atomicrmw add ptr addrspace(4) %12, i32 %14 syncscope("subgroup") monotonic, align 4 
# | check:36'2                                    ?                                                              possible intended match
# |            52:  store i32 %15, ptr addrspace(4) %8, align 4 
# |            53:  %16 = load i32, ptr addrspace(4) %8, align 4 
# |            54:  store i32 %16, ptr %5, align 4 
# |            55:  %17 = load i32, ptr %5, align 4 
# |            56:  ret i32 %17 
# |            57: } 
# |            58:  
# |            59: ; Function Attrs: convergent mustprogress noinline nounwind 
# |            60: define spir_func noundef float @_Z9workgroupPff(ptr addrspace(4) noundef %0, float noundef %1) addrspace(4) #0 { 
# | check:36'3                                                    }                                                                   search range end (exclusive)
# |            61:  %3 = alloca ptr addrspace(4), align 8 
# |            62:  %4 = alloca float, align 4 
# |            63:  %5 = alloca float, align 4 
# |            64:  %6 = alloca float, align 4 
# |            65:  %7 = alloca float, align 4 
# |             .
# |             .
# |             .
# |            80:  %17 = load float, ptr %5, align 4 
# |            81:  ret float %17 
# |            82: } 
# |            83:  
# |            84: ; Function Attrs: convergent mustprogress noinline nounwind 
# |            85: define spir_func noundef i32 @_Z5agentPii(ptr addrspace(4) noundef %0, i32 noundef %1) addrspace(4) #0 { 
# | check:59'0                                             {                                                                  search range start (exclusive)
# | check:59'1                                                                                                                error: no match found in search range
# |            86:  %3 = alloca ptr addrspace(4), align 8 
# |            87:  %4 = alloca i32, align 4 
# |            88:  %5 = alloca i32, align 4 
# |            89:  %6 = alloca i32, align 4 
# |            90:  %7 = alloca i32, align 4 
# |             .
# |             .
# |             .
# |            96:  store i32 %1, ptr addrspace(4) %10, align 4 
# |            97:  %12 = load ptr addrspace(4), ptr addrspace(4) %11, align 8 
# |            98:  %13 = load i32, ptr addrspace(4) %10, align 4 
# |            99:  store i32 %13, ptr addrspace(4) %9, align 4 
# |           100:  %14 = load i32, ptr addrspace(4) %9, align 4 
# |           101:  %15 = atomicrmw add ptr addrspace(4) %12, i32 %14 syncscope("device") monotonic, align 4 
# | check:59'2                                      ?                                                          possible intended match
# |           102:  store i32 %15, ptr addrspace(4) %8, align 4 
# |           103:  %16 = load i32, ptr addrspace(4) %8, align 4 
# |           104:  store i32 %16, ptr %5, align 4 
# |           105:  %17 = load i32, ptr %5, align 4 
# |           106:  ret i32 %17 
# |           107: } 
# |           108:  
# |           109: ; Function Attrs: convergent mustprogress noinline nounwind 
# |           110: define spir_func noundef float @_Z6systemPff(ptr addrspace(4) noundef %0, float noundef %1) addrspace(4) #0 { 
# | check:59'3                                                 }                                                                   search range end (exclusive)
# |           111:  %3 = alloca ptr addrspace(4), align 8 
# |           112:  %4 = alloca float, align 4 
# |           113:  %5 = alloca float, align 4 
# |           114:  %6 = alloca float, align 4 
# |           115:  %7 = alloca float, align 4 
# |             .
# |             .
# |             .
# | >>>>>>
# `-----------------------------
# error: command failed with exit status: 1

--

```
</details>

If these failures are unrelated to your changes (for example tests are broken or flaky at HEAD), please open an issue at https://github.com/llvm/llvm-project/issues and add the `infrastructure` label.

https://github.com/llvm/llvm-project/pull/231937


More information about the libc-commits mailing list