[flang-commits] [flang] [flang] Stop using Operation::getAttrs (NFC) (PR #223049)

via flang-commits flang-commits at lists.llvm.org
Fri Sep 11 13:56:57 PDT 2026


github-actions[bot] wrote:

<!--PREMERGE ADVISOR COMMENT: Linux-->
# :penguin: Linux x64 Test Results

The build failed before running any tests. Click on a failure below to see the details.

<details>
<summary>lib/Transforms/Vectorize/CMakeFiles/LLVMVectorize.dir/SLPVectorizer.cpp.o</summary>

```
FAILED: lib/Transforms/Vectorize/CMakeFiles/LLVMVectorize.dir/SLPVectorizer.cpp.o
sccache /opt/llvm/bin/clang++ -D_DEBUG -D_GLIBCXX_ASSERTIONS -D_GLIBCXX_USE_CXX11_ABI=1 -D_GNU_SOURCE -D_LIBCPP_HARDENING_MODE=_LIBCPP_HARDENING_MODE_EXTENSIVE -D__STDC_CONSTANT_MACROS -D__STDC_FORMAT_MACROS -D__STDC_LIMIT_MACROS -I/home/gha/actions-runner/_work/llvm-project/llvm-project/build/lib/Transforms/Vectorize -I/home/gha/actions-runner/_work/llvm-project/llvm-project/llvm/lib/Transforms/Vectorize -I/home/gha/actions-runner/_work/llvm-project/llvm-project/build/include -I/home/gha/actions-runner/_work/llvm-project/llvm-project/llvm/include -gmlt -fPIC -fno-semantic-interposition -fvisibility-inlines-hidden -Werror -Werror=date-time -Werror=unguarded-availability-new -Wall -Wextra -Wno-unused-parameter -Wwrite-strings -Wcast-qual -Wmissing-field-initializers -pedantic -Wno-long-long -Wc++98-compat-extra-semi -Wimplicit-fallthrough -Wcovered-switch-default -Wno-noexcept-type -Wnon-virtual-dtor -Wdelete-non-virtual-dtor -Wsuggest-override -Wstring-conversion -Wno-pass-failed -Wmisleading-indentation -Wctad-maybe-unsupported -fdiagnostics-color -ffunction-sections -fdata-sections -O3 -DNDEBUG -std=c++17 -UNDEBUG -fno-exceptions -funwind-tables -fno-rtti -MD -MT lib/Transforms/Vectorize/CMakeFiles/LLVMVectorize.dir/SLPVectorizer.cpp.o -MF lib/Transforms/Vectorize/CMakeFiles/LLVMVectorize.dir/SLPVectorizer.cpp.o.d -o lib/Transforms/Vectorize/CMakeFiles/LLVMVectorize.dir/SLPVectorizer.cpp.o -c /home/gha/actions-runner/_work/llvm-project/llvm-project/llvm/lib/Transforms/Vectorize/SLPVectorizer.cpp
/home/gha/actions-runner/_work/llvm-project/llvm-project/llvm/lib/Transforms/Vectorize/SLPVectorizer.cpp:33452:18: error: lambda capture 'Limit' is not required to be captured for this use [-Werror,-Wunused-lambda-capture]
33452 |       [this, &R, Limit](ArrayRef<Value *> Candidates, bool MaxVFOnly) {
|                  ^
/home/gha/actions-runner/_work/llvm-project/llvm-project/llvm/lib/Transforms/Vectorize/SLPVectorizer.cpp:33752:20: note: in instantiation of function template specialization 'llvm::SLPVectorizerPass::vectorizeNonVectorizableInsts<std::reverse_iterator<llvm::Instruction *const *>>' requested here
33752 |         Changed |= vectorizeNonVectorizableInsts(reverse(PostProcessInsts), BB,
|                    ^
/home/gha/actions-runner/_work/llvm-project/llvm-project/llvm/lib/Transforms/Vectorize/SLPVectorizer.cpp:33452:18: error: lambda capture 'Limit' is not required to be captured for this use [-Werror,-Wunused-lambda-capture]
33452 |       [this, &R, Limit](ArrayRef<Value *> Candidates, bool MaxVFOnly) {
|                  ^
/home/gha/actions-runner/_work/llvm-project/llvm-project/llvm/lib/Transforms/Vectorize/SLPVectorizer.cpp:33942:18: note: in instantiation of function template specialization 'llvm::SLPVectorizerPass::vectorizeNonVectorizableInsts<std::reverse_iterator<llvm::StoreInst *const *>>' requested here
33942 |       Changed |= vectorizeNonVectorizableInsts(reverse(PostProcessStores), BB,
|                  ^
2 errors generated.
```
</details>

If these failures are unrelated to your changes (for example tests are broken or flaky at HEAD), please open an issue at https://github.com/llvm/llvm-project/issues and add the `infrastructure` label.

https://github.com/llvm/llvm-project/pull/223049


More information about the flang-commits mailing list