[llvm-testresults] buildbot failure in lab.llvm.org on libcxx_clang-x86_64-darwin11-RA

llvmlab-buildmaster at lab.llvm.org llvmlab-buildmaster at lab.llvm.org
Thu Jun 26 21:18:34 PDT 2014


The Buildbot has detected a failed build on builder libcxx_clang-x86_64-darwin11-RA while building lab.llvm.org.
Full details are available at:
 http://lab.llvm.org:8013/builders/libcxx_clang-x86_64-darwin11-RA/builds/136

Buildbot URL: http://lab.llvm.org:8013/

Buildslave for this Build: xserve4

Build Reason: Triggerable(phase3-stage0)
Build Source Stamp: 211792
Blamelist: 

BUILD FAILED: failed test.libcxx.system

sincerely,
 -The Buildbot


================================================================================

CHANGES:


LOGS:
Last 15 lines of 'stdio':
	PASS: libc++ :: utilities/utility/pairs/pairs.spec/comparison.pass.cpp (4741 of 4745)
	PASS: libc++ :: utilities/utility/pairs/pairs.spec/make_pair.pass.cpp (4742 of 4745)
	PASS: libc++ :: utilities/utility/version.pass.cpp (4743 of 4745)
	PASS: libc++ :: utilities/utility/utility.swap/swap_array.pass.cpp (4744 of 4745)
	PASS: libc++ :: utilities/utility/utility.swap/swap.pass.cpp (4745 of 4745)
	Testing Time: 1578.70s
	********************
	Failing Tests (3):
	    libc++ :: numerics/rand/rand.device/ctor.pass.cpp
	    libc++ :: numerics/rand/rand.device/eval.pass.cpp
	    libc++ :: thread/thread.threads/thread.thread.this/sleep_for.pass.cpp
	
	  Expected Passes    : 4702
	  Expected Failures  : 40
	  Unexpected Failures: 3

Last 15 lines of 'libc++::ctor.pass.cpp':
	******************** TEST 'libc++ :: numerics/rand/rand.device/ctor.pass.cpp' FAILED ********************
	Compiled With: '/Users/buildslave/zorg/buildbot/smooshlab/slave-0.8/build.libcxx_clang-x86_64-darwin11-RA/host-compiler/bin/clang++' '-o' '/var/folders/_s/4_4ptjx54tq6cyfjg154ygbh0000gn/T/tmpOy6soXexe' '/Users/buildslave/zorg/buildbot/smooshlab/slave-0.8/build.libcxx_clang-x86_64-darwin11-RA/sources/test/numerics/rand/rand.device/ctor.pass.cpp' '-nostdinc++' '-std=c++0x' '-I/Users/buildslave/zorg/buildbot/smooshlab/slave-0.8/build.libcxx_clang-x86_64-darwin11-RA/sources/include' '-I/Users/buildslave/zorg/buildbot/smooshlab/slave-0.8/build.libcxx_clang-x86_64-darwin11-RA/sources/test/support' '-nodefaultlibs' '-L/Users/buildslave/zorg/buildbot/smooshlab/slave-0.8/build.libcxx_clang-x86_64-darwin11-RA/sources/lib' '-lc++' '-lc++abi' '-lSystem'
	Command: '/var/folders/_s/4_4ptjx54tq6cyfjg154ygbh0000gn/T/tmpOy6soXexe'
	Exit Code: -6
	
	
	Compiled test failed unexpectedly!
	********************

Last 15 lines of 'libc++::eval.pass.cpp':
	******************** TEST 'libc++ :: numerics/rand/rand.device/eval.pass.cpp' FAILED ********************
	Compiled With: '/Users/buildslave/zorg/buildbot/smooshlab/slave-0.8/build.libcxx_clang-x86_64-darwin11-RA/host-compiler/bin/clang++' '-o' '/var/folders/_s/4_4ptjx54tq6cyfjg154ygbh0000gn/T/tmpw_xZ08exe' '/Users/buildslave/zorg/buildbot/smooshlab/slave-0.8/build.libcxx_clang-x86_64-darwin11-RA/sources/test/numerics/rand/rand.device/eval.pass.cpp' '-nostdinc++' '-std=c++0x' '-I/Users/buildslave/zorg/buildbot/smooshlab/slave-0.8/build.libcxx_clang-x86_64-darwin11-RA/sources/include' '-I/Users/buildslave/zorg/buildbot/smooshlab/slave-0.8/build.libcxx_clang-x86_64-darwin11-RA/sources/test/support' '-nodefaultlibs' '-L/Users/buildslave/zorg/buildbot/smooshlab/slave-0.8/build.libcxx_clang-x86_64-darwin11-RA/sources/lib' '-lc++' '-lc++abi' '-lSystem'
	Command: '/var/folders/_s/4_4ptjx54tq6cyfjg154ygbh0000gn/T/tmpw_xZ08exe'
	Exit Code: -6
	Standard Error:
	--
	Assertion failed: (false), function main, file /Users/buildslave/zorg/buildbot/smooshlab/slave-0.8/build.libcxx_clang-x86_64-darwin11-RA/sources/test/numerics/rand/rand.device/eval.pass.cpp, line 30.
	--
	
	Compiled test failed unexpectedly!
	********************

Last 15 lines of 'libc++::sleep_for.pass.cpp':
	******************** TEST 'libc++ :: thread/thread.threads/thread.thread.this/sleep_for.pass.cpp' FAILED ********************
	Compiled With: '/Users/buildslave/zorg/buildbot/smooshlab/slave-0.8/build.libcxx_clang-x86_64-darwin11-RA/host-compiler/bin/clang++' '-o' '/var/folders/_s/4_4ptjx54tq6cyfjg154ygbh0000gn/T/tmpTnDhUsexe' '/Users/buildslave/zorg/buildbot/smooshlab/slave-0.8/build.libcxx_clang-x86_64-darwin11-RA/sources/test/thread/thread.threads/thread.thread.this/sleep_for.pass.cpp' '-nostdinc++' '-std=c++0x' '-I/Users/buildslave/zorg/buildbot/smooshlab/slave-0.8/build.libcxx_clang-x86_64-darwin11-RA/sources/include' '-I/Users/buildslave/zorg/buildbot/smooshlab/slave-0.8/build.libcxx_clang-x86_64-darwin11-RA/sources/test/support' '-nodefaultlibs' '-L/Users/buildslave/zorg/buildbot/smooshlab/slave-0.8/build.libcxx_clang-x86_64-darwin11-RA/sources/lib' '-lc++' '-lc++abi' '-lSystem'
	Command: '/var/folders/_s/4_4ptjx54tq6cyfjg154ygbh0000gn/T/tmpTnDhUsexe'
	Exit Code: -6
	Standard Error:
	--
	Assertion failed: (std::abs(ns.count()) < err.count()), function main, file /Users/buildslave/zorg/buildbot/smooshlab/slave-0.8/build.libcxx_clang-x86_64-darwin11-RA/sources/test/thread/thread.threads/thread.thread.this/sleep_for.pass.cpp, line 51.
	--
	
	Compiled test failed unexpectedly!
	********************







More information about the llvm-testresults mailing list